bind up tiny process lib and add test should also fix terminal warnings

10 jobs for python-refactor in 23 minutes and 4 seconds (queued for 1 second)
latest
Status Name Job ID Coverage
  Test
passed address-sanitizer #727523187

00:23:03

passed arch #727523181

00:12:57

passed debian #727523184

00:11:29

passed debian-testing #727523182

00:11:16

passed fedora #727523179

00:11:12

passed static-analysis #727523185

00:21:55

passed thread-safety-analysis #727523186

00:08:51

failed ubuntu #727523177

00:03:24

 
  Chore
skipped Clean appveyor cache #727523188
allowed to fail manual
 
  External
failed continuous-integration/appveyor/branch

 
Name Stage Failure
failed
ubuntu Test
                                         ^~~~~~~~~~~~~~~~~~
PyImport_AddModule
src/CMakeFiles/juci_shared.dir/build.make:350: recipe for target 'src/CMakeFiles/juci_shared.dir/plugins.cc.o' failed
make[2]: *** [src/CMakeFiles/juci_shared.dir/plugins.cc.o] Error 1
CMakeFiles/Makefile2:273: recipe for target 'src/CMakeFiles/juci_shared.dir/all' failed
make[1]: *** [src/CMakeFiles/juci_shared.dir/all] Error 2
Makefile:162: recipe for target 'all' failed
make: *** [all] Error 2
ERROR: Job failed: exit code 1