{
	"info": {
		"_postman_id": "68d53308-14e3-4714-8f7a-70b5f74005ab",
		"name": "Ped Tracker Commands Test Collection",
		"schema": "https://schema.getpostman.com/json/collection/v2.1.0/collection.json"
	},
	"item": [
		{
			"name": "Linkware-Push Location Report",
			"event": [
				{
					"listen": "prerequest",
					"script": {
						"id": "a59c9e78-74d5-4de8-98dd-e9791cf81d1c",
						"exec": [
							"let t1 = new Date();",
							"pm.globals.set(\"time1\", t1.toISOString());"
						],
						"type": "text/javascript"
					}
				}
			],
			"request": {
				"method": "POST",
				"header": [
					{
						"key": "Content-Type",
						"value": "application/json"
					},
					{
						"key": "{{APIKEY}}",
						"value": "{{FLEX_LOCATOR_APP_APIKEY}}",
						"disabled": true
					}
				],
				"body": {
					"mode": "raw",
					"raw": "{\r\n  \"mac\": \"D88B4C3403000200\",  \"appeui\": \"D88B4C3403000200\", \"last_update_time\": \"{{time1}}\",  \"data_type\": \"2\", \"data\": \"0180974a6d1ef1011c42b0347ba7bf2cfcecda84ce7a421491822faf40401491822175363f\", \"reserver\": {\"code\": 0}\r\n}\r\n\r\n"
				},
				"url": {
					"raw": "{{FLEX_LOCATOR_APP_URL}}/linkware/submit?x-api-key={{FLEX_LOCATOR_APP_APIKEY}}",
					"host": [
						"{{FLEX_LOCATOR_APP_URL}}"
					],
					"path": [
						"linkware",
						"submit"
					],
					"query": [
						{
							"key": "x-api-key",
							"value": "{{FLEX_LOCATOR_APP_APIKEY}}"
						}
					]
				}
			},
			"response": []
		},
		{
			"name": "Linkware-Push PedTracker Charging Status Msgs",
			"event": [
				{
					"listen": "prerequest",
					"script": {
						"id": "a59c9e78-74d5-4de8-98dd-e9791cf81d1c",
						"exec": [
							"let t1 = new Date();",
							"pm.globals.set(\"time1\", t1.toISOString());"
						],
						"type": "text/javascript"
					}
				}
			],
			"request": {
				"method": "POST",
				"header": [
					{
						"key": "Content-Type",
						"value": "application/json"
					},
					{
						"key": "x-api-key",
						"value": "{{FLEX_LOCATOR_APP_APIKEY}}"
					}
				],
				"body": {
					"mode": "raw",
					"raw": "{\r\n  \"mac\": \"D88B4C3403000200\",  \"appeui\": \"D88B4C3403000000\", \"last_update_time\": \"{{time1}}\",  \"data_type\": \"2\", \"data\": \"018066c706101d020602000e0000000206110000000000\", \"reserver\": {\"code\": 0}\r\n}\r\n\r\n"
				},
				"url": {
					"raw": "{{FLEX_LOCATOR_APP_URL}}/linkware/submit",
					"host": [
						"{{FLEX_LOCATOR_APP_URL}}"
					],
					"path": [
						"linkware",
						"submit"
					]
				}
			},
			"response": [
				{
					"id": "5b52c8d9-8bed-4ade-af84-508746fa7e5e",
					"name": "Linkware-Push PedTracker Charging Status Msgs",
					"originalRequest": {
						"method": "POST",
						"header": [
							{
								"key": "Content-Type",
								"value": "application/json"
							},
							{
								"key": "x-api-key",
								"value": "{{FLEX_LOCATOR_APP_APIKEY}}"
							}
						],
						"body": {
							"mode": "raw",
							"raw": "{\r\n  \"mac\": \"D88B4C3403000200\",  \"appeui\": \"D88B4C3403000000\", \"last_update_time\": \"{{time1}}\",  \"data_type\": \"2\", \"data\": \"018066c706101d020602000e0000000206110000000000\", \"reserver\": {\"code\": 0}\r\n}\r\n\r\n"
						},
						"url": {
							"raw": "{{FLEX_LOCATOR_APP_URL}}/linkware/submit",
							"host": [
								"{{FLEX_LOCATOR_APP_URL}}"
							],
							"path": [
								"linkware",
								"submit"
							]
						}
					},
					"status": "OK",
					"code": 200,
					"_postman_previewlanguage": "plain",
					"header": [
						{
							"key": "Access-Control-Allow-Origin",
							"value": "*"
						},
						{
							"key": "Content-Type",
							"value": "text/plain; charset=utf-8"
						},
						{
							"key": "Content-Length",
							"value": "2"
						},
						{
							"key": "ETag",
							"value": "W/\"2-nOO9QiTIwXgNtWtBJezz8kv3SLc\""
						},
						{
							"key": "Date",
							"value": "Sun, 29 Dec 2019 00:15:20 GMT"
						},
						{
							"key": "Connection",
							"value": "keep-alive"
						}
					],
					"cookie": [],
					"body": "OK"
				}
			]
		},
		{
			"name": "Linkware-Push PedTracker Status Msgs",
			"event": [
				{
					"listen": "prerequest",
					"script": {
						"id": "a59c9e78-74d5-4de8-98dd-e9791cf81d1c",
						"exec": [
							"let t1 = new Date();",
							"pm.globals.set(\"time1\", t1.toISOString());"
						],
						"type": "text/javascript"
					}
				}
			],
			"request": {
				"method": "POST",
				"header": [
					{
						"key": "Content-Type",
						"value": "application/json"
					},
					{
						"key": "x-api-key",
						"value": "{{FLEX_LOCATOR_APP_APIKEY}}"
					}
				],
				"body": {
					"mode": "raw",
					"raw": "{\r\n  \"mac\": \"D88B4C3403000200\",  \"appeui\": \"D88B4C3403000000\", \"last_update_time\": \"{{time1}}\",  \"data_type\": \"2\", \"data\": \"01807b3f07201b0206130008000000020602000e000000020611000000000002060d0111000000\", \"reserver\": {\"code\": 0}\r\n}\r\n\r\n"
				},
				"url": {
					"raw": "{{FLEX_LOCATOR_APP_URL}}/linkware/submit",
					"host": [
						"{{FLEX_LOCATOR_APP_URL}}"
					],
					"path": [
						"linkware",
						"submit"
					]
				}
			},
			"response": []
		},
		{
			"name": "Linkware-Push PedTracker Emergency Activated",
			"event": [
				{
					"listen": "prerequest",
					"script": {
						"id": "a59c9e78-74d5-4de8-98dd-e9791cf81d1c",
						"exec": [
							"let t1 = new Date();",
							"pm.globals.set(\"time1\", t1.toISOString());"
						],
						"type": "text/javascript"
					}
				}
			],
			"request": {
				"method": "POST",
				"header": [
					{
						"key": "Content-Type",
						"value": "application/json"
					},
					{
						"key": "x-api-key",
						"value": "{{FLEX_LOCATOR_APP_APIKEY}}"
					}
				],
				"body": {
					"mode": "raw",
					"raw": "{\r\n  \"mac\": \"D88B4C3403000200\",  \"appeui\": \"D88B4C3403000000\", \"last_update_time\": \"{{time1}}\",  \"data_type\": \"2\", \"data\": \"0180a3c6060809020606000b000000\", \"reserver\": {\"code\": 0}\r\n}\r\n\r\n"
				},
				"url": {
					"raw": "{{FLEX_LOCATOR_APP_URL}}/linkware/submit",
					"host": [
						"{{FLEX_LOCATOR_APP_URL}}"
					],
					"path": [
						"linkware",
						"submit"
					]
				}
			},
			"response": []
		},
		{
			"name": "Linkware-Push PedTracker Emergency Deactivated",
			"event": [
				{
					"listen": "prerequest",
					"script": {
						"id": "a59c9e78-74d5-4de8-98dd-e9791cf81d1c",
						"exec": [
							"let t1 = new Date();",
							"pm.globals.set(\"time1\", t1.toISOString());"
						],
						"type": "text/javascript"
					}
				}
			],
			"request": {
				"method": "POST",
				"header": [
					{
						"key": "Content-Type",
						"value": "application/json"
					},
					{
						"key": "x-api-key",
						"value": "{{FLEX_LOCATOR_APP_APIKEY}}"
					}
				],
				"body": {
					"mode": "raw",
					"raw": "{\r\n  \"mac\": \"D88B4C3403000200\",  \"appeui\": \"D88B4C3403000000\", \"last_update_time\": \"{{time1}}\",  \"data_type\": \"2\", \"data\": \"0180d5c80608120206060010000000\", \"reserver\": {\"code\": 0}\r\n}\r\n\r\n"
				},
				"url": {
					"raw": "{{FLEX_LOCATOR_APP_URL}}/linkware/submit",
					"host": [
						"{{FLEX_LOCATOR_APP_URL}}"
					],
					"path": [
						"linkware",
						"submit"
					]
				}
			},
			"response": []
		},
		{
			"name": "CP-Flex Decode Charging  Status Msgs",
			"event": [
				{
					"listen": "prerequest",
					"script": {
						"id": "3f5a4135-7540-4e4b-98a4-9027c445a900",
						"exec": [
							"let t1 = new Date();",
							"pm.globals.set(\"time1\", t1.toISOString());"
						],
						"type": "text/javascript"
					}
				}
			],
			"request": {
				"method": "POST",
				"header": [
					{
						"key": "{{APIKEY}}",
						"value": "{{KIATA_FLEX_SERVICES_APIKEY}}"
					},
					{
						"key": "Content-Type",
						"value": "application/json"
					}
				],
				"body": {
					"mode": "raw",
					"raw": "{\n\t\"confidence\":0.6826890110969543,\"etid\":\"PedTrackerChargingStatus\",\"devid\":\"D88B4C3403000200\",\"typeShape\":[31],\"upload\":[{\"dateTransport\":\"2019-12-29T00:43:28.649Z\",\"gateways\":[],\"payload\":\"AYBmxwYQHQIGAgAOAAAAAgYRAAAAAAA=\"}]\n}"
				},
				"url": {
					"raw": "{{FLEX_TRANSLATION_URL}}/decode",
					"host": [
						"{{FLEX_TRANSLATION_URL}}"
					],
					"path": [
						"decode"
					]
				},
				"description": "This postman demonstrates the response when base64 encoded payload data from PedTracker script is submitted to the CP-Flex decoding service.  In this case, charging status change messages are posted.  These are sent whenever the device is connected/disconnected to a charger."
			},
			"response": [
				{
					"id": "97373581-420b-49d0-a23e-4a9fef567415",
					"name": "CP-Flex Decode Charging  Status Msgs",
					"originalRequest": {
						"method": "POST",
						"header": [
							{
								"key": "{{APIKEY}}",
								"value": "{{KIATA_FLEX_SERVICES_APIKEY}}",
								"disabled": false
							},
							{
								"key": "Content-Type",
								"type": "text",
								"name": "Content-Type",
								"value": "application/json",
								"disabled": false
							}
						],
						"body": {
							"mode": "raw",
							"raw": "{\n\t\"confidence\":0.6826890110969543,\"etid\":\"locator_demo\",\"devid\":\"D88B4C3403000200\",\"typeShape\":[31],\"upload\":[{\"dateTransport\":\"2019-12-29T00:43:28.649Z\",\"gateways\":[],\"payload\":\"AYBmxwYQHQIGAgAOAAAAAgYRAAAAAAA=\"}]\n}"
						},
						"url": {
							"raw": "{{FLEX_TRANSLATION_URL}}/decode",
							"host": [
								"{{FLEX_TRANSLATION_URL}}"
							],
							"path": [
								"decode"
							]
						}
					},
					"status": "OK",
					"code": 200,
					"_postman_previewlanguage": "json",
					"header": [
						{
							"key": "content-length",
							"value": "341",
							"name": "content-length",
							"description": "The length of the response body in octets (8-bit bytes)"
						},
						{
							"key": "content-type",
							"value": "application/json",
							"name": "content-type",
							"description": "The mime type of this content"
						}
					],
					"cookie": [],
					"body": "{\"devid\":\"D88B4C3403000200\",\"download\":[],\"etid\":\"locator_demo\",\"messages\":[{\"msgtype\":\"Int32Msg\",\"nid\":\"Ped.Cmds.Battery\",\"sent\":\"2019-12-28T03:09:26.000000Z\",\"svals\":[\"Ped.Cmds.Battery.Critical\"],\"vals\":[14]},{\"msgtype\":\"Int32Msg\",\"nid\":\"Ped.Cmds.BatteryLevel\",\"sent\":\"2019-12-28T03:09:26.000000Z\",\"svals\":[\"\"],\"vals\":[0]}],\"resultcode\":1}"
				}
			]
		},
		{
			"name": "CP-Flex Decode  Status Msgs",
			"event": [
				{
					"listen": "prerequest",
					"script": {
						"id": "3f5a4135-7540-4e4b-98a4-9027c445a900",
						"exec": [
							"let t1 = new Date();",
							"pm.globals.set(\"time1\", t1.toISOString());"
						],
						"type": "text/javascript"
					}
				}
			],
			"request": {
				"method": "POST",
				"header": [
					{
						"key": "{{APIKEY}}",
						"value": "{{KIATA_FLEX_SERVICES_APIKEY}}"
					},
					{
						"key": "Content-Type",
						"value": "application/json"
					}
				],
				"body": {
					"mode": "raw",
					"raw": "\n{ \n\t\"confidence\":0.6826890110969543,\n\t\"etid\":\"PedTrackerDecodeStatus\",\"devid\":\"D88B4C3403000200\",\n\t\"typeShape\":[31],\n\t\"upload\":\n\t[\n\t\t{\"dateTransport\":\"{{time1}}\",\"gateways\":[],\"payload\":\"AYB7PwcgGwIGEwAIAAAAAgYCAA4AAAACBhEAAAAAAAIGDQERAAAA\"}\n\t]\n}"
				},
				"url": {
					"raw": "{{FLEX_TRANSLATION_URL}}/decode",
					"host": [
						"{{FLEX_TRANSLATION_URL}}"
					],
					"path": [
						"decode"
					]
				},
				"description": "This postman demonstrates the response when base64 encoded payload data from PedTracker script is submitted to the CP-Flex decoding service.  This set of messages are sent whenever the user double clicks button #1."
			},
			"response": [
				{
					"id": "a2f1a2c6-6e90-4439-adb6-3a494971dba8",
					"name": "CP-Flex Decode  Status Msgs",
					"originalRequest": {
						"method": "POST",
						"header": [
							{
								"key": "{{APIKEY}}",
								"value": "{{KIATA_FLEX_SERVICES_APIKEY}}",
								"disabled": false
							},
							{
								"key": "Content-Type",
								"value": "application/json",
								"disabled": false
							}
						],
						"body": {
							"mode": "raw",
							"raw": "\n{ \n\t\"confidence\":0.6826890110969543,\n\t\"etid\":\"PedTrackerDecodeStatus\",\"devid\":\"D88B4C3403000200\",\n\t\"typeShape\":[31],\n\t\"upload\":\n\t[\n\t\t{\"dateTransport\":\"{{time1}}\",\"gateways\":[],\"payload\":\"AYB7PwcgGwIGEwAIAAAAAgYCAA4AAAACBhEAAAAAAAIGDQERAAAA\"}\n\t]\n}"
						},
						"url": {
							"raw": "{{FLEX_TRANSLATION_URL}}/decode",
							"host": [
								"{{FLEX_TRANSLATION_URL}}"
							],
							"path": [
								"decode"
							]
						}
					},
					"status": "OK",
					"code": 200,
					"_postman_previewlanguage": "json",
					"header": [
						{
							"key": "content-length",
							"value": "924",
							"name": "content-length",
							"description": "The length of the response body in octets (8-bit bytes)"
						},
						{
							"key": "content-type",
							"value": "application/json",
							"name": "content-type",
							"description": "The mime type of this content"
						}
					],
					"cookie": [],
					"body": "{\"devid\":\"D88B4C3403000200\",\"download\":[],\"etid\":\"PedTrackerDecodeStatus\",\"messages\":[{\"msgtype\":\"Int32Msg\",\"nid\":\"Ped.Cmds.Tracking\",\"sent\":\"2019-12-28T11:41:47.000000Z\",\"svals\":[\"Ped.Cmds.Tracking.Disabled\"],\"vals\":[8]},{\"msgtype\":\"Int32Msg\",\"nid\":\"Ped.Cmds.Battery\",\"sent\":\"2019-12-28T11:41:47.000000Z\",\"svals\":[\"Ped.Cmds.Battery.Critical\"],\"vals\":[14]},{\"msgtype\":\"Int32Msg\",\"nid\":\"Ped.Cmds.BatteryLevel\",\"sent\":\"2019-12-28T11:41:47.000000Z\",\"svals\":[\"\"],\"vals\":[0]},{\"msgtype\":\"Int32Msg\",\"nid\":\"Ped.Cmds.Temperature\",\"priority\":\"critical\",\"sent\":\"2019-12-28T11:41:47.000000Z\",\"svals\":[\"Ped.Cmds.BatteryLevel\"],\"vals\":[17]},{\"epoch\":\"2019-09-02T17:00:07.000000Z\",\"location\":{\"confidence\":0.6826890110969543,\"floor\":0,\"shape\":{\"alt\":0.0,\"lat\":47.69718,\"lon\":-122.17331,\"radius\":29.0,\"type\":31,\"vert\":100.0},\"veracity\":-1.0},\"msgtype\":\"LocationReport\",\"sent\":\"1980-01-06T00:00:00.000000Z\",\"updated\":false}],\"resultcode\":1}"
				}
			]
		},
		{
			"name": "CP-Flex Decode  Emergency Activated",
			"event": [
				{
					"listen": "prerequest",
					"script": {
						"id": "3f5a4135-7540-4e4b-98a4-9027c445a900",
						"exec": [
							"let t1 = new Date();",
							"pm.globals.set(\"time1\", t1.toISOString());"
						],
						"type": "text/javascript"
					}
				}
			],
			"request": {
				"method": "POST",
				"header": [
					{
						"key": "{{APIKEY}}",
						"value": "{{KIATA_FLEX_SERVICES_APIKEY}}"
					},
					{
						"key": "Content-Type",
						"value": "application/json"
					}
				],
				"body": {
					"mode": "raw",
					"raw": "{\n\t\"confidence\":0.6826890110969543,\"etid\":\"PedTrackerEmergencyActivated\",\"devid\":\"D88B4C3403000200\",\"typeShape\":[31],\"upload\":[{\"dateTransport\":\"{{time1}}\",\"gateways\":[],\"payload\":\"AYCjxgYICQIGBgALAAAA\"}]\n}"
				},
				"url": {
					"raw": "{{FLEX_TRANSLATION_URL}}/decode",
					"host": [
						"{{FLEX_TRANSLATION_URL}}"
					],
					"path": [
						"decode"
					]
				},
				"description": "This postman demonstrates the response when base64 encoded payload data from PedTracker script is submitted to the CP-Flex decoding service.  This message is sent whenever the emergency mode is activated."
			},
			"response": [
				{
					"id": "acc235df-6aa5-4d38-8de4-8b4dd29e4511",
					"name": "CP-Flex Decode  Emergency Activated",
					"originalRequest": {
						"method": "POST",
						"header": [
							{
								"key": "{{APIKEY}}",
								"value": "{{KIATA_FLEX_SERVICES_APIKEY}}"
							},
							{
								"key": "Content-Type",
								"value": "application/json"
							}
						],
						"body": {
							"mode": "raw",
							"raw": "{\n\t\"confidence\":0.6826890110969543,\"etid\":\"locator_demo\",\"devid\":\"D88B4C3403000200\",\"typeShape\":[31],\"upload\":[{\"dateTransport\":\"{{time1}}\",\"gateways\":[],\"payload\":\"AYCjxgYICQIGBgALAAAA\"}]\n}"
						},
						"url": {
							"raw": "{{FLEX_TRANSLATION_URL}}/decode",
							"host": [
								"{{FLEX_TRANSLATION_URL}}"
							],
							"path": [
								"decode"
							]
						}
					},
					"status": "OK",
					"code": 200,
					"_postman_previewlanguage": "json",
					"header": [
						{
							"key": "content-length",
							"value": "229",
							"name": "content-length",
							"description": "The length of the response body in octets (8-bit bytes)"
						},
						{
							"key": "content-type",
							"value": "application/json",
							"name": "content-type",
							"description": "The mime type of this content"
						}
					],
					"cookie": [],
					"body": "{\"devid\":\"D88B4C3403000200\",\"download\":[],\"etid\":\"locator_demo\",\"messages\":[{\"msgtype\":\"Int32Msg\",\"nid\":\"Ped.Cmds.Emergency\",\"sent\":\"2019-12-28T03:06:11.000000Z\",\"svals\":[\"Ped.Cmds.Emergency.Enable\"],\"vals\":[11]}],\"resultcode\":1}"
				}
			]
		},
		{
			"name": "CP-Flex Decode  Emergency Deactivated",
			"event": [
				{
					"listen": "prerequest",
					"script": {
						"id": "3f5a4135-7540-4e4b-98a4-9027c445a900",
						"exec": [
							"let t1 = new Date();",
							"pm.globals.set(\"time1\", t1.toISOString());"
						],
						"type": "text/javascript"
					}
				}
			],
			"request": {
				"method": "POST",
				"header": [
					{
						"key": "{{APIKEY}}",
						"value": "{{KIATA_FLEX_SERVICES_APIKEY}}"
					},
					{
						"key": "Content-Type",
						"value": "application/json"
					}
				],
				"body": {
					"mode": "raw",
					"raw": "{\"confidence\":0.6826890110969543,\"etid\":\"PedTrackerEmergencyDisabled\",\"devid\":\"D88B4C3403000200\",\"typeShape\":[31],\"upload\":[{\"dateTransport\":\"{{time1}}\",\"gateways\":[],\"payload\":\"AYDVyAYIEgIGBgAQAAAA\"}]}"
				},
				"url": {
					"raw": "{{FLEX_TRANSLATION_URL}}/decode",
					"host": [
						"{{FLEX_TRANSLATION_URL}}"
					],
					"path": [
						"decode"
					]
				},
				"description": "This postman demonstrates the response when base64 encoded payload data from PedTracker script is submitted to the CP-Flex decoding service.  This message is sent whenever the emergency mode is deactivated."
			},
			"response": [
				{
					"id": "549460ef-114e-43f9-9844-6885411a7aa1",
					"name": "CP-Flex Decode  Emergency Deactivated",
					"originalRequest": {
						"method": "POST",
						"header": [
							{
								"key": "{{APIKEY}}",
								"value": "{{KIATA_FLEX_SERVICES_APIKEY}}",
								"disabled": false
							},
							{
								"key": "Content-Type",
								"value": "application/json",
								"disabled": false
							}
						],
						"body": {
							"mode": "raw",
							"raw": "{\"confidence\":0.6826890110969543,\"etid\":\"PedTrackerEmergencyDisabled\",\"devid\":\"D88B4C3403000200\",\"typeShape\":[31],\"upload\":[{\"dateTransport\":\"{{time1}}\",\"gateways\":[],\"payload\":\"AYDVyAYIEgIGBgAQAAAA\"}]}"
						},
						"url": {
							"raw": "{{FLEX_TRANSLATION_URL}}/decode",
							"host": [
								"{{FLEX_TRANSLATION_URL}}"
							],
							"path": [
								"decode"
							]
						}
					},
					"status": "OK",
					"code": 200,
					"_postman_previewlanguage": "json",
					"header": [
						{
							"key": "content-length",
							"value": "245",
							"name": "content-length",
							"description": "The length of the response body in octets (8-bit bytes)"
						},
						{
							"key": "content-type",
							"value": "application/json",
							"name": "content-type",
							"description": "The mime type of this content"
						}
					],
					"cookie": [],
					"body": "{\"devid\":\"D88B4C3403000200\",\"download\":[],\"etid\":\"PedTrackerEmergencyDisabled\",\"messages\":[{\"msgtype\":\"Int32Msg\",\"nid\":\"Ped.Cmds.Emergency\",\"sent\":\"2019-12-28T03:15:33.000000Z\",\"svals\":[\"Ped.Cmds.Emergency.Disable\"],\"vals\":[16]}],\"resultcode\":1}"
				}
			]
		},
		{
			"name": "CP-Flex Encode Configuration Request",
			"event": [
				{
					"listen": "prerequest",
					"script": {
						"id": "3f5a4135-7540-4e4b-98a4-9027c445a900",
						"exec": [
							"let t1 = new Date();",
							"pm.globals.set(\"time1\", t1.toISOString());"
						],
						"type": "text/javascript"
					}
				}
			],
			"request": {
				"method": "POST",
				"header": [
					{
						"key": "{{APIKEY}}",
						"value": "{{KIATA_FLEX_SERVICES_APIKEY}}"
					},
					{
						"key": "Content-Type",
						"value": "application/json"
					}
				],
				"body": {
					"mode": "raw",
					"raw": "{\n    \"devid\": \"D88B4C3403000200\",\n    \"etid\": \"ped_tracker_request_configuration\",\n    \"messages\": [\n        {\n            \"msgtype\": \"Int32Msg\",\n            \"nid\": \"Ped.Cmds.Config\",\n            \"sent\": \"{{time1}}\"\n        }\n    ]\n}"
				},
				"url": {
					"raw": "{{FLEX_TRANSLATION_URL}}/encode",
					"host": [
						"{{FLEX_TRANSLATION_URL}}"
					],
					"path": [
						"encode"
					]
				}
			},
			"response": [
				{
					"id": "fda3298f-da1a-4188-a1d3-b95f459e72c0",
					"name": "CP-Flex Encode Configuration Request",
					"originalRequest": {
						"method": "POST",
						"header": [
							{
								"key": "{{APIKEY}}",
								"value": "{{KIATA_FLEX_SERVICES_APIKEY}}"
							},
							{
								"key": "Content-Type",
								"value": "application/json"
							}
						],
						"body": {
							"mode": "raw",
							"raw": "{\n    \"devid\": \"D88B4C3403000200\",\n    \"etid\": \"ped_tracker_request_configuration\",\n    \"messages\": [\n        {\n            \"msgtype\": \"Int32Msg\",\n            \"nid\": \"Ped.Cmds.Config\",\n            \"sent\": \"{{time1}}\"\n        }\n    ]\n}"
						},
						"url": {
							"raw": "{{FLEX_TRANSLATION_URL}}/encode",
							"host": [
								"{{FLEX_TRANSLATION_URL}}"
							],
							"path": [
								"encode"
							]
						}
					},
					"status": "OK",
					"code": 200,
					"_postman_previewlanguage": "json",
					"header": [
						{
							"key": "content-type",
							"value": "application/json"
						},
						{
							"key": "content-length",
							"value": "197"
						}
					],
					"cookie": [],
					"body": "{\n    \"devid\": \"D88B4C3403000200\",\n    \"download\": [\n        {\n            \"dateTransport\": \"2019-12-29T00:21:37.493438737Z\",\n            \"gateways\": [],\n            \"payload\": \"AYGR8QcH/QIFBQD///8=\"\n        }\n    ],\n    \"etid\": \"ped_tracker_request_configuration\",\n    \"resultcode\": 1\n}"
				}
			]
		},
		{
			"name": "CP-Flex Encode Battery Status Request",
			"event": [
				{
					"listen": "prerequest",
					"script": {
						"id": "3f5a4135-7540-4e4b-98a4-9027c445a900",
						"exec": [
							"let t1 = new Date();",
							"pm.globals.set(\"time1\", t1.toISOString());"
						],
						"type": "text/javascript"
					}
				}
			],
			"request": {
				"method": "POST",
				"header": [
					{
						"key": "{{APIKEY}}",
						"value": "{{KIATA_FLEX_SERVICES_APIKEY}}"
					},
					{
						"key": "Content-Type",
						"value": "application/json"
					}
				],
				"body": {
					"mode": "raw",
					"raw": "{\n    \"devid\": \"D88B4C3403000200\",\n    \"etid\": \"ped_tracker_request_battery_status\",\n    \"messages\": [\n        {\n            \"msgtype\": \"Int32Msg\",\n            \"nid\": \"Ped.Cmds.Battery\",\n            \"sent\": \"{{time1}}\"\n        },\n        {\n            \"msgtype\": \"Int32Msg\",\n            \"nid\": \"Ped.Cmds.BatteryLevel\",\n            \"sent\": \"{{time1}}\"\n        }\n    ]\n}"
				},
				"url": {
					"raw": "{{FLEX_TRANSLATION_URL}}/encode",
					"host": [
						"{{FLEX_TRANSLATION_URL}}"
					],
					"path": [
						"encode"
					]
				}
			},
			"response": [
				{
					"id": "5a1dc5b2-d68e-487f-b344-06a17fcb88a0",
					"name": "CP-Flex Encode Battery Status Request",
					"originalRequest": {
						"method": "POST",
						"header": [
							{
								"key": "{{APIKEY}}",
								"value": "{{KIATA_FLEX_SERVICES_APIKEY}}"
							},
							{
								"key": "Content-Type",
								"value": "application/json"
							}
						],
						"body": {
							"mode": "raw",
							"raw": "{\n    \"devid\": \"D88B4C3403000200\",\n    \"etid\": \"ped_tracker_request_battery_status\",\n    \"messages\": [\n        {\n            \"msgtype\": \"Int32Msg\",\n            \"nid\": \"Ped.Cmds.Battery\",\n            \"sent\": \"{{time1}}\"\n        },\n        {\n            \"msgtype\": \"Int32Msg\",\n            \"nid\": \"Ped.Cmds.BatteryLevel\",\n            \"sent\": \"{{time1}}\"\n        }\n    ]\n}"
						},
						"url": {
							"raw": "{{FLEX_TRANSLATION_URL}}/encode",
							"host": [
								"{{FLEX_TRANSLATION_URL}}"
							],
							"path": [
								"encode"
							]
						}
					},
					"status": "OK",
					"code": 200,
					"_postman_previewlanguage": "json",
					"header": [
						{
							"key": "content-type",
							"value": "application/json"
						},
						{
							"key": "content-length",
							"value": "206"
						}
					],
					"cookie": [],
					"body": "{\n    \"devid\": \"D88B4C3403000200\",\n    \"download\": [\n        {\n            \"dateTransport\": \"2019-12-29T00:21:50.705753860Z\",\n            \"gateways\": [],\n            \"payload\": \"AYGe8QcOEwIFAgD///8CBREA////\"\n        }\n    ],\n    \"etid\": \"ped_tracker_request_battery_status\",\n    \"resultcode\": 1\n}"
				}
			]
		},
		{
			"name": "CP-Flex Encode Temperature Request",
			"event": [
				{
					"listen": "prerequest",
					"script": {
						"id": "3f5a4135-7540-4e4b-98a4-9027c445a900",
						"exec": [
							"let t1 = new Date();",
							"pm.globals.set(\"time1\", t1.toISOString());"
						],
						"type": "text/javascript"
					}
				}
			],
			"request": {
				"method": "POST",
				"header": [
					{
						"key": "{{APIKEY}}",
						"value": "{{KIATA_FLEX_SERVICES_APIKEY}}"
					},
					{
						"key": "Content-Type",
						"value": "application/json"
					}
				],
				"body": {
					"mode": "raw",
					"raw": "{\n    \"devid\": \"D88B4C3403000200\",\n    \"etid\": \"ped_tracker_request_temperature\",\n    \"messages\": [\n        {\n            \"msgtype\": \"Int32Msg\",\n            \"nid\": \"Ped.Cmds.Temperature\",\n            \"sent\": \"{{time1}}\"\n        }\n    ]\n}"
				},
				"url": {
					"raw": "{{FLEX_TRANSLATION_URL}}/encode",
					"host": [
						"{{FLEX_TRANSLATION_URL}}"
					],
					"path": [
						"encode"
					]
				}
			},
			"response": [
				{
					"id": "d69e2f56-0e6d-4e9f-81d7-56db7e5a3397",
					"name": "CP-Flex Temperature Request",
					"originalRequest": {
						"method": "POST",
						"header": [
							{
								"key": "{{APIKEY}}",
								"value": "{{KIATA_FLEX_SERVICES_APIKEY}}"
							},
							{
								"key": "Content-Type",
								"value": "application/json"
							}
						],
						"body": {
							"mode": "raw",
							"raw": "{\n    \"devid\": \"D88B4C3403000200\",\n    \"etid\": \"ped_tracker_request_temperature\",\n    \"messages\": [\n        {\n            \"msgtype\": \"Int32Msg\",\n            \"nid\": \"Ped.Cmds.Temperature\",\n            \"sent\": \"{{time1}}\"\n        }\n    ]\n}"
						},
						"url": {
							"raw": "{{FLEX_TRANSLATION_URL}}/encode",
							"host": [
								"{{FLEX_TRANSLATION_URL}}"
							],
							"path": [
								"encode"
							]
						}
					},
					"status": "OK",
					"code": 200,
					"_postman_previewlanguage": "json",
					"header": [
						{
							"key": "content-type",
							"value": "application/json"
						},
						{
							"key": "content-length",
							"value": "195"
						}
					],
					"cookie": [],
					"body": "{\n    \"devid\": \"D88B4C3403000200\",\n    \"download\": [\n        {\n            \"dateTransport\": \"2019-12-29T00:21:24.245777640Z\",\n            \"gateways\": [],\n            \"payload\": \"AYGE8QcH9QIFDQD///8=\"\n        }\n    ],\n    \"etid\": \"ped_tracker_request_temperature\",\n    \"resultcode\": 1\n}"
				}
			]
		},
		{
			"name": "CP-Flex Encode Activate Emergency Request",
			"event": [
				{
					"listen": "prerequest",
					"script": {
						"id": "3f5a4135-7540-4e4b-98a4-9027c445a900",
						"exec": [
							"let t1 = new Date();",
							"pm.globals.set(\"time1\", t1.toISOString());"
						],
						"type": "text/javascript"
					}
				}
			],
			"request": {
				"method": "POST",
				"header": [
					{
						"key": "{{APIKEY}}",
						"value": "{{KIATA_FLEX_SERVICES_APIKEY}}"
					},
					{
						"key": "Content-Type",
						"value": "application/json"
					}
				],
				"body": {
					"mode": "raw",
					"raw": "{\n    \"devid\": \"D88B4C3403000200\",\n    \"etid\": \"ped_tracker_activate_emergency\",\n    \"messages\": [\n        {\n            \"msgtype\": \"Int32Msg\",\n            \"nid\": \"Ped.Cmds.Emergency\",\n            \"sent\": \"{{time1}}\",\n            \"svals\": [\"Ped.Cmds.Emergency.Enable\" ]\n        }\n    ]\n}"
				},
				"url": {
					"raw": "{{FLEX_TRANSLATION_URL}}/encode",
					"host": [
						"{{FLEX_TRANSLATION_URL}}"
					],
					"path": [
						"encode"
					]
				}
			},
			"response": [
				{
					"id": "cd40a3c6-12f5-4d2a-ae5c-d50d64d8b1f9",
					"name": "CP-Flex Activate Emergency Request",
					"originalRequest": {
						"method": "POST",
						"header": [
							{
								"key": "{{APIKEY}}",
								"value": "{{KIATA_FLEX_SERVICES_APIKEY}}"
							},
							{
								"key": "Content-Type",
								"value": "application/json"
							}
						],
						"body": {
							"mode": "raw",
							"raw": "{\n    \"devid\": \"D88B4C3403000200\",\n    \"etid\": \"ped_tracker_activate_emergency\",\n    \"messages\": [\n        {\n            \"msgtype\": \"Int32Msg\",\n            \"nid\": \"Ped.Cmds.Emergency\",\n            \"sent\": \"{{time1}}\",\n            \"svals\": [\"Ped.Cmds.Emergency.Enable\" ]\n        }\n    ]\n}"
						},
						"url": {
							"raw": "{{FLEX_TRANSLATION_URL}}/encode",
							"host": [
								"{{FLEX_TRANSLATION_URL}}"
							],
							"path": [
								"encode"
							]
						}
					},
					"status": "OK",
					"code": 200,
					"_postman_previewlanguage": "json",
					"header": [
						{
							"key": "content-type",
							"value": "application/json"
						},
						{
							"key": "content-length",
							"value": "194"
						}
					],
					"cookie": [],
					"body": "{\n    \"devid\": \"D88B4C3403000200\",\n    \"download\": [\n        {\n            \"dateTransport\": \"2019-12-29T00:20:42.980319343Z\",\n            \"gateways\": [],\n            \"payload\": \"AYFa8QcHCgIFBgALAAA=\"\n        }\n    ],\n    \"etid\": \"ped_tracker_activate_emergency\",\n    \"resultcode\": 1\n}"
				}
			]
		},
		{
			"name": "CP-Flex Encode Deactivate Emergency Request",
			"event": [
				{
					"listen": "prerequest",
					"script": {
						"id": "3f5a4135-7540-4e4b-98a4-9027c445a900",
						"exec": [
							"let t1 = new Date();",
							"pm.globals.set(\"time1\", t1.toISOString());"
						],
						"type": "text/javascript"
					}
				}
			],
			"request": {
				"method": "POST",
				"header": [
					{
						"key": "{{APIKEY}}",
						"value": "{{KIATA_FLEX_SERVICES_APIKEY}}"
					},
					{
						"key": "Content-Type",
						"value": "application/json"
					}
				],
				"body": {
					"mode": "raw",
					"raw": "{\n    \"devid\": \"D88B4C3403000200\",\n    \"etid\": \"ped_tracker_deactivate_emergency\",\n    \"messages\": [\n        {\n            \"msgtype\": \"Int32Msg\",\n            \"nid\": \"Ped.Cmds.Emergency\",\n            \"sent\": \"{{time1}}\",\n            \"svals\": [\"Ped.Cmds.Emergency.Disable\" ]\n        }\n    ]\n}"
				},
				"url": {
					"raw": "{{FLEX_TRANSLATION_URL}}/encode",
					"host": [
						"{{FLEX_TRANSLATION_URL}}"
					],
					"path": [
						"encode"
					]
				}
			},
			"response": [
				{
					"id": "119715fa-541c-4492-8b25-d055cefae43d",
					"name": "Request Deactivate Emergency",
					"originalRequest": {
						"method": "POST",
						"header": [
							{
								"key": "{{APIKEY}}",
								"value": "{{KIATA_FLEX_SERVICES_APIKEY}}"
							},
							{
								"key": "Content-Type",
								"value": "application/json"
							}
						],
						"body": {
							"mode": "raw",
							"raw": "{\n    \"devid\": \"D88B4C3403000200\",\n    \"etid\": \"ped_tracker_deactivate_emergency\",\n    \"messages\": [\n        {\n            \"msgtype\": \"Int32Msg\",\n            \"nid\": \"Ped.Cmds.Emergency\",\n            \"sent\": \"{{time1}}\",\n            \"svals\": [\"Ped.Cmds.Emergency.Disable\" ]\n        }\n    ]\n}"
						},
						"url": {
							"raw": "{{FLEX_TRANSLATION_URL}}/encode",
							"host": [
								"{{FLEX_TRANSLATION_URL}}"
							],
							"path": [
								"encode"
							]
						}
					},
					"status": "OK",
					"code": 200,
					"_postman_previewlanguage": "json",
					"header": [
						{
							"key": "content-type",
							"value": "application/json"
						},
						{
							"key": "content-length",
							"value": "196"
						}
					],
					"cookie": [],
					"body": "{\n    \"devid\": \"D88B4C3403000200\",\n    \"download\": [\n        {\n            \"dateTransport\": \"2019-12-28T23:54:19.124198275Z\",\n            \"gateways\": [],\n            \"payload\": \"AYEr6wcHEQIFBgAQAAA=\"\n        }\n    ],\n    \"etid\": \"ped_tracker_deactivate_emergency\",\n    \"resultcode\": 1\n}"
				}
			]
		}
	]
}