{
  "attributes": {
    "tagtype": "flexapp"
  },
  "references": ["//hub.cpflex.tech/firmware/nali/n100/bundle:v2.5.3.1a"],
  "constraints": [
    "device-type:/device-type/nali/n100/v1:rev3",
    "device-type:/device-type/nali/n100/v1:rev4",
    "device-type:/device-type/nali/n100/v2:rev3",
    "class:/classes/cpflex/application:v1",
    "appapi:/nali/interfaces/ped_tracker_api:v1.5.0"
  ],
  "description": "References firmware v2.5.3.1a and platform version v1.4.0.2",
  "state": 0
}
