{
  "nid": "OdsQosTool",
  "uuid": "a41b1854-33fb-4679-b0a5-5eacc10f530a",
  "copyright": "Copyright 2023 - Codepoint Technologies, Inc. All Rights Reserved.",
  "description": "Protocol schema definition for the ODS QoS Sampling Tool",
  "title": "ODS QoS Sampling Tool Protocol Schema",
  "version": {
    "major": 1,
    "minor": 0,
    "maintenance": 0,
    "revision": 0,
    "dateModified": "2024-12-07T00:00:00.000Z"
  },
  "authors": "M.B. Mathews",
  "productid": "CT100X",
  "productFamily": "Cora Tracking",
  "manufacturer": "Codepoint Technologies, Inc.",
  "imports": [
    "schema/system.ocm.json",
    "schema/power.ocm.json",
    "schema/location.ocm.json",
    "schema/tracking.ocm.json"
  ],
  "namespaces": [
    {
      "nid": "QoS",
      "elements": [
        {
          "etype": "Object",
          "nid": "Event",
          "description": "QoS supported event messages.",
          "members": [
            {
              "etype": "Int32Msg",
              "nid": "LatencyCheck",
              "description": "Event signaled when Button #1 is pressed."
            }
          ]
        }
      ]
    }
  ]
}
