{
  "attributes": {
    "tagtype": "flexapp"
  },

  "references": ["//hub.cpflex.tech/firmware/nali/n100/bundle:v2.5.0.0a"],
  "constraints": [
    "device-type:/device-type/nali/n100/v1:rev3",
    "device-type:/device-type/nali/n100/v1:rev4",
    "device-type:/device-type/nali/n100/v2:rev3",
    "class:/classes/cpflex/application:v1",
    "appapi:/cora/interfaces/ocmv1/ods-personnel-tracker:v1.0.0.0"
  ],
  "description": "References firmware v2.5.0.0a and platform version v1.4.5.1"
}
