/**
*  Name:  ConfigApp.i
*
*  This module is the proprietary property of Codepoint Technologies, Inc.
*  Copyright (C) 2023 Codepoint Technologies, Inc.
*  All Rights Reserved
*
* Description:
*  Configuration constants for network link Checks.
**/


