{
  "nid": "Biceek",
  "uuid": "8d9c9b19-feb0-49c2-bc21-77e931ba7da1",
  "copyright": "Copyright 2023 - Codepoint Technologies, Inc. All Rights Reserved.",
  "description": "Protocol schema definition for the Biceek bicycle tracker application.",
  "title": "Biceek Application Protocol",
  "version": {
    "major": 1,
    "minor": 0,
    "dateModified": "2021-08-10T11:00:00.000Z",
    "maintenance": 0,
    "revision": 0
  },
  "authors": "M.B. Mathews",
  "productid": "CT10XX",
  "productFamily": "Cora Tracking",
  "manufacturer": "Codepoint Technologies, Inc.",
  "imports": [
    "schema/system.ocm.json",
    "schema/power.ocm.json",
    "schema/location.ocm.json",
    "schema/tracking.ocm.json"
  ],

  "namespaces": [
    {
      "nid": "App",
      "elements": [
        {
          "nid": "Opmode",
          "etype": "Int32Msg",
          "description": "Application operating mode.",
          "values": [
            {
              "nid": "Normal",
              "description": "Application is operating in normal operating mode."
            },
            {
              "nid": "Recovery",
              "description": "Application is operating in recovery mode."
            }
          ]
        },
        {
          "nid": "Motion",
          "etype": "Int32Msg",
          "description": "Motion Indicator Event.",
          "values": [
            {
              "nid": "Moving",
              "description": "Device is moving."
            },
            {
              "nid": "Stopped",
              "description": "Device is stopped / not moving."
            }
          ]
        }
      ]
    }
  ]
}
