{
  "title": "Location Function Standard Protocol Schema",
  "copyright": "Copyright 2023 - Codepoint Technologies, Inc. All Rights Reserved.",
  "uuid": "114e4623-2be9-45e0-9e72-f356e01d1691",
  "version": {
    "major": 1,
    "minor": 0,
    "maintenance": 0,
    "revision": 0,
    "dateModified": "2023-04-25T12:00:00.000Z"
  },
  "authors": "M.B. Mathews",
  "namespaces": [
    {
      "nid": "Loc",
      "description": "Location services related functions.",
      "elements": [
        {
          "nid": "Config",
          "etype": "KeyValueMsg",
          "description": "Sets/Reports Locations settings Use the NID in Int32Msg to query the settings",
          "entries": [
            {
              "nid": "pmode",
              "vtype": "int32",
              "description": "Positioning Mode",
              "values": [
                {
                  "nid": "Default",
                  "description": "Default positioning mode for the device, typically 'Coarse' positioning mode."
                },
                {
                  "nid": "Coarse",
                  "description": "Coarse positioning mode, returns a maximum of six (6) observations in one packet.  This is the most power efficient mode."
                },
                {
                  "nid": "Medium",
                  "description": "Medium positioning mode, returns a maximum of twelve (12) observations in two packets.  This improves accuracy but at the expense of some power"
                },
                {
                  "nid": "Precise",
                  "description": "Precise positioning mode, returns a maximum of eighteen (18) observations in three packets.  This is the least power efficient mode."
                }
              ],
              "defaultValue": "Default"
            },
            {
              "nid": "ptech",
              "vtype": "int32",
              "description": "Positioning Mode",
              "values": [
                {
                  "nid": "Automatic",
                  "description": "Positioning tech selected automatically for the device and conditions.  Typically WiFi and BLE positioning."
                },
                {
                  "nid": "Wifi",
                  "description": "WiFi positioning only."
                },
                {
                  "nid": "Ble",
                  "description": "BLE positioning only."
                },
                {
                  "nid": "WifiBle",
                  "description": "WiFi and BLE positioning."
                }
              ],
              "defaultValue": "WifiBle"
            }
          ]
        }
      ]
    }
  ]
}
