<?xml version="1.0"?>
<robot xmlns:xacro="http://wiki.ros.org/xacro" name="$(arg name)">
   <!-- robot name parameter -->
   <xacro:arg name="name" default="ur"/>
   <!-- import main macro -->
   <xacro:include filename="$(find ur_description)/urdf/ur_macro.xacro"/>

   <!-- possible 'ur_type' values: ur3, ur3e, ur5, ur5e, ur10, ur10e, ur16e, ur20, ur30 -->
   <!-- the default value should raise an error in case this was called without defining the type -->
   <xacro:arg name="ur_type" default="ur5e"/>

   <!-- parameters -->
   <xacro:arg name="tf_prefix" default="" />
   <xacro:arg name="joint_limit_params" default="$(find ur_description)/config/$(arg ur_type)/joint_limits.yaml"/>
   <xacro:arg name="kinematics_params" default="$(find ur_description)/config/$(arg ur_type)/default_kinematics.yaml"/>
   <xacro:arg name="physical_params" default="$(find ur_description)/config/$(arg ur_type)/physical_parameters.yaml"/>
   <xacro:arg name="visual_params" default="$(find ur_description)/config/$(arg ur_type)/visual_parameters.yaml"/>
   <xacro:arg name="transmission_hw_interface" default=""/>
   <xacro:arg name="safety_limits" default="false"/>
   <xacro:arg name="safety_pos_margin" default="0.15"/>
   <xacro:arg name="safety_k_position" default="20"/>


   <!-- create link fixed to the "world" -->
   <link name="world" />

   <!-- arm -->
   <xacro:ur_robot
     name="$(arg name)"
     tf_prefix="$(arg tf_prefix)"
     parent="world"
     joint_limits_parameters_file="$(arg joint_limit_params)"
     kinematics_parameters_file="$(arg kinematics_params)"
     physical_parameters_file="$(arg physical_params)"
     visual_parameters_file="$(arg visual_params)"
     safety_limits="$(arg safety_limits)"
     safety_pos_margin="$(arg safety_pos_margin)"
     safety_k_position="$(arg safety_k_position)">
     <origin xyz="0 0 0" rpy="0 0 0" />          <!-- position robot in the world -->
   </xacro:ur_robot>






    <xacro:arg name="use_fake_hardware" default="true" />

    <!-- Import macros -->
    <xacro:include filename="$(find robotiq_description)/urdf/robotiq_2f_85_macro.urdf.xacro" />

    <xacro:robotiq_gripper
      name="robotiq_gripper"
      prefix=""
      parent="tool0"
      sim_ignition="false"
      sim_isaac="false"
      use_fake_hardware="false"
      fake_sensor_commands="true"
      include_ros2_control="true"
      com_port="/tmp/ttyUR" >
        <origin xyz="0 0 0.1" rpy="0 0 0" />  
      </xacro:robotiq_gripper>        

    <!--<xacro:include filename="$(find robotiq_85_base_link)/urdf/ur_to_robotiq_adapter.urdf.xacro" />
    <xacro:ur_to_robotiq prefix="my_prefix" parent="my_parent_link" child="my_child_link" />-->


  <!-- Ajoutez le gripper au bout du bras -->
  <!--
  <joint name="tool0_robotiq" type="fixed">
    <parent link="tool0" />
    <child link="robotiq_85_base_link" />
    <origin xyz="0 0 0" rpy="0 0 0" />
  </joint>
  -->

</robot>







