<svg xmlns="http://www.w3.org/2000/svg" viewBox="0 0 24 24">
  <path d="M12 4c5.39 0 10 4.4 10 8 0 3.6-4.61 8-10 8S2 15.6 2 12c0-3.6 4.61-8 10-8zm0 4a4 4 0 100 8 4 4 0 000-8zm0 2a2 2 0 110 4 2 2 0 010-4z"/>
</svg>
