<svg xmlns="http://www.w3.org/2000/svg" viewBox="0 0 24 24">
  <g fill-rule="evenodd">
    <path d="M9 5h11a1 1 0 010 2H9a1 1 0 110-2zm0 12h11a1 1 0 010 2H9a1 1 0 010-2zm0-6h11a1 1 0 010 2H9a1 1 0 010-2z"/>
    <rect width="3" height="3" x="3" y="4.5" rx="1.5"/>
    <rect width="3" height="3" x="3" y="10.5" rx="1.5"/>
    <rect width="3" height="3" x="3" y="16.5" rx="1.5"/>
  </g>
</svg>
