<svg xmlns="http://www.w3.org/2000/svg" viewBox="0 0 24 24">
  <path d="M12 2c.716 0 1.414.075 2.087.218a5.467 5.467 0 00-.904 1.87 8 8 0 00-6.902 13.507c1.267-1.053 3.356-1.74 5.719-1.74 2.362 0 4.451.687 5.719 1.739A7.971 7.971 0 0020 12c0-.402-.03-.798-.087-1.184a5.462 5.462 0 001.869-.902c.143.672.218 1.37.218 2.086 0 5.523-4.477 10-10 10S2 17.523 2 12 6.477 2 12 2zm0 5c.448 0 .878.08 1.277.226a5.51 5.51 0 002.388 2.988l.06.035c.03.19.044.385.044.584 0 2.116-1.687 3.832-3.769 3.832s-3.77-1.716-3.77-3.832C8.23 8.716 9.919 7 12 7zm6.5-5a3.5 3.5 0 110 7 3.5 3.5 0 010-7z"/>
</svg>
