<svg xmlns="http://www.w3.org/2000/svg" viewBox="0 0 24 24">
  <path d="M3.4 2.4a1 1 0 00-1 1v6.4a1 1 0 001 1h17.2a1 1 0 001-1V3.4a1 1 0 00-1-1H3.4zm0 10.8a1 1 0 00-1 1v6.4a1 1 0 001 1h17.2a1 1 0 001-1v-6.4a1 1 0 00-1-1H3.4z"/>
</svg>
