<svg xmlns="http://www.w3.org/2000/svg" viewBox="0 0 24 24">
  <path d="M12 4c.803 0 1.455.651 1.455 1.455v.065a1.2 1.2 0 00.727 1.098 1.2 1.2 0 001.323-.24l.044-.043a1.455 1.455 0 112.058 2.058l-.043.043a1.2 1.2 0 00-.24 1.324v.058a1.2 1.2 0 001.098.727h.123a1.455 1.455 0 110 2.91h-.065a1.2 1.2 0 00-1.098.727 1.2 1.2 0 00.24 1.323l.043.044a1.455 1.455 0 11-2.058 2.058l-.043-.043a1.2 1.2 0 00-1.324-.24 1.2 1.2 0 00-.727 1.098v.123a1.455 1.455 0 11-2.91 0v-.065a1.2 1.2 0 00-.785-1.098 1.2 1.2 0 00-1.323.24l-.044.043a1.455 1.455 0 11-2.058-2.058l.043-.043a1.2 1.2 0 00.24-1.324 1.2 1.2 0 00-1.098-.727h-.123a1.455 1.455 0 010-2.91h.065a1.2 1.2 0 001.098-.785 1.2 1.2 0 00-.24-1.323l-.043-.044a1.455 1.455 0 112.058-2.058l.043.043a1.2 1.2 0 001.324.24h.058a1.2 1.2 0 00.727-1.098v-.123C10.545 4.65 11.197 4 12 4zm0 4.571a3.429 3.429 0 100 6.858 3.429 3.429 0 000-6.858z"/>
</svg>
