<svg xmlns="http://www.w3.org/2000/svg" viewBox="0 0 24 24">
  <path fill-rule="evenodd" d="M11.649 2.132a1 1 0 01.702 0l7 2.625a1 1 0 01.649.936V12c0 3.882-2.512 7.137-7.537 9.763a1 1 0 01-.926 0l-.363-.193C6.39 18.978 4 15.788 4 12V5.693a1 1 0 01.649-.936zm3.975 5.986a.813.813 0 00-1.102.248l-3.467 4.615-1.69-1.642-.075-.065a.817.817 0 00-1.056.065.763.763 0 000 1.1l2.4 2.333.076.065a.814.814 0 001.168-.203l4-5.444.045-.08a.766.766 0 00-.3-.992z"/>
</svg>
