<svg xmlns="http://www.w3.org/2000/svg" viewBox="0 0 24 24">
  <path d="M10 12l.17.001c-.11.313-.17.65-.17.999l.005.176A3 3 0 0013 16h1v1l.003.115.007.117.01.115A3 3 0 0017 20l.176-.005c.241-.014.475-.056.697-.124a1.596 1.596 0 01-1.196.954l-2.677.47a23.07 23.07 0 01-8 0l-2.677-.47A1.6 1.6 0 012 19.248v-2.446C2 14.152 5.582 12 10 12zm7-4a1 1 0 01.993.883L18 9v3h3a1 1 0 01.117 1.993L21 14h-3v3a1 1 0 01-1.993.117L16 17v-3h-3a1 1 0 01-.117-1.993L13 12h3V9a1 1 0 011-1zm-7-6a4 4 0 110 8 4 4 0 010-8z"/>
</svg>
