<svg xmlns="http://www.w3.org/2000/svg" viewBox="0 0 24 24">
  <path d="M8.71 15.29L6.41 13h11.18l-2.3 2.29a1 1 0 000 1.42 1 1 0 001.42 0l4-4a1 1 0 000-1.42l-4-4a1 1 0 10-1.42 1.42l2.3 2.29H6.41l2.3-2.29a1 1 0 00-1.42-1.42l-4 4a1 1 0 000 1.42l4 4a1 1 0 001.42-1.42z"/>
</svg>
