<svg xmlns="http://www.w3.org/2000/svg" viewBox="0 0 24 24">
  <path d="M5 2l.136.003.136.01 6 .648c1.485.138 2.636 1.364 2.723 2.864l.005.182v.176a1.01 1.01 0 01-1 1.02c-.552 0-1-.457-1-1.02v-.176c0-.487-.336-.9-.793-.998l-.117-.017-6-.65L5 4.04c-.513 0-.936.393-.993.9L4 5.06v13.883l.004.092c.047.52.47.914.97.927l.117-.004 6-.649a1.01 1.01 0 00.902-.895l.007-.12v-.178c0-.563.448-1.02 1-1.02s1 .457 1 1.02v.178c0 1.52-1.094 2.8-2.552 3.024l-.176.022-6 .648c-1.65.153-3.11-1.086-3.26-2.768l-.009-.139L2 18.942V5.058C2 3.37 3.343 2 5 2zm12.613 5.117l.094.085 4 4.077c.36.368.388.946.083 1.346l-.083.096-4 4.077a.987.987 0 01-1.414 0c-.194-.197-.374-1.133-.54-2.808L11 13.02c-.552 0-1-.457-1-1.02 0-.523.386-.954.883-1.013L11 10.98l4.752-.969c.167-1.675.347-2.612.54-2.81a.986.986 0 011.32-.084z"/>
</svg>
