<svg xmlns="http://www.w3.org/2000/svg" viewBox="0 0 16 16">
  <g fill="none" fill-rule="evenodd">
    <rect width="16" height="13" y="2" fill="#D93025" rx="1"/>
    <path fill="#FFF" d="M2 2h2l2 3H4L2 2zm4 0h2l2 3H8L6 2zm4 0h2l2 3h-2l-2-3z"/>
  </g>
</svg>
