<svg xmlns="http://www.w3.org/2000/svg" viewBox="0 0 24 24">
  <path d="M19 21H5a3 3 0 01-3-3V5a3 3 0 013-3h5a1 1 0 01.83.45L12.54 5H19a3 3 0 013 3v10a3 3 0 01-3 3zM5 4a1 1 0 00-1 1v13a1 1 0 001 1h14a1 1 0 001-1V8a1 1 0 00-1-1h-7a1 1 0 01-.83-.45L9.46 4z"/>
  <path d="M16 13a1 1 0 01-1 1h-2v2a1 1 0 01-2 0v-2H9a1 1 0 010-2h2v-2a1 1 0 012 0v2h2a1 1 0 011 1z"/>
</svg>
