<svg xmlns="http://www.w3.org/2000/svg" viewBox="0 0 24 24">
  <path fill-rule="evenodd" d="M6 2a4 4 0 00-4 4v12a4 4 0 004 4h12a4 4 0 004-4V6a4 4 0 00-4-4H6zm10.47 9.189a.7.7 0 00-.654-.449h-.329a.7.7 0 00-.654.449l-2.5 6.509a.443.443 0 00.413.602h.165a.7.7 0 00.654-.449l.553-1.441h3.067l.553 1.441a.7.7 0 00.654.449h.164a.443.443 0 00.415-.602l-2.501-6.509zm-5.66-4.844a.645.645 0 00-1.291 0v.615H5.627a.627.627 0 100 1.254h6.584a9.9 9.9 0 01-2.047 3.377c-.353-.385-.783-.979-1.288-1.783a.7.7 0 00-.593-.328h-.255a.375.375 0 00-.324.564c.61 1.041 1.143 1.81 1.602 2.309l-2.823 2.723a.62.62 0 00-.016.875l.013.013c.254.248.66.248.913 0l2.771-2.704 1.517 1.48a.451.451 0 00.736-.162l.08-.208a.7.7 0 00-.168-.754l-1.306-1.26.02-.019a10.972 10.972 0 002.394-4.114h1.26a.632.632 0 100-1.263H10.81v-.615zm3.792 8.805l1.05-2.731L16.7 15.15h-2.099z" clip-rule="evenodd"/>
</svg>
