<svg xmlns="http://www.w3.org/2000/svg" viewBox="0 0 24 24">
  <path d="M12 2c5.523 0 10 4.477 10 10s-4.477 10-10 10S2 17.523 2 12 6.477 2 12 2zm-2 5.804a1 1 0 00-1 1v6.392a1 1 0 001.53.848l5.113-3.196a1 1 0 000-1.696L10.53 7.956a1 1 0 00-.53-.152z"/>
</svg>
