<svg xmlns="http://www.w3.org/2000/svg" viewBox="0 0 24 24">
  <path fill-rule="evenodd" d="M22 4a2 2 0 00-2-2H4a2 2 0 00-2 2v16a2 2 0 002 2h16a2 2 0 002-2V4zM8.818 14.391l1.397-1.397a70.437 70.437 0 001.342-1.364c.264-.286.443-.524.539-.715.102-.19.154-.407.154-.649a.849.849 0 00-.286-.649c-.191-.176-.444-.264-.76-.264-.307 0-.557.088-.747.264a1.46 1.46 0 00-.407.66l-1.298-.539c.08-.286.227-.561.44-.825.22-.271.502-.491.847-.66A2.67 2.67 0 0111.227 8c.498 0 .935.099 1.309.297.374.19.663.455.869.792.205.33.308.7.308 1.111 0 .814-.396 1.61-1.188 2.387-.323.315-.92.91-1.793 1.782l.033.066h3.047V15.7H8.818v-1.309zm-2.424-4.334l-1.133.825-.726-1.111 2.21-1.595h1.09V15.7H6.394v-5.643zm8.745 5.313a2.92 2.92 0 001.694.506c.52 0 .979-.099 1.375-.297.403-.198.715-.47.935-.814.22-.345.33-.733.33-1.166 0-.447-.114-.829-.341-1.144a1.983 1.983 0 00-.891-.693v-.088c.264-.132.488-.341.67-.627.192-.286.287-.63.287-1.034a1.77 1.77 0 00-.308-1.023 2.078 2.078 0 00-.87-.726A2.863 2.863 0 0016.768 8c-.638 0-1.166.161-1.584.484-.41.323-.693.704-.847 1.144l1.309.539c.073-.242.202-.444.385-.605.183-.161.425-.242.726-.242.286 0 .52.08.704.242a.784.784 0 01.275.616c0 .308-.114.543-.341.704-.22.161-.491.242-.814.242h-.594v1.309h.649c.418 0 .748.095.99.286a.88.88 0 01.374.748.896.896 0 01-.352.726 1.23 1.23 0 01-.814.286c-.345 0-.63-.095-.858-.286-.227-.198-.385-.477-.473-.836l-1.364.539c.183.645.517 1.137 1 1.474z" clip-rule="evenodd"/>
</svg>
