<svg xmlns="http://www.w3.org/2000/svg" viewBox="0 0 24 24">
  <path fill-rule="evenodd" d="M9.752 21.958A7.998 7.998 0 019.262 6a6.22 6.22 0 008.7 8.7 7.998 7.998 0 01-8.21 7.258z" clip-rule="evenodd"/>
  <path d="M15 11.9v-.67a.1.1 0 00-.1-.1h-1.578a.1.1 0 01-.077-.164l1.732-2.1A.1.1 0 0015 8.804V8.1a.1.1 0 00-.1-.1h-2.8a.1.1 0 00-.1.1v.67a.1.1 0 00.1.1h1.526a.1.1 0 01.078.163l-1.682 2.1a.1.1 0 00-.022.063v.704a.1.1 0 00.1.1h2.8a.1.1 0 00.1-.1zm5-4v-.67a.1.1 0 00-.1-.1h-1.577a.1.1 0 01-.078-.164l1.732-2.1A.1.1 0 0020 4.804V4.1a.1.1 0 00-.1-.1h-2.8a.1.1 0 00-.1.1v.67a.1.1 0 00.1.1h1.526a.1.1 0 01.078.163l-1.682 2.1a.1.1 0 00-.022.063V7.9a.1.1 0 00.1.1h2.8a.1.1 0 00.1-.1z"/>
</svg>
