<svg xmlns="http://www.w3.org/2000/svg" viewBox="0 0 24 24">
  <path d="M18.864 2.003L19 2c1.657 0 3 1.37 3 3.058v13.884l-.003.138-.01.139c-.15 1.682-1.609 2.921-3.259 2.768l-6-.648-.176-.022a3.014 3.014 0 01-2.35-1.921c-.222-.582.23-1.123.851-1.082.519.034.967.544 1.4.832a.984.984 0 00.457.162l6 .649.116.004c.5-.013.924-.406.97-.927l.004-.092V5.058l-.007-.119c-.057-.507-.48-.9-.993-.9l-.09.004-6 .649-.117.017a.983.983 0 00-.27.101c-.526.291-.996.92-1.595.868-.53-.047-.92-.552-.736-1.05a3.01 3.01 0 012.536-1.967l6-.648.136-.01z"/>
  <path d="M9.707 7.202l-.094-.085a.986.986 0 00-1.32.085c-.194.197-.374 1.134-.54 2.81L3 10.98l-.117.007C2.386 11.047 2 11.477 2 12c0 .563.448 1.02 1 1.02l4.753.97c.166 1.675.346 2.61.54 2.808a.987.987 0 001.414 0l4-4.077.083-.096c.305-.4.278-.978-.083-1.346l-4-4.077z"/>
</svg>
