<svg xmlns="http://www.w3.org/2000/svg" viewBox="0 0 24 24">
  <path d="M12 2c2.761 0 5 2.25 5 5.025V10h.895c1.162 0 2.105.943 2.105 2.105v7.79A2.105 2.105 0 0117.895 22H6.105A2.105 2.105 0 014 19.895v-7.79C4 10.943 4.943 10 6.105 10H7V7.025c0-2.702 2.122-4.906 4.783-5.02zm0 2.01c-1.657 0-3 1.35-3 3.015V10h6V7.025a3.009 3.009 0 00-2.824-3.01z"/>
</svg>
