<svg xmlns="http://www.w3.org/2000/svg" viewBox="0 0 24 24">
  <path d="M12.73 7.407a3.406 3.406 0 11-6.812.001 3.406 3.406 0 016.812-.001zm6.324 1.947a2.916 2.916 0 01-5.507 1.343 5.39 5.39 0 001.1-3.855 2.92 2.92 0 014.408 2.511zm-9.73 3.406c3.493 0 6.325 1.636 6.325 3.65v1.643a1.44 1.44 0 01-1.223 1.424l-1.862.283c-2.045.312-4.124.32-6.172.023l-2.159-.314A1.44 1.44 0 013 18.044V16.41c0-2.014 2.831-3.65 6.324-3.65zm10.949 4.849l-2.678.74V16.41c0-1.002-.35-1.917-.925-2.579 2.491.331 4.33 1.47 4.33 2.823a.991.991 0 01-.727.955z"/>
</svg>
