<svg xmlns="http://www.w3.org/2000/svg" viewBox="0 0 24 24">
  <path fill-rule="evenodd" d="M12 1c6.075 0 11 4.925 11 11s-4.925 11-11 11S1 18.075 1 12 5.925 1 12 1zM8.793 7.248a1.1 1.1 0 00-1.551 1.537l.091.104L10.444 12l-3.11 3.111-.086.096a1.1 1.1 0 001.537 1.551l.104-.091L12 13.556l3.111 3.11.096.086a1.1 1.1 0 001.551-1.537l-.091-.104L13.556 12l3.11-3.111.086-.096a1.1 1.1 0 00-1.537-1.551l-.104.091L12 10.444l-3.111-3.11-.096-.086z" clip-rule="evenodd"/>
</svg>
