<svg xmlns="http://www.w3.org/2000/svg" viewBox="0 0 24 24">
  <path fill-rule="evenodd" d="M13.002 3.25c.345.184.63.46.82.795l7.92 13.966c.554.976.187 2.203-.82 2.74A2.13 2.13 0 0119.92 21H4.08C2.93 21 2 20.097 2 18.983c0-.34.089-.674.257-.972l7.92-13.966c.554-.976 1.819-1.332 2.825-.795zM12 16a1.5 1.5 0 100 3 1.5 1.5 0 000-3zm0-9a1.735 1.735 0 00-1.717 1.98l.576 4.03a1.153 1.153 0 002.282 0l.576-4.03A1.735 1.735 0 0012 7z"/>
</svg>
