<svg xmlns="http://www.w3.org/2000/svg" viewBox="0 0 16 16">
  <g fill="none" fill-rule="evenodd">
    <path fill="#4986E7" d="M2 1h6l5 5v9H2z"/>
    <path fill="#FFF" d="M8 2l4 4H8z"/>
  </g>
</svg>
