<svg xmlns="http://www.w3.org/2000/svg" viewBox="0 0 24 24">
  <path d="M16.61 16.61a1.45 1.45 0 001.98 0 1.289 1.289 0 000-1.886l-5.6-5.333a1.45 1.45 0 00-1.98 0l-5.6 5.333a1.289 1.289 0 000 1.885 1.45 1.45 0 001.98 0L12 12.22l4.61 4.39z"/>
</svg>
