<svg xmlns="http://www.w3.org/2000/svg" viewBox="0 0 24 24">
  <path d="M6 8h12a1 1 0 000-2H6a1 1 0 000 2zm3 5h6a1 1 0 000-2H9a1 1 0 000 2zm9 3H6a1 1 0 000 2h12a1 1 0 000-2z"/>
  <path d="M11 5v14a1 1 0 002 0V5a1 1 0 00-2 0z"/>
</svg>
