<svg xmlns="http://www.w3.org/2000/svg" viewBox="0 0 24 24">
  <path d="M18 3H6a3 3 0 00-3 3v12a3 3 0 003 3h12a3 3 0 003-3V6a3 3 0 00-3-3zm1 6h-3V6h3zm-9-3h4v3h-4zM8 6v3H5V6zm-3 5h3v3H5zm5 0h4v3h-4zm6 0h3v3h-3zM5 18v-2h3v3H6a1 1 0 01-1-1zm5-2h4v3h-4zm9 2a1 1 0 01-1 1h-2v-3h3z"/>
</svg>
