<svg xmlns="http://www.w3.org/2000/svg" viewBox="0 0 24 24">
  <path d="M8 8h12a1 1 0 000-2H8a1 1 0 000 2zm0 5h4a1 1 0 000-2H8a1 1 0 000 2zm12 3H8a1 1 0 000 2h12a1 1 0 000-2zM3 5v14a1 1 0 002 0V5a1 1 0 00-2 0z"/>
</svg>
