<svg xmlns="http://www.w3.org/2000/svg" viewBox="0 0 24 24">
  <path d="M11.467 5a1 1 0 01.116 1.993L11.467 7h-5.6a.867.867 0 00-.86.758L5 7.867v10.266c0 .442.33.807.758.86l.109.007h10.266c.442 0 .807-.33.86-.758l.007-.109v-5.6a1 1 0 011.993-.116l.007.116v5.6a2.867 2.867 0 01-2.698 2.862l-.169.005H5.867a2.867 2.867 0 01-2.862-2.698L3 18.133V7.867a2.867 2.867 0 012.698-2.862L5.867 5h5.6zm3.416-1.993L15 3h5l.075.003.126.017.111.03.111.044.098.052.096.067.09.08a.927.927 0 01.097.112l.071.11.054.114.035.105.03.15L21 4v5a1 1 0 01-1.993.117L19 9V6.414l-8.293 8.293a1 1 0 01-1.497-1.32l.083-.094L17.584 5H15a1 1 0 01-.993-.883L14 4a1 1 0 01.883-.993z"/>
</svg>
