<svg xmlns="http://www.w3.org/2000/svg" viewBox="0 0 24 24">
  <path d="M6.62 17c.666 0 1.27-.113 1.81-.34.54-.227.975-.503 1.304-.829.197-.195.216-1.416.058-3.663a.833.833 0 00-.831-.774H7.12a.833.833 0 00-.834.833v.108c0 .46.373.834.833.834h.73v1.656a1.136 1.136 0 01-.448.222c-.184.05-.372.074-.565.074-.888 0-1.552-.273-1.991-.82-.44-.548-.66-1.32-.66-2.316 0-.483.061-.917.182-1.302.12-.384.292-.71.514-.976.222-.266.485-.47.79-.614a2.33 2.33 0 011.006-.214c.405 0 .743.074 1.014.222.45.246 1.037.21 1.358-.19l.02-.025c.289-.36.27-.886-.11-1.149a5.443 5.443 0 00-.588-.352C7.88 7.128 7.291 7 6.605 7a4.7 4.7 0 00-1.781.34 4.24 4.24 0 00-1.47.991c-.42.434-.75.964-.992 1.59-.241.627-.362 1.34-.362 2.138 0 .809.118 1.521.355 2.138a4.35 4.35 0 00.977 1.546 4.09 4.09 0 001.47.939A5.13 5.13 0 006.62 17zm7.198-1.242V8.242a1.064 1.064 0 10-2.13 0v7.516a1.065 1.065 0 002.13 0zm4.359.231v-2.91h2.44c.46 0 .833-.372.833-.833v-.167a.833.833 0 00-.834-.833h-2.44V9.012h2.99c.46 0 .834-.373.834-.834v-.167a.833.833 0 00-.833-.833H16.88a.833.833 0 00-.833.833v7.978c0 .46.373.834.833.834h.462c.46 0 .834-.374.834-.834z"/>
</svg>
