<svg xmlns="http://www.w3.org/2000/svg" viewBox="0 0 24 24">
  <g fill="none" fill-rule="evenodd">
    <rect width="20" height="20" x="2" y="2" fill="#FFA200" rx="4"/>
    <path fill="#FFF" d="M22 18v1H6.5a.5.5 0 110-1H22zM7.565 14.787a.2.2 0 01.078.048l.957.957a.2.2 0 01-.079.331l-1.245.415a.3.3 0 01-.38-.38l.416-1.244a.2.2 0 01.253-.127zm8.476-8.524l1.131 1.131a.2.2 0 010 .283l-7.495 7.495a.2.2 0 01-.283 0l-1.131-1.131a.2.2 0 010-.283l7.495-7.495a.2.2 0 01.283 0zm2.687-1.556a1 1 0 010 1.414l-.566.566a.2.2 0 01-.283 0l-1.131-1.131a.2.2 0 010-.283l.566-.566a1 1 0 011.414 0z"/>
  </g>
</svg>
