<svg xmlns="http://www.w3.org/2000/svg" viewBox="0 0 24 24">
  <path d="M6.633 4.74C5.305 5.223 4.446 5.76 3.9 6.215c-.272.227-.464.43-.596.593a2.671 2.671 0 00-.219.313l-.007.012-.003.006-.001.003v.001s-.002.001.88.472l-.882-.47a1 1 0 00-.057.812l5.204 14.297a1 1 0 101.879-.684L8.32 16.685l.084-.072c.348-.29.999-.72 2.138-1.134 1.047-.381 2.042-.393 3.22-.398h.051c1.135-.005 2.446-.01 3.844-.52 1.328-.483 2.187-1.02 2.733-1.475a4.34 4.34 0 00.596-.593 2.66 2.66 0 00.202-.283l.008-.014.009-.015.007-.013.003-.005.001-.003v-.001s.002-.002-.88-.472l.882.47a1 1 0 00.057-.812l-3.225-8.86a1 1 0 00-1.804-.16 2.375 2.375 0 01-.36.365c-.348.288-.999.718-2.138 1.132-1.047.382-2.042.394-3.22.399h-.052c-1.135.005-2.445.01-3.843.519z"/>
</svg>
