<svg xmlns="http://www.w3.org/2000/svg" viewBox="0 0 24 24">
  <path d="M12 2c5.523 0 10 4.477 10 10s-4.477 10-10 10S2 17.523 2 12 6.477 2 12 2zm-3.982 8.5A1.012 1.012 0 007 11.5V15a1.012 1.012 0 001.018 1h.232v-5.5zM11.57 6l-2.035 4.5V16h5.724c.503.01.937-.353 1.018-.85l.711-4.5a.995.995 0 00-.849-1.137h-.162l-2.89-.013v-2A1.507 1.507 0 0011.57 6z"/>
</svg>
