<svg xmlns="http://www.w3.org/2000/svg" viewBox="0 0 24 24">
  <path fill-rule="evenodd" d="M12 1c6.075 0 11 4.925 11 11s-4.925 11-11 11S1 18.075 1 12 5.925 1 12 1zm0 15a1.25 1.25 0 100 2.5 1.25 1.25 0 000-2.5zm.384-4.38c.248-.08.413-.147.495-.2.703-.459 1.078-.948 1.078-1.42.001-.974-.716-1.807-1.698-1.972a2.054 2.054 0 00-2.212 1.157l-.107.257a1.03 1.03 0 01-1.257.504.994.994 0 01-.625-1.275c.661-1.838 2.582-2.943 4.546-2.613 1.964.33 3.399 1.997 3.396 3.944 0 1.28-.775 2.29-1.988 3.08-.152.1-.377.223-.672.37A.612.612 0 0013 14a1 1 0 01-1.993.117L11 14v-.477a2 2 0 011.384-1.903z" clip-rule="evenodd"/>
</svg>
