<svg xmlns="http://www.w3.org/2000/svg" viewBox="0 0 24 24">
  <path fill-rule="evenodd" d="M11 19a1 1 0 010 2H3a1 1 0 010-2h8zm5-4a1 1 0 010 2H3a1 1 0 010-2h13zm4-12a2 2 0 012 2v6a2 2 0 01-2 2H4a2 2 0 01-2-2V5a2 2 0 012-2h16z"/>
</svg>
