<svg xmlns="http://www.w3.org/2000/svg" viewBox="0 0 24 24">
  <path d="M12 3a9 9 0 110 18 9 9 0 010-18zm4.03 10.282C15.156 14.337 13.658 15 12 15c-1.65 0-3.145-.66-4.022-1.71a1 1 0 00-1.535 1.282C7.71 16.09 9.772 17 12 17c2.236 0 4.302-.915 5.569-2.441a1 1 0 10-1.54-1.277zM15.5 8a1.5 1.5 0 100 3 1.5 1.5 0 000-3zm-7 0a1.5 1.5 0 100 3 1.5 1.5 0 000-3z"/>
</svg>
