<svg xmlns="http://www.w3.org/2000/svg" viewBox="0 0 24 24">
  <path d="M16 12a1 1 0 01-1 1h-2v2a1 1 0 01-2 0v-2H9a1 1 0 010-2h2V9a1 1 0 012 0v2h2a1 1 0 011 1zM4 10a1 1 0 01-1-1V6a3 3 0 013-3h3a1 1 0 010 2H6a1 1 0 00-1 1v3a1 1 0 01-1 1zm16 0a1 1 0 01-1-1V6a1 1 0 00-1-1h-3a1 1 0 010-2h3a3 3 0 013 3v3a1 1 0 01-1 1zm-2 11h-3a1 1 0 010-2h3a1 1 0 001-1v-3a1 1 0 012 0v3a3 3 0 01-3 3zm-9 0H6a3 3 0 01-3-3v-3a1 1 0 012 0v3a1 1 0 001 1h3a1 1 0 010 2z"/>
</svg>
