<svg xmlns="http://www.w3.org/2000/svg" viewBox="0 0 24 24">
  <path d="M7 8h13a1 1 0 000-2H7a1 1 0 000 2zm13 3H7a1 1 0 000 2h13a1 1 0 000-2zm0 5H7a1 1 0 000 2h13a1 1 0 000-2z"/>
  <circle cx="3" cy="7" r="1"/>
  <circle cx="3" cy="12" r="1"/>
  <circle cx="3" cy="17" r="1"/>
</svg>
