<svg xmlns="http://www.w3.org/2000/svg" fill="none" viewBox="0 0 24 24">
  <path fill="#000" d="M14.342 6.351a1.226 1.226 0 00-.085 1.6l.085.098L18.184 12l-3.842 3.951a1.226 1.226 0 00-.085 1.6l.085.098a1.143 1.143 0 001.555.087l.095-.088 4.666-4.8a1.226 1.226 0 00.085-1.6l-.085-.096-4.666-4.8a1.144 1.144 0 00-1.65 0zm-4.684 0c.426.438.454 1.129.085 1.6l-.085.098L5.816 12l3.842 3.951c.426.438.454 1.129.085 1.6l-.085.098a1.143 1.143 0 01-1.555.087l-.095-.088-4.666-4.8a1.226 1.226 0 01-.085-1.6l.085-.096 4.666-4.8a1.144 1.144 0 011.65 0z"/>
</svg>
