{
    "key": "group_582f042bab4fa",
    "title": "Sub menu additional content",
    "fields": [
        {
            "key": "field_582f07a91f0b7",
            "label": "Show addition content",
            "name": "show_addition_content",
            "type": "flexible_content",
            "instructions": "",
            "required": 0,
            "conditional_logic": 0,
            "wrapper": {
                "width": "",
                "class": "",
                "id": ""
            },
            "button_label": "Add sub menu content",
            "min": "",
            "max": "",
            "layouts": [
                {
                    "key": "582f0447ab7b3",
                    "name": "products",
                    "label": "Show products",
                    "display": "block",
                    "sub_fields": [
                        {
                            "key": "field_582f080b1f0b8",
                            "label": "Which menu item?",
                            "name": "which_menu_item",
                            "type": "select",
                            "instructions": "<strong>Note:</strong> Only organised menu items will show here, as they are the only menu type that gives you flexibilty for showing content",
                            "required": 0,
                            "conditional_logic": 0,
                            "wrapper": {
                                "width": "",
                                "class": "",
                                "id": ""
                            },
                            "choices": [],
                            "default_value": [],
                            "allow_null": 0,
                            "multiple": 0,
                            "ui": 0,
                            "ajax": 0,
                            "return_format": "value",
                            "placeholder": ""
                        },
                        {
                            "key": "field_582f1959f2599",
                            "label": "Select products to show",
                            "name": "select_products_to_show",
                            "type": "post_object",
                            "instructions": "",
                            "required": 1,
                            "conditional_logic": 0,
                            "wrapper": {
                                "width": "",
                                "class": "",
                                "id": ""
                            },
                            "post_type": [
                                "product"
                            ],
                            "taxonomy": [],
                            "allow_null": 1,
                            "multiple": 1,
                            "return_format": "id",
                            "ui": 1
                        }
                    ],
                    "min": "",
                    "max": ""
                },
                {
                    "key": "582f1993f259a",
                    "name": "banner",
                    "label": "Show banner",
                    "display": "block",
                    "sub_fields": [
                        {
                            "key": "field_582f199bf259b",
                            "label": "Which menu_item",
                            "name": "which_menu_item",
                            "type": "select",
                            "instructions": "",
                            "required": 0,
                            "conditional_logic": 0,
                            "wrapper": {
                                "width": "",
                                "class": "",
                                "id": ""
                            },
                            "choices": [],
                            "default_value": [],
                            "allow_null": 0,
                            "multiple": 0,
                            "ui": 0,
                            "ajax": 0,
                            "return_format": "value",
                            "placeholder": ""
                        },
                        {
                            "key": "field_582f19b3f259c",
                            "label": "Select banner",
                            "name": "select_banner",
                            "type": "post_object",
                            "instructions": "",
                            "required": 0,
                            "conditional_logic": 0,
                            "wrapper": {
                                "width": "",
                                "class": "",
                                "id": ""
                            },
                            "post_type": [
                                "banners"
                            ],
                            "taxonomy": [],
                            "allow_null": 0,
                            "multiple": 0,
                            "return_format": "id",
                            "ui": 1
                        }
                    ],
                    "min": "",
                    "max": ""
                }
            ]
        }
    ],
    "location": [
        [
            {
                "param": "options_page",
                "operator": "==",
                "value": "acf-options-main-menu"
            }
        ]
    ],
    "menu_order": 0,
    "position": "normal",
    "style": "default",
    "label_placement": "top",
    "instruction_placement": "label",
    "hide_on_screen": "",
    "active": 1,
    "description": ""
}