{
    "key": "group_576a4ac6e9dfa",
    "title": "Variation Gallery",
    "fields": [
        {
            "key": "field_576a4b571d720",
            "label": "Variation Gallery",
            "name": "variation_gallery",
            "type": "gallery",
            "instructions": "Upload additional images to this variation to see more images when this variation is selected.",
            "required": 0,
            "conditional_logic": 0,
            "wrapper": {
                "width": "",
                "class": "",
                "id": ""
            },
            "min": "",
            "max": "",
            "preview_size": "thumbnail",
            "insert": "append",
            "library": "all",
            "min_width": "",
            "min_height": "",
            "min_size": "",
            "max_width": "",
            "max_height": "",
            "max_size": "",
            "mime_types": ""
        }
    ],
    "location": [
        [
            {
                "param": "user_form",
                "operator": "==",
                "value": "all"
            },
            {
                "param": "post_type",
                "operator": "==",
                "value": "product"
            }
        ]
    ],
    "menu_order": 0,
    "position": "normal",
    "style": "default",
    "label_placement": "top",
    "instruction_placement": "label",
    "hide_on_screen": "",
    "active": 1,
    "description": "",
    "modified": 1466588584
}