{
    "key": "group_56dec12aa2844",
    "title": "Menu builder",
    "fields": [
        {
            "key": "field_56dec1b81140f",
            "label": "Menu item",
            "name": "menu_item",
            "type": "flexible_content",
            "instructions": "- The order of this menu is the same on the website\r\n- You can turn on \/ off features",
            "required": 0,
            "conditional_logic": 0,
            "wrapper": {
                "width": "",
                "class": "",
                "id": ""
            },
            "button_label": "Add menu item",
            "min": "",
            "max": "",
            "layouts": [
                {
                    "key": "56dec23570bc2",
                    "name": "product_category",
                    "label": "Product category",
                    "display": "block",
                    "sub_fields": [
                        {
                            "key": "field_56dec24f11411",
                            "label": "Category Name",
                            "name": "category",
                            "type": "taxonomy",
                            "instructions": "",
                            "required": 0,
                            "conditional_logic": 0,
                            "wrapper": {
                                "width": 50,
                                "class": "",
                                "id": ""
                            },
                            "taxonomy": "product_cat",
                            "field_type": "select",
                            "allow_null": 0,
                            "add_term": 0,
                            "save_terms": 0,
                            "load_terms": 0,
                            "return_format": "object",
                            "multiple": 0
                        },
                        {
                            "key": "field_56dec30e11412",
                            "label": "Menu item name",
                            "name": "menu_item_name",
                            "type": "text",
                            "instructions": "",
                            "required": 0,
                            "conditional_logic": 0,
                            "wrapper": {
                                "width": 50,
                                "class": "",
                                "id": ""
                            },
                            "default_value": "",
                            "placeholder": "If blank, the category name will be shown",
                            "prepend": "",
                            "append": "",
                            "maxlength": "",
                            "readonly": 0,
                            "disabled": 0
                        },
                        {
                            "key": "field_56dec7bbf0b00",
                            "label": "List custom sub categories",
                            "name": "list_sub_categories",
                            "type": "true_false",
                            "instructions": "By default, 10 sub-categories will be shown",
                            "required": 0,
                            "conditional_logic": 0,
                            "wrapper": {
                                "width": "",
                                "class": "",
                                "id": ""
                            },
                            "message": "",
                            "default_value": 0
                        },
                        {
                            "key": "field_56decfd8e6827",
                            "label": "Manually pick sub categories",
                            "name": "manually_pick_sub_categories",
                            "type": "taxonomy",
                            "instructions": "You can overwrite the default 10 brands by choosing brands you want to showcase here",
                            "required": 0,
                            "conditional_logic": [
                                [
                                    {
                                        "field": "field_56dec7bbf0b00",
                                        "operator": "==",
                                        "value": "1"
                                    }
                                ]
                            ],
                            "wrapper": {
                                "width": "",
                                "class": "",
                                "id": ""
                            },
                            "taxonomy": "product_cat",
                            "field_type": "multi_select",
                            "allow_null": 1,
                            "add_term": 1,
                            "save_terms": 0,
                            "load_terms": 0,
                            "return_format": "object",
                            "multiple": 0
                        }
                    ],
                    "min": "",
                    "max": ""
                },
                {
                    "key": "56deca1cf1d32",
                    "name": "sale_items",
                    "label": "Sale",
                    "display": "block",
                    "sub_fields": [
                        {
                            "key": "field_56deca1cf1d34",
                            "label": "Sale Name",
                            "name": "sale_name",
                            "type": "text",
                            "instructions": "",
                            "required": 0,
                            "conditional_logic": 0,
                            "wrapper": {
                                "width": 50,
                                "class": "",
                                "id": ""
                            },
                            "default_value": "",
                            "placeholder": "",
                            "prepend": "",
                            "append": "",
                            "maxlength": "",
                            "readonly": 0,
                            "disabled": 0
                        },
                        {
                            "key": "field_56deca71f1d37",
                            "label": "Sale categories",
                            "name": "sale_categories",
                            "type": "taxonomy",
                            "instructions": "Choose one or more sale categories",
                            "required": 0,
                            "conditional_logic": 0,
                            "wrapper": {
                                "width": 50,
                                "class": "",
                                "id": ""
                            },
                            "taxonomy": "product_cat",
                            "field_type": "multi_select",
                            "allow_null": 0,
                            "add_term": 0,
                            "save_terms": 0,
                            "load_terms": 0,
                            "return_format": "object",
                            "multiple": 0
                        }
                    ],
                    "min": "",
                    "max": ""
                },
                {
                    "key": "575813a762668",
                    "name": "page",
                    "label": "Page",
                    "display": "block",
                    "sub_fields": [
                        {
                            "key": "field_575813b362669",
                            "label": "Page name",
                            "name": "page_name",
                            "type": "text",
                            "instructions": "",
                            "required": 1,
                            "conditional_logic": 0,
                            "wrapper": {
                                "width": 50,
                                "class": "",
                                "id": ""
                            },
                            "default_value": "",
                            "placeholder": "",
                            "prepend": "",
                            "append": "",
                            "maxlength": "",
                            "readonly": 0,
                            "disabled": 0
                        },
                        {
                            "key": "field_575813e36266a",
                            "label": "Page",
                            "name": "page",
                            "type": "post_object",
                            "instructions": "",
                            "required": 1,
                            "conditional_logic": 0,
                            "wrapper": {
                                "width": 50,
                                "class": "",
                                "id": ""
                            },
                            "post_type": [
                                "page",
                                "post"
                            ],
                            "taxonomy": [

                            ],
                            "allow_null": 0,
                            "multiple": 0,
                            "return_format": "id",
                            "ui": 1
                        },
                        {
                            "key": "field_57bcc196129b2",
                            "label": "Sub pages",
                            "name": "sub_pages",
                            "type": "post_object",
                            "instructions": "These pages will appear as a sub menu",
                            "required": 0,
                            "conditional_logic": 0,
                            "wrapper": {
                                "width": "",
                                "class": "",
                                "id": ""
                            },
                            "post_type": [
                                "page"
                            ],
                            "taxonomy": [

                            ],
                            "allow_null": 0,
                            "multiple": 1,
                            "return_format": "id",
                            "ui": 1
                        }
                    ],
                    "min": "",
                    "max": ""
                },
                {
                    "key": "57bca5fe157e5",
                    "name": "organised_menu",
                    "label": "Organised category menu",
                    "display": "block",
                    "sub_fields": [
                        {
                            "key": "field_57bca608157e6",
                            "label": "Menu Title",
                            "name": "menu_title",
                            "type": "text",
                            "instructions": "",
                            "required": 0,
                            "conditional_logic": 0,
                            "wrapper": {
                                "width": "",
                                "class": "",
                                "id": ""
                            },
                            "default_value": "",
                            "placeholder": "",
                            "prepend": "",
                            "append": "",
                            "maxlength": ""
                        },
                        {
                            "key": "field_57bca621157e7",
                            "label": "Sub items",
                            "name": "sub_items",
                            "type": "repeater",
                            "instructions": "This drop down menu will list columns of sub categories. Each containing several links to categories though-out the store.",
                            "required": 0,
                            "conditional_logic": 0,
                            "wrapper": {
                                "width": "",
                                "class": "",
                                "id": ""
                            },
                            "collapsed": "field_57bcb4582a2b0",
                            "min": "",
                            "max": "",
                            "layout": "block",
                            "button_label": "Add sub category",
                            "sub_fields": [
                                {
                                    "key": "field_57bcb4582a2b0",
                                    "label": "Sub title",
                                    "name": "sub_title",
                                    "type": "text",
                                    "instructions": "",
                                    "required": 0,
                                    "conditional_logic": 0,
                                    "wrapper": {
                                        "width": "50",
                                        "class": "",
                                        "id": ""
                                    },
                                    "default_value": "",
                                    "placeholder": "",
                                    "prepend": "",
                                    "append": "",
                                    "maxlength": ""
                                },
                                {
                                    "key": "field_57bcbb00c5260",
                                    "label": "Sub title link",
                                    "name": "sub_title_link",
                                    "type": "taxonomy",
                                    "instructions": "",
                                    "required": 0,
                                    "conditional_logic": 0,
                                    "wrapper": {
                                        "width": "50",
                                        "class": "",
                                        "id": ""
                                    },
                                    "taxonomy": "product_cat",
                                    "field_type": "select",
                                    "allow_null": 1,
                                    "add_term": 1,
                                    "save_terms": 0,
                                    "load_terms": 0,
                                    "return_format": "id",
                                    "multiple": 0
                                },
                                {
                                    "key": "field_57bcb4622a2b1",
                                    "label": "Categories",
                                    "name": "categories",
                                    "type": "taxonomy",
                                    "instructions": "Select Categories to display",
                                    "required": 0,
                                    "conditional_logic": 0,
                                    "wrapper": {
                                        "width": "",
                                        "class": "",
                                        "id": ""
                                    },
                                    "taxonomy": "product_cat",
                                    "field_type": "multi_select",
                                    "allow_null": 0,
                                    "add_term": 1,
                                    "save_terms": 0,
                                    "load_terms": 0,
                                    "return_format": "id",
                                    "multiple": 0
                                }
                            ]
                        }
                    ],
                    "min": "",
                    "max": ""
                }
            ]
        },
        {
            "key": "field_56df11d86a2ee",
            "label": "",
            "name": "",
            "type": "message",
            "instructions": "",
            "required": 0,
            "conditional_logic": 0,
            "wrapper": {
                "width": "",
                "class": "",
                "id": ""
            },
            "message": "<script type=\"text\/javascript\" defer=\"defer\">\r\n  ( function( $ ) {\r\n    acf.add_action('load', function( $el ){\r\n      $( 'div.values > [data-layout=\"product_category\"]' ).each( function(){\r\n        var $name     = $( '[data-name=\"menu_item_name\"] input[type=\"text\"]', $( this ) );\r\n        var $fallback = $( '.select2-chosen', $( this ) );\r\n        $name         = $name.clone().val();\r\n        $fallback     = $fallback.clone().text();\r\n        $name         = $name + ' \/ ' + $fallback;\r\n        var $title    = $( '.acf-fc-layout-handle', $( this ) );\r\n        var $strong   = $( '<strong>' );\r\n        $strong.append( $name );\r\n        $strong.appendTo( $title );\r\n      });\r\n\r\n      $( 'div.values > [data-layout=\"custom_link\"]' ).each( function(){\r\n        var $name     = $( '[data-name=\"menu_item_name\"] input[type=\"text\"]', $( this ) );\r\n        $name         = $name.clone().val();\r\n        $name         = $name\r\n        var $title    = $( '.acf-fc-layout-handle', $( this ) );\r\n        var $strong   = $( '<strong>' );\r\n        $strong.append( $name );\r\n        $strong.appendTo( $title );\r\n      });\r\n    });\r\n  } ( jQuery ) );\r\n  <\/script>",
            "new_lines": "",
            "esc_html": 0
        }
    ],
    "location": [
        [
            {
                "param": "options_page",
                "operator": "==",
                "value": "acf-options-main-menu"
            }
        ]
    ],
    "menu_order": 0,
    "position": "normal",
    "style": "default",
    "label_placement": "top",
    "instruction_placement": "label",
    "hide_on_screen": "",
    "active": 1,
    "description": "",
    "modified": 1472024431
}