{
    "key": "group_57a4425c91ba4",
    "title": "Banner layout",
    "fields": [
        {
            "key": "field_57a44307c62cc",
            "label": "Banner Layout",
            "name": "layout_style",
            "type": "radio",
            "instructions": "Choose the layout for this banner group",
            "required": 1,
            "conditional_logic": 0,
            "wrapper": {
                "width": "",
                "class": "",
                "id": ""
            },
            "choices": {
                "1": "Single",
                "2": "Double",
                "3": "Triple",
                "4": "Many"
            },
            "allow_null": 0,
            "other_choice": 0,
            "save_other_choice": 0,
            "default_value": "1 : Single",
            "layout": "horizontal"
        }
    ],
    "location": [
        [
            {
                "param": "taxonomy",
                "operator": "==",
                "value": "banner_group"
            }
        ]
    ],
    "menu_order": 0,
    "position": "acf_after_title",
    "style": "default",
    "label_placement": "left",
    "instruction_placement": "field",
    "hide_on_screen": "",
    "active": 1,
    "description": "",
    "modified": 1470385124
}