{
  "hosting": {
    "public": "dist/apps/simple-multi-page",
    "ignore": [
      "firebase.json",
      "**/.*",
      "**/node_modules/**"
    ],
    "rewrites": [
      {
        "source": "**",
        "destination": "/index.html"
      }
    ]
  },
  "functions": {
    "predeploy": "npm --prefix \"$RESOURCE_DIR\" run build",
    "source": "functions"
  },
  "database": {
    "rules": "database.rules.json"
  }
}
