version="0.1"
tags={
	"Utilities"
	"Map"
	"Military"
	"National Focuses"
	"Technologies"
	"Alternative History"
	"Balance"
	"Events"
	"Fixes"
	"Gameplay"
	"Graphics"
	"Historical"
	"Ideologies"
}
name="Road To Lamanite"
supported_version="1.11.10"
remote_file_id="2796766036"