Loading plugins phase: Elapsed time ==> 0s.260ms
<CYPRESSTAG name="CyDsfit arguments...">
cydsfit arguments: -.fdsnotice -.fdswarpdepfile=warp_dependencies.txt -.fdselabdepfile=elab_dependencies.txt -.fdsbldfile=generated_files.txt -.fdsreffile=referenced_files.txt -p D:\Emilio Work Space\Serrure.cydsn\Serrure.cyprj -d CY8C5888LTI-LP097 -s D:\Emilio Work Space\Serrure.cydsn\Generated_Source\PSoC5 -- -yv2 -q10 -ygs -o2 -v3 -.fftcfgtype=LE
</CYPRESSTAG>
<CYPRESSTAG name="Design elaboration results...">
ADD: sdb.M0052: error: Unable to find component "cy_boot_v5_70".

</CYPRESSTAG>
Elaboration phase: Elapsed time ==> 1s.920ms
