ARM GAS  C:\Cache\ccCtM5Kc.s 			page 1


   1              		.syntax unified
   2              		.cpu cortex-m3
   3              		.fpu softvfp
   4              		.eabi_attribute 20, 1
   5              		.eabi_attribute 21, 1
   6              		.eabi_attribute 23, 3
   7              		.eabi_attribute 24, 1
   8              		.eabi_attribute 25, 1
   9              		.eabi_attribute 26, 1
  10              		.eabi_attribute 30, 1
  11              		.eabi_attribute 34, 1
  12              		.eabi_attribute 18, 4
  13              		.thumb
  14              		.syntax unified
  15              		.file	"main.c"
  16              		.text
  17              	.Ltext0:
  18              		.cfi_sections	.debug_frame
  19              		.section	.text.main,"ax",%progbits
  20              		.align	2
  21              		.global	main
  22              		.thumb
  23              		.thumb_func
  24              		.type	main, %function
  25              	main:
  26              	.LFB64:
  27              		.file 1 "main.c"
   1:main.c        **** /* Emilio MARITON BTS 951 17/11/2021 */
   2:main.c        **** 
   3:main.c        **** //(00 58 13 AD E6) ID à obtenir
   4:main.c        **** 
   5:main.c        **** #include "project.h"
   6:main.c        **** #include "stdio.h"
   7:main.c        **** 
   8:main.c        **** 
   9:main.c        **** 
  10:main.c        **** int main(void)
  11:main.c        **** {
  28              		.loc 1 11 0
  29              		.cfi_startproc
  30              		@ Volatile: function does not return.
  31              		@ args = 0, pretend = 0, frame = 0
  32              		@ frame_needed = 0, uses_anonymous_args = 0
  33 0000 08B5     		push	{r3, lr}
  34              		.cfi_def_cfa_offset 8
  35              		.cfi_offset 3, -8
  36              		.cfi_offset 14, -4
  12:main.c        ****     CyGlobalIntEnable; //Active toutes les interuptions
  37              		.loc 1 12 0
  38              		.syntax unified
  39              	@ 12 "main.c" 1
  40 0002 62B6     		CPSIE   i
  41              	@ 0 "" 2
  13:main.c        ****     UART_Start();//Initialise le bloc UART
  42              		.loc 1 13 0
  43              		.thumb
  44              		.syntax unified
ARM GAS  C:\Cache\ccCtM5Kc.s 			page 2


  45 0004 FFF7FEFF 		bl	UART_Start
  46              	.LVL0:
  14:main.c        ****     rfid_Start();
  47              		.loc 1 14 0
  48 0008 FFF7FEFF 		bl	rfid_Start
  49              	.LVL1:
  15:main.c        ****     UART_PutString("Fin Init");//Informe de la fin de la phase d'initialisation
  50              		.loc 1 15 0
  51 000c 0148     		ldr	r0, .L4
  52 000e FFF7FEFF 		bl	UART_PutString
  53              	.LVL2:
  54              	.L2:
  55 0012 FEE7     		b	.L2
  56              	.L5:
  57              		.align	2
  58              	.L4:
  59 0014 00000000 		.word	.LC0
  60              		.cfi_endproc
  61              	.LFE64:
  62              		.size	main, .-main
  63              		.section	.rodata.str1.4,"aMS",%progbits,1
  64              		.align	2
  65              	.LC0:
  66 0000 46696E20 		.ascii	"Fin Init\000"
  66      496E6974 
  66      00
  67              		.text
  68              	.Letext0:
  69              		.file 2 "c:\\program files (x86)\\cypress\\psoc creator\\4.2\\psoc creator\\import\\gnu\\arm\\5.4.
  70              		.file 3 "c:\\program files (x86)\\cypress\\psoc creator\\4.2\\psoc creator\\import\\gnu\\arm\\5.4.
  71              		.file 4 "Generated_Source\\PSoC5/UART.h"
  72              		.file 5 "Generated_Source\\PSoC5/rfid.h"
  73              		.file 6 "Generated_Source\\PSoC5/core_cm3.h"
  74              		.section	.debug_info,"",%progbits
  75              	.Ldebug_info0:
  76 0000 12010000 		.4byte	0x112
  77 0004 0400     		.2byte	0x4
  78 0006 00000000 		.4byte	.Ldebug_abbrev0
  79 000a 04       		.byte	0x4
  80 000b 01       		.uleb128 0x1
  81 000c 8F000000 		.4byte	.LASF19
  82 0010 0C       		.byte	0xc
  83 0011 2E000000 		.4byte	.LASF20
  84 0015 35000000 		.4byte	.LASF21
  85 0019 00000000 		.4byte	.Ldebug_ranges0+0
  86 001d 00000000 		.4byte	0
  87 0021 00000000 		.4byte	.Ldebug_line0
  88 0025 02       		.uleb128 0x2
  89 0026 01       		.byte	0x1
  90 0027 06       		.byte	0x6
  91 0028 90010000 		.4byte	.LASF0
  92 002c 02       		.uleb128 0x2
  93 002d 01       		.byte	0x1
  94 002e 08       		.byte	0x8
  95 002f 51010000 		.4byte	.LASF1
  96 0033 02       		.uleb128 0x2
  97 0034 02       		.byte	0x2
ARM GAS  C:\Cache\ccCtM5Kc.s 			page 3


  98 0035 05       		.byte	0x5
  99 0036 B8010000 		.4byte	.LASF2
 100 003a 02       		.uleb128 0x2
 101 003b 02       		.byte	0x2
 102 003c 07       		.byte	0x7
 103 003d 0E000000 		.4byte	.LASF3
 104 0041 03       		.uleb128 0x3
 105 0042 A8010000 		.4byte	.LASF9
 106 0046 02       		.byte	0x2
 107 0047 3F       		.byte	0x3f
 108 0048 4C000000 		.4byte	0x4c
 109 004c 02       		.uleb128 0x2
 110 004d 04       		.byte	0x4
 111 004e 05       		.byte	0x5
 112 004f 64010000 		.4byte	.LASF4
 113 0053 02       		.uleb128 0x2
 114 0054 04       		.byte	0x4
 115 0055 07       		.byte	0x7
 116 0056 1D010000 		.4byte	.LASF5
 117 005a 02       		.uleb128 0x2
 118 005b 08       		.byte	0x8
 119 005c 05       		.byte	0x5
 120 005d 00000000 		.4byte	.LASF6
 121 0061 02       		.uleb128 0x2
 122 0062 08       		.byte	0x8
 123 0063 07       		.byte	0x7
 124 0064 2F010000 		.4byte	.LASF7
 125 0068 04       		.uleb128 0x4
 126 0069 04       		.byte	0x4
 127 006a 05       		.byte	0x5
 128 006b 696E7400 		.ascii	"int\000"
 129 006f 02       		.uleb128 0x2
 130 0070 04       		.byte	0x4
 131 0071 07       		.byte	0x7
 132 0072 21000000 		.4byte	.LASF8
 133 0076 03       		.uleb128 0x3
 134 0077 C2010000 		.4byte	.LASF10
 135 007b 03       		.byte	0x3
 136 007c 2C       		.byte	0x2c
 137 007d 41000000 		.4byte	0x41
 138 0081 02       		.uleb128 0x2
 139 0082 04       		.byte	0x4
 140 0083 04       		.byte	0x4
 141 0084 B2010000 		.4byte	.LASF11
 142 0088 02       		.uleb128 0x2
 143 0089 08       		.byte	0x8
 144 008a 04       		.byte	0x4
 145 008b 6D010000 		.4byte	.LASF12
 146 008f 02       		.uleb128 0x2
 147 0090 01       		.byte	0x1
 148 0091 08       		.byte	0x8
 149 0092 5F010000 		.4byte	.LASF13
 150 0096 02       		.uleb128 0x2
 151 0097 08       		.byte	0x8
 152 0098 04       		.byte	0x4
 153 0099 9C010000 		.4byte	.LASF14
 154 009d 02       		.uleb128 0x2
ARM GAS  C:\Cache\ccCtM5Kc.s 			page 4


 155 009e 04       		.byte	0x4
 156 009f 07       		.byte	0x7
 157 00a0 CA010000 		.4byte	.LASF15
 158 00a4 05       		.uleb128 0x5
 159 00a5 8A000000 		.4byte	.LASF22
 160 00a9 01       		.byte	0x1
 161 00aa 0A       		.byte	0xa
 162 00ab 68000000 		.4byte	0x68
 163 00af 00000000 		.4byte	.LFB64
 164 00b3 18000000 		.4byte	.LFE64-.LFB64
 165 00b7 01       		.uleb128 0x1
 166 00b8 9C       		.byte	0x9c
 167 00b9 E3000000 		.4byte	0xe3
 168 00bd 06       		.uleb128 0x6
 169 00be 08000000 		.4byte	.LVL0
 170 00c2 F4000000 		.4byte	0xf4
 171 00c6 06       		.uleb128 0x6
 172 00c7 0C000000 		.4byte	.LVL1
 173 00cb FF000000 		.4byte	0xff
 174 00cf 07       		.uleb128 0x7
 175 00d0 12000000 		.4byte	.LVL2
 176 00d4 0A010000 		.4byte	0x10a
 177 00d8 08       		.uleb128 0x8
 178 00d9 01       		.uleb128 0x1
 179 00da 50       		.byte	0x50
 180 00db 05       		.uleb128 0x5
 181 00dc 03       		.byte	0x3
 182 00dd 00000000 		.4byte	.LC0
 183 00e1 00       		.byte	0
 184 00e2 00       		.byte	0
 185 00e3 09       		.uleb128 0x9
 186 00e4 83010000 		.4byte	.LASF23
 187 00e8 06       		.byte	0x6
 188 00e9 1207     		.2byte	0x712
 189 00eb EF000000 		.4byte	0xef
 190 00ef 0A       		.uleb128 0xa
 191 00f0 76000000 		.4byte	0x76
 192 00f4 0B       		.uleb128 0xb
 193 00f5 46010000 		.4byte	.LASF16
 194 00f9 46010000 		.4byte	.LASF16
 195 00fd 04       		.byte	0x4
 196 00fe 54       		.byte	0x54
 197 00ff 0B       		.uleb128 0xb
 198 0100 D3010000 		.4byte	.LASF17
 199 0104 D3010000 		.4byte	.LASF17
 200 0108 05       		.byte	0x5
 201 0109 17       		.byte	0x17
 202 010a 0B       		.uleb128 0xb
 203 010b 74010000 		.4byte	.LASF18
 204 010f 74010000 		.4byte	.LASF18
 205 0113 04       		.byte	0x4
 206 0114 8B       		.byte	0x8b
 207 0115 00       		.byte	0
 208              		.section	.debug_abbrev,"",%progbits
 209              	.Ldebug_abbrev0:
 210 0000 01       		.uleb128 0x1
 211 0001 11       		.uleb128 0x11
ARM GAS  C:\Cache\ccCtM5Kc.s 			page 5


 212 0002 01       		.byte	0x1
 213 0003 25       		.uleb128 0x25
 214 0004 0E       		.uleb128 0xe
 215 0005 13       		.uleb128 0x13
 216 0006 0B       		.uleb128 0xb
 217 0007 03       		.uleb128 0x3
 218 0008 0E       		.uleb128 0xe
 219 0009 1B       		.uleb128 0x1b
 220 000a 0E       		.uleb128 0xe
 221 000b 55       		.uleb128 0x55
 222 000c 17       		.uleb128 0x17
 223 000d 11       		.uleb128 0x11
 224 000e 01       		.uleb128 0x1
 225 000f 10       		.uleb128 0x10
 226 0010 17       		.uleb128 0x17
 227 0011 00       		.byte	0
 228 0012 00       		.byte	0
 229 0013 02       		.uleb128 0x2
 230 0014 24       		.uleb128 0x24
 231 0015 00       		.byte	0
 232 0016 0B       		.uleb128 0xb
 233 0017 0B       		.uleb128 0xb
 234 0018 3E       		.uleb128 0x3e
 235 0019 0B       		.uleb128 0xb
 236 001a 03       		.uleb128 0x3
 237 001b 0E       		.uleb128 0xe
 238 001c 00       		.byte	0
 239 001d 00       		.byte	0
 240 001e 03       		.uleb128 0x3
 241 001f 16       		.uleb128 0x16
 242 0020 00       		.byte	0
 243 0021 03       		.uleb128 0x3
 244 0022 0E       		.uleb128 0xe
 245 0023 3A       		.uleb128 0x3a
 246 0024 0B       		.uleb128 0xb
 247 0025 3B       		.uleb128 0x3b
 248 0026 0B       		.uleb128 0xb
 249 0027 49       		.uleb128 0x49
 250 0028 13       		.uleb128 0x13
 251 0029 00       		.byte	0
 252 002a 00       		.byte	0
 253 002b 04       		.uleb128 0x4
 254 002c 24       		.uleb128 0x24
 255 002d 00       		.byte	0
 256 002e 0B       		.uleb128 0xb
 257 002f 0B       		.uleb128 0xb
 258 0030 3E       		.uleb128 0x3e
 259 0031 0B       		.uleb128 0xb
 260 0032 03       		.uleb128 0x3
 261 0033 08       		.uleb128 0x8
 262 0034 00       		.byte	0
 263 0035 00       		.byte	0
 264 0036 05       		.uleb128 0x5
 265 0037 2E       		.uleb128 0x2e
 266 0038 01       		.byte	0x1
 267 0039 3F       		.uleb128 0x3f
 268 003a 19       		.uleb128 0x19
ARM GAS  C:\Cache\ccCtM5Kc.s 			page 6


 269 003b 03       		.uleb128 0x3
 270 003c 0E       		.uleb128 0xe
 271 003d 3A       		.uleb128 0x3a
 272 003e 0B       		.uleb128 0xb
 273 003f 3B       		.uleb128 0x3b
 274 0040 0B       		.uleb128 0xb
 275 0041 27       		.uleb128 0x27
 276 0042 19       		.uleb128 0x19
 277 0043 49       		.uleb128 0x49
 278 0044 13       		.uleb128 0x13
 279 0045 8701     		.uleb128 0x87
 280 0047 19       		.uleb128 0x19
 281 0048 11       		.uleb128 0x11
 282 0049 01       		.uleb128 0x1
 283 004a 12       		.uleb128 0x12
 284 004b 06       		.uleb128 0x6
 285 004c 40       		.uleb128 0x40
 286 004d 18       		.uleb128 0x18
 287 004e 9742     		.uleb128 0x2117
 288 0050 19       		.uleb128 0x19
 289 0051 01       		.uleb128 0x1
 290 0052 13       		.uleb128 0x13
 291 0053 00       		.byte	0
 292 0054 00       		.byte	0
 293 0055 06       		.uleb128 0x6
 294 0056 898201   		.uleb128 0x4109
 295 0059 00       		.byte	0
 296 005a 11       		.uleb128 0x11
 297 005b 01       		.uleb128 0x1
 298 005c 31       		.uleb128 0x31
 299 005d 13       		.uleb128 0x13
 300 005e 00       		.byte	0
 301 005f 00       		.byte	0
 302 0060 07       		.uleb128 0x7
 303 0061 898201   		.uleb128 0x4109
 304 0064 01       		.byte	0x1
 305 0065 11       		.uleb128 0x11
 306 0066 01       		.uleb128 0x1
 307 0067 31       		.uleb128 0x31
 308 0068 13       		.uleb128 0x13
 309 0069 00       		.byte	0
 310 006a 00       		.byte	0
 311 006b 08       		.uleb128 0x8
 312 006c 8A8201   		.uleb128 0x410a
 313 006f 00       		.byte	0
 314 0070 02       		.uleb128 0x2
 315 0071 18       		.uleb128 0x18
 316 0072 9142     		.uleb128 0x2111
 317 0074 18       		.uleb128 0x18
 318 0075 00       		.byte	0
 319 0076 00       		.byte	0
 320 0077 09       		.uleb128 0x9
 321 0078 34       		.uleb128 0x34
 322 0079 00       		.byte	0
 323 007a 03       		.uleb128 0x3
 324 007b 0E       		.uleb128 0xe
 325 007c 3A       		.uleb128 0x3a
ARM GAS  C:\Cache\ccCtM5Kc.s 			page 7


 326 007d 0B       		.uleb128 0xb
 327 007e 3B       		.uleb128 0x3b
 328 007f 05       		.uleb128 0x5
 329 0080 49       		.uleb128 0x49
 330 0081 13       		.uleb128 0x13
 331 0082 3F       		.uleb128 0x3f
 332 0083 19       		.uleb128 0x19
 333 0084 3C       		.uleb128 0x3c
 334 0085 19       		.uleb128 0x19
 335 0086 00       		.byte	0
 336 0087 00       		.byte	0
 337 0088 0A       		.uleb128 0xa
 338 0089 35       		.uleb128 0x35
 339 008a 00       		.byte	0
 340 008b 49       		.uleb128 0x49
 341 008c 13       		.uleb128 0x13
 342 008d 00       		.byte	0
 343 008e 00       		.byte	0
 344 008f 0B       		.uleb128 0xb
 345 0090 2E       		.uleb128 0x2e
 346 0091 00       		.byte	0
 347 0092 3F       		.uleb128 0x3f
 348 0093 19       		.uleb128 0x19
 349 0094 3C       		.uleb128 0x3c
 350 0095 19       		.uleb128 0x19
 351 0096 6E       		.uleb128 0x6e
 352 0097 0E       		.uleb128 0xe
 353 0098 03       		.uleb128 0x3
 354 0099 0E       		.uleb128 0xe
 355 009a 3A       		.uleb128 0x3a
 356 009b 0B       		.uleb128 0xb
 357 009c 3B       		.uleb128 0x3b
 358 009d 0B       		.uleb128 0xb
 359 009e 00       		.byte	0
 360 009f 00       		.byte	0
 361 00a0 00       		.byte	0
 362              		.section	.debug_aranges,"",%progbits
 363 0000 1C000000 		.4byte	0x1c
 364 0004 0200     		.2byte	0x2
 365 0006 00000000 		.4byte	.Ldebug_info0
 366 000a 04       		.byte	0x4
 367 000b 00       		.byte	0
 368 000c 0000     		.2byte	0
 369 000e 0000     		.2byte	0
 370 0010 00000000 		.4byte	.LFB64
 371 0014 18000000 		.4byte	.LFE64-.LFB64
 372 0018 00000000 		.4byte	0
 373 001c 00000000 		.4byte	0
 374              		.section	.debug_ranges,"",%progbits
 375              	.Ldebug_ranges0:
 376 0000 00000000 		.4byte	.LFB64
 377 0004 18000000 		.4byte	.LFE64
 378 0008 00000000 		.4byte	0
 379 000c 00000000 		.4byte	0
 380              		.section	.debug_line,"",%progbits
 381              	.Ldebug_line0:
 382 0000 6C010000 		.section	.debug_str,"MS",%progbits,1
ARM GAS  C:\Cache\ccCtM5Kc.s 			page 8


 382      02005301 
 382      00000201 
 382      FB0E0D00 
 382      01010101 
 383              	.LASF6:
 384 0000 6C6F6E67 		.ascii	"long long int\000"
 384      206C6F6E 
 384      6720696E 
 384      7400
 385              	.LASF3:
 386 000e 73686F72 		.ascii	"short unsigned int\000"
 386      7420756E 
 386      7369676E 
 386      65642069 
 386      6E7400
 387              	.LASF8:
 388 0021 756E7369 		.ascii	"unsigned int\000"
 388      676E6564 
 388      20696E74 
 388      00
 389              	.LASF20:
 390 002e 6D61696E 		.ascii	"main.c\000"
 390      2E6300
 391              	.LASF21:
 392 0035 503A5C54 		.ascii	"P:\\Travaux pratique\\Electronique\\Mini projet Ser"
 392      72617661 
 392      75782070 
 392      72617469 
 392      7175655C 
 393 0065 72757265 		.ascii	"rure\\Emilio Work Space\\Serrure.cydsn\000"
 393      5C456D69 
 393      6C696F20 
 393      576F726B 
 393      20537061 
 394              	.LASF22:
 395 008a 6D61696E 		.ascii	"main\000"
 395      00
 396              	.LASF19:
 397 008f 474E5520 		.ascii	"GNU C11 5.4.1 20160609 (release) [ARM/embedded-5-br"
 397      43313120 
 397      352E342E 
 397      31203230 
 397      31363036 
 398 00c2 616E6368 		.ascii	"anch revision 237715] -mcpu=cortex-m3 -mthumb -g -O"
 398      20726576 
 398      6973696F 
 398      6E203233 
 398      37373135 
 399 00f5 67202D66 		.ascii	"g -ffunction-sections -ffat-lto-objects\000"
 399      66756E63 
 399      74696F6E 
 399      2D736563 
 399      74696F6E 
 400              	.LASF5:
 401 011d 6C6F6E67 		.ascii	"long unsigned int\000"
 401      20756E73 
 401      69676E65 
ARM GAS  C:\Cache\ccCtM5Kc.s 			page 9


 401      6420696E 
 401      7400
 402              	.LASF7:
 403 012f 6C6F6E67 		.ascii	"long long unsigned int\000"
 403      206C6F6E 
 403      6720756E 
 403      7369676E 
 403      65642069 
 404              	.LASF16:
 405 0146 55415254 		.ascii	"UART_Start\000"
 405      5F537461 
 405      727400
 406              	.LASF1:
 407 0151 756E7369 		.ascii	"unsigned char\000"
 407      676E6564 
 407      20636861 
 407      7200
 408              	.LASF13:
 409 015f 63686172 		.ascii	"char\000"
 409      00
 410              	.LASF4:
 411 0164 6C6F6E67 		.ascii	"long int\000"
 411      20696E74 
 411      00
 412              	.LASF12:
 413 016d 646F7562 		.ascii	"double\000"
 413      6C6500
 414              	.LASF18:
 415 0174 55415254 		.ascii	"UART_PutString\000"
 415      5F507574 
 415      53747269 
 415      6E6700
 416              	.LASF23:
 417 0183 49544D5F 		.ascii	"ITM_RxBuffer\000"
 417      52784275 
 417      66666572 
 417      00
 418              	.LASF0:
 419 0190 7369676E 		.ascii	"signed char\000"
 419      65642063 
 419      68617200 
 420              	.LASF14:
 421 019c 6C6F6E67 		.ascii	"long double\000"
 421      20646F75 
 421      626C6500 
 422              	.LASF9:
 423 01a8 5F5F696E 		.ascii	"__int32_t\000"
 423      7433325F 
 423      7400
 424              	.LASF11:
 425 01b2 666C6F61 		.ascii	"float\000"
 425      7400
 426              	.LASF2:
 427 01b8 73686F72 		.ascii	"short int\000"
 427      7420696E 
 427      7400
 428              	.LASF10:
ARM GAS  C:\Cache\ccCtM5Kc.s 			page 10


 429 01c2 696E7433 		.ascii	"int32_t\000"
 429      325F7400 
 430              	.LASF15:
 431 01ca 73697A65 		.ascii	"sizetype\000"
 431      74797065 
 431      00
 432              	.LASF17:
 433 01d3 72666964 		.ascii	"rfid_Start\000"
 433      5F537461 
 433      727400
 434              		.ident	"GCC: (GNU Tools for ARM Embedded Processors) 5.4.1 20160609 (release) [ARM/embedded-5-bran
