id,name,model_id:id,group_id:id,perm_read,perm_write,perm_create,perm_unlink
access_feosco_hr_employee_exit,feosco.hr.employee.exit,model_feosco_hr_employee_exit,base.group_user,1,1,1,0
access_feosco_hr_employee_work_history,feosco.hr.employee.work.history,model_feosco_hr_employee_work_history,base.group_user,1,1,1,0
access_resource_calendar_leaves_base_group_user,resource.calendar.leaves employee,resource.model_resource_calendar_leaves,base.group_user,1,1,1,1
access_resource_calendar_leaves_group_hr_dept_head,resource.calendar.leaves dept head,resource.model_resource_calendar_leaves,base.group_hr_dept_head,1,1,1,1
access_feosco_hr_employee_history,feosco.hr.employee.history,model_feosco_hr_employee_history,base.group_user,1,1,1,0
access_feosco_hr_work_handover,feosco.hr.work.handover,model_feosco_hr_work_handover,base.group_user,1,1,1,1