id,name,model_id:id,group_id:id,perm_read,perm_write,perm_create,perm_unlink
access_feosco_hr_payroll,feosco.hr.payroll.dependency,model_feosco_hr_payroll_dependency,base.group_user,1,1,1,0
access_feosco_hr_payroll_allowance_user,feosco.hr.payroll.allowance,model_feosco_hr_payroll_allowance,base.group_user,1,0,0,0
access_feosco_hr_payroll_allowance_manager,feosco.hr.payroll.allowance,model_feosco_hr_payroll_allowance,base.group_hr_manager,1,1,1,1
access_hr_payslip,hr.payslip,model_hr_payslip,base.group_hr_manager,1,1,1,1



