id,name,model_id:id,group_id:id,perm_read,perm_write,perm_create,perm_unlink
access_crm_claim_user,crm.claim.user,model_crm_claim,base.group_user,1,0,0,0
access_feosco_claim_groups_user,feosco.claim.groups,model_feosco_claim_groups,base.group_user,1,0,0,0
access_feosco_crm_claim_report_user,feosco.crm.claim.report,model_feosco_crm_claim_report,base.group_user,1,0,0,0
access_feosco_faq_user,feosco.faq,model_feosco_faq,base.group_user,1,0,0,0

access_feosco_claim_groups_user,feosco.claim.groups,model_feosco_claim_groups,base.group_user,1,0,0,0
access_crm_case_channel_feosco_user,crm.case.channel,crm.model_crm_tracking_medium,base.group_user,1,0,0,0
access_feosco_crm_claim_history_user,feosco.crm.claim.history,model_feosco_crm_claim_history,base.group_user,1,1,1,0
access_crm_claim_stage_user,crm.claim.stage,crm_claim.model_crm_claim_stage,base.group_user,1,1,1,0
access_crm_claim_helpdesk,crm.claim.user,model_crm_claim,base.help_desk,1,1,1,0
access_feosco_claim_groups_helpdesk,feosco.claim.groups,model_feosco_claim_groups,base.help_desk,1,1,1,0
access_feosco_crm_claim_helpdesk_user,feosco.crm.claim.report,model_feosco_crm_claim_report,base.help_desk,1,1,1,0
access_feosco_faq_helpdesk,feosco.faq,model_feosco_faq,base.help_desk,1,1,1,0
access_crm_case_channel_helpdesk,crm.case.channel,crm.model_crm_tracking_medium,base.help_desk,1,1,1,0
access_crm_claim_public,crm.claim.user,model_crm_claim,base.group_public,1,0,0,0
access_feosco_claim_groups_public,feosco.claim.groups,model_feosco_claim_groups,base.group_public,1,0,0,0
access_feosco_crm_claim_report_public,feosco.crm.claim.report,model_feosco_crm_claim_report,base.group_public,1,0,0,0
access_feosco_faq_public,feosco.faq,model_feosco_faq,base.group_public,1,0,0,0
access_feosco_claim_groups_public,feosco.claim.groups,model_feosco_claim_groups,base.group_public,1,0,0,0
access_crm_case_channel_feosco_public,crm.case.channel,crm.model_crm_tracking_medium,base.group_public,1,0,0,0
access_feosco_crm_claim_history_public,feosco.crm.claim.history,model_feosco_crm_claim_history,base.group_public,1,1,1,0
access_crm_claim_stage_public,crm.claim.stage,crm_claim.model_crm_claim_stage,base.group_public,1,1,1,0
access_feosco_faq_portal_user,feosco.access_feosco_faq_portal_user,model_feosco_faq,base.group_portal,1,0,0,0
access_crm_claim_portal_user,feosco.access_crm_claim_portal_user,model_crm_claim,base.group_portal,1,0,1,0
access_crm_case_categ_portal_user,feosco.access_crm_case_categ_portal_user,model_crm_case_categ,base.group_portal,1,0,0,0
access_feosco_claim_groups_portal_user,feosco.access_feosco_claim_groups_portal_user,model_feosco_claim_groups,base.group_portal,1,0,0,0
access_feosco_master_data_groups_portal_user,feosco.access_feosco_master_data_groups_portal_user,feosco_base.model_feosco_master_data,base.group_portal,1,0,0,0





