id,name,model_id:id,group_id:id,perm_read,perm_write,perm_create,perm_unlink
access_pos_tables_users,pos.tables.user,model_pos_tables,point_of_sale.group_pos_user,1,0,0,0
access_pos_tables_manager,pos.tables.manager,model_pos_tables,point_of_sale.group_pos_manager,1,1,1,1
access_pos_kitchen_users,pos_kitchen.user,model_pos_kitchen,point_of_sale.group_pos_user,1,0,0,0
access_pos_kitchen_manager,pos_kitchen.manager,model_pos_kitchen,point_of_sale.group_pos_manager,1,1,1,1