An Giang,50BB,Chi cục HQ CK Tịnh Biên,00,
An Giang,50BC,Chi cục HQ Vĩnh Hội Đông,00,
An Giang,50BD,Chi cục HQ CK Vĩnh Xương,00,
An Giang,50BJ,Chi cục HQ Bắc Đai,00,
An Giang,50BK,Chi cục HQ Khánh Bình,00,
An Giang,50CE,Chi cục HQ Cảng Mỹ Thới,00,
Bà Rịa-Vũng Tàu,51BE,Chi cục HQ Cảng Cát Lở,00,
Bà Rịa-Vũng Tàu,51C1,Đội Thủ tục hàng hóa XNK  Kho ngoại quan,00,
Bà Rịa-Vũng Tàu,51C2,Đội Thủ tục SP-PSA,00,
Bà Rịa-Vũng Tàu,51CB,Chi cục HQ CK Cảng - Sân bay Vũng Tàu,00,
Bà Rịa-Vũng Tàu,51CH,Chi cục HQ Côn Đảo,00,
Bà Rịa-Vũng Tàu,51CI,Chi cục HQ CK cảng Cái Mép,00,
Bắc Ninh,18A1,Đội TTHQ quản lý KCN Yên Phong,00,
Bắc Ninh,18A2,Đội TTHQ quản lý KCN Quế Võ,00,
Bắc Ninh,18A3,Đội Nghiệp vụ,00,
Bắc Ninh,18B1,Đội Nghiệp vụ,00,
Bắc Ninh,18B2,Đội Thủ tục KCN Yên Bình,00,
Bắc Ninh,18BC,Chi cục HQ Quản lý các KCN Bắc Giang,00,
Bắc Ninh,18ID,Chi cục HQ Cảng nội địa Tiên Sơn,00,
Bình Định,37CB,Chi cục HQ CK Cảng Qui Nhơn,00,
Bình Định,37TC,Chi cục HQ Phú Yên,00,
Bình Dương,43CN,Chi cục HQ CK Cảng tổng hợp Bình Dương,00,
Bình Dương,43IH,Chi cục HQ Sóng Thần,02,
Bình Dương,43K1,Đội Nghiệp vụ - HQ Mỹ Phước,00,
Bình Dương,43K2,Đội TT Khu liên hợp - HQ Mỹ Phước,00,
Bình Dương,43K3,Đội TT Tân Định - HQ Mỹ Phước,00,
Bình Dương,43ND,Chi cục HQ KCN Sóng Thần,00,
Bình Dương,43NF,Chi cục HQ KCN Việt Nam - Singapore,00,
Bình Dương,43NG,Chi cục HQ KCN Việt Hương,00,
Bình Dương,43PB,Chi cục HQ Quản lý hàng hóa XNK ngoài KCN,00,
Bình Phước,61BA,Đội Nghiệp vụ Tổng hợp            ,00,
Bình Phước,61BA,Đội TTHQ CK Tà Vát,01,
Bình Phước,61PA,Đội Nghiệp vụ,00,
Bình Phước,61PA,Đội Nghiệp vụ 2,01,
Bình Phước,61BB,Đội Nghiệp vụ Tổng hợp            ,00,
Bình Phước,61BB,Đội Nghiêp vụ CK Tân Tiến,01,
Cà Mau,59BD,Chi cục HQ Hòa Trung,00,
Cà Mau,59CB,Chi cục HQ CK Cảng Năm Căn,00,
Cần Thơ,54CB,Chi cục HQ CK Cảng Cần Thơ,00,
Cần Thơ,54CD,Chi cục HQ CK Vĩnh Long,00,
Cần Thơ,54PH,Chi cục HQ Tây Đô,00,
Cần Thơ,54PK,Chi cục HQ Sóc Trăng,00,
Cao Bằng,11B1,Chi cục HQ CK Tà Lùng,00,
Cao Bằng,11B2,Đội NV số 2 Nà Lạn                ,00,
Cao Bằng,11BE,Chi cục HQ CK Trà Lĩnh,00,
Cao Bằng,11BF,Chi cục HQ CK Sóc Giang,00,
Cao Bằng,11BH,Chi cục HQ CK Pò Peo,00,
Cao Bằng,11G1,Chi cục HQ CK Bí Hà,00,
Cao Bằng,11G2,Đội NV Lý Vạn,00,
Cao Bằng,11PK,Chi cục HQ Bắc Kạn,00,
Đà Nẵng,34AB,Chi cục HQ CK Sân bay Quốc tế Đà Nẵng,00,
Đà Nẵng,34CC,Chi cục HQ Quản lý hàng đầu tư - gia công,00,
Đà Nẵng,34CE,Chi cục HQ CK Cảng Đà Nẵng,00,
Đà Nẵng,34NG,Chi cục HQ KCN Hòa Khánh - Liên Chiểu,00,
Đà Nẵng,34NH,Chi cục HQ KCN Đà Nẵng,00,
Đắk Lắk,40B1,Chi cục HQ CK BupRăng,00,
Đắk Lắk,40BC,Chi cục HQ Buôn Mê Thuột,01,
Đắk Lắk,40D1,Chi cục HQ Đà Lạt,00,
Điện Biên,12B1,Đội nghiệp vụ,00,
Điện Biên,12B2,Đội Thủ tục Huổi Puốc,00,
Điện Biên,12BE,Chi cục HQ CK Lóng Sập,00,
Điện Biên,12BI,Chi cục HQ CK Chiềng Khương,00,
Điện Biên,12F1,HQ Thị xã Sơn La,00,
Điện Biên,12F2,Đội Nghiệp vụ HQCK Nà Cài         ,00,
Điện Biên,12H1,Đội nghiệp vụ,00,
Điện Biên,12H2,Đội Hải quan Pô Tô                ,00,
Đồng Nai,47D1,Đội nghiệp vụ ,00,
Đồng Nai,47D2,Đội nghiệp vụ 2,00,
Đồng Nai,47D3,Đội nghiệp vụ 3,00,
Đồng Nai,47I1,Đội nghiệp vụ,00,
Đồng Nai,47I2,Đội nghiệp vụ 2,00,
Đồng Nai,47NB,Đội Thủ tục tàu,00,
Đồng Nai,47NB,Chi cục HQ Biên Hoà,00,
Đồng Nai,47NF,Chi cục HQ Thống Nhất,00,
Đồng Nai,47NG,Chi cục HQ Nhơn Trạch,00,
Đồng Nai,47NM,Chi cục HQ QL KCN Bình Thuận,00,
Đồng Nai,47XE,Chi cục HQ KCX Long Bình,00,
Đồng Tháp,49BB,Chi cục HQ CK Thường Phước,00,
Đồng Tháp,49BE,Chi cục HQ Sở Thượng,00,
Đồng Tháp,49BF,Chi cục HQ  Thông Bình,00,
Đồng Tháp,49BG,Chi cục HQ CK Dinh Bà,00,
Đồng Tháp,49C1,Chi cục HQ CK Cảng Đồng Tháp - KV Cao Lãnh,00,
Đồng Tháp,49C2,Chi cục HQ CK Cảng Đồng Tháp - KV Sa Đéc,00,
Gia Lai,38B1,Đội Nghiệp vụ tổng hợp,00,
Gia Lai,38B2,Đội Thủ tục,00,
Gia Lai,38BC,Chi cục HQ CK Bờ Y,00,
Gia Lai,38PD,Chi cục HQ Kon Tum,00,
Hà Giang,10BB,Chi cục HQ CK Thanh Thủy,00,
Hà Giang,10BC,Chi cục HQ CK Xín Mần,00,
Hà Giang,10BD,Chi cục HQ CK Phó Bảng,00,
Hà Giang,10BF,Chi cục HQ CK Săm Pun,00,
Hà Giang,10BI,Chi cục HQ Tuyên Quang,00,
Hà Nội,01AC,Chi cục HQ Gia Lâm,00,
Hà Nội,01B1,Đội Thủ tục hàng hóa xuất,00,
Hà Nội,01B2,Đội Thủ tục chuyển phát nhanh,00,
Hà Nội,01B3,Đội Thủ tục hàng hóa nhập,00,
Hà Nội,01BT,Chi cục HQ Yên Bái,00,
Hà Nội,01D1,Đội Thủ tục HH XNK liên tỉnh,00,
Hà Nội,01D2,Đội Thủ tục HH XNK CPN - FeDex        ,00,
Hà Nội,01D3,Đội Thủ tục HH XNK CPN - UPS,00,
Hà Nội,01E1,Đội Nghiệp vụ,00,
Hà Nội,01E2,Đội Hàng không,00,
Hà Nội,01E3,Đội Thủ tục chuyển phát nhanh,00,
Hà Nội,01IK,Chi cục HQ Gia Thụy,00,
Hà Nội,01M1,Đội TTHQ Hà Đông,00,
Hà Nội,01M2,Đội TTHQ Khu CNC Hòa Lạc,00,
Hà Nội,01NV,Chi cục HQ KCN Bắc Thăng Long,00,
Hà Nội,01PJ,Chi cục HQ Phú Thọ,00,
Hà Nội,01PL,Chi cục HQ Quản lý hàng đầu tư - gia công,00,
Hà Nội,01PR,Chi cục HQ Vĩnh Phúc,00,
Hà Nội,01SI,Chi cục HQ Ga đường sắt quốc tế Yên Viên,00,
Hà Tĩnh,30BB,Chi cục HQ CK Quốc tế Cầu Treo,00,
Hà Tĩnh,30BE,Chi cục HQ Hồng Lĩnh,00,
Hà Tĩnh,30BI,Chi cục HQ khu kinh tế CK Cầu Treo,00,
Hà Tĩnh,30CC,Chi cục HQ CK Cảng Xuân Hải,00,
Hà Tĩnh,30F1,Chi cục HQ CK Cảng Vũng Áng,00,
Hà Tĩnh,30F2,Đội Nghiệp vụ cảng Sơn Dương,00,
Hải Phòng,03CC,Đội Thủ tục hàng hóa XNK          ,00,
Hải Phòng,03CD,Đội Nghiệp vụ                     ,00,
Hải Phòng,03CE,Đội Thủ tục hàng hóa XNK          ,00,
Hải Phòng,03EE,Đội Thủ tục hàng hóa XNK          ,00,
Hải Phòng,03NK,Đội Nghiệp vụ                     ,00,
Hải Phòng,03PA,Đội Thủ tục hàng gia công         ,00,
Hải Phòng,03PA,Đội Thủ tục hàng đầu tư           ,00,
Hải Phòng,03PJ,Đội Nghiệp vụ                     ,00,
Hải Phòng,03PL,Đội Nghiệp vụ                     ,00,
Hải Phòng,03TG,Đội Thủ tục hàng hóa XNK          ,01,
Khánh Hoà,41BH,Chi cục HQ Ninh Thuận,00,
Khánh Hoà,41CB,Chi cục HQ CK Cảng Nha Trang,00,
Khánh Hoà,41CC,Chi cục HQ CK Cảng Cam Ranh,00,
Khánh Hoà,41PE,Chi cục HQ Vân Phong,00,
Kiên Giang,53BC,Chi cục HQ CK Quốc Tế Hà Tiên,00,
Kiên Giang,53BK,Chi cục HQ CK Giang Thành,00,
Kiên Giang,53CD,Chi cục HQ CK Cảng Hòn Chông,00,
Kiên Giang,53CH,Chi cục HQ Phú Quốc,00,
Lạng Sơn,15B1,Đội Nghiệp vụ Hữu Nghị,00,
Lạng Sơn,15B2,Đội Nghiệp vụ Co Sâu              ,00,
Lạng Sơn,15BC,Chi cục HQ CK Chi Ma,00,
Lạng Sơn,15BD,Chi cục HQ Cốc Nam,00,
Lạng Sơn,15E1,Đội Nghiệp vụ Na Hình             ,00,
Lạng Sơn,15E2,Đội Nghiệp vụ Nà Nưa,00,
Lạng Sơn,15E3,Đội Nghiệp vụ Bình Nghi,00,
Lạng Sơn,15E4,Đội Nghiệp vụ Tân Thanh,00,
Lạng Sơn,15SI,Chi cục HQ Ga Đồng Đăng,00,
Lào Cai,13BB,Đội Thủ tục HH XNK 1,00,
Lào Cai,13BB,Đội Thủ tục HH XNK 2,00,
Lào Cai,13BC,Chi cục HQ CK Mường Khương,00,
Lào Cai,13BD,Chi cục HQ CK Bát Xát,00,
Lào Cai,13G1,Đội Nghiệp vụ,00,
Lào Cai,13G2,ICD Vinalines,00,
Long An,48BC,Chi cục HQ CK Mỹ Quý Tây,00,
Long An,48BD,Chi cục HQ CK Quốc tế Bình Hiệp,00,
Long An,48BE,Chi cục HQ Hưng Điền,00,
Long An,48BI,Chi cục HQ Đức Hòa,00,
Long An,48CG,Đội Nghiệp vụ,00,
Long An,48F1,Đội Nghiệp vụ KCN Long Hậu,00,
Long An,48F2,Đội Thủ tục- Chi cục HQ Bến Lức,00,
Nghệ An,29BB,Chi cục HQ CK Quốc tế Nậm Cắn,00,
Nghệ An,29BH,Chi cục HQ CK Thanh Thủy,00,
Nghệ An,29CC,Chi cục HQ CK Cảng,00,
Nghệ An,29PF,Chi cục HQ Vinh,00,
Quảng Bình,31BB,Chi cục HQ CK Cha Lo,00,
Quảng Bình,31BF,Chi cục HQ CK Cà Roòng,00,
Quảng Bình,31D1,Đội Nghiệp vụ Cảng Hòn La         ,00,
Quảng Bình,31D2,Đội Nghiệp vụ Đồng Hới            ,00,
Quảng Bình,31D3,Đội Nghiệp vụ Cảng Gianh          ,00,
Quảng Nam,60BD,Chi cục HQ CK Nam Giang,00,
Quảng Nam,60C1,Đội Nghiệp vụ,00,
Quảng Nam,60C2,Đội Tây Giang,00,
Quảng Nam,60CB,Chi cục HQ CK Cảng Kỳ Hà,00,
Quảng Ngãi,35CB,Chi cục HQ CK Cảng Dung Quất,00,
Quảng Ngãi,35NC,Chi cục HQ các KCN Quảng Ngãi,00,
Quảng Ninh,20B1,HQ Cửa khẩu Bắc Luân              ,00,
Quảng Ninh,20B2,HQ Cửa khẩu Ka Long               ,00,
Quảng Ninh,20BC,Chi cục HQ CK Hoành Mô,00,
Quảng Ninh,20BD,Chi cục HQ Bắc Phong Sinh,00,
Quảng Ninh,20CD,Chi cục HQ CK Cảng Cái Lân,00,
Quảng Ninh,20CE,Chi cục HQ Vạn Gia,00,
Quảng Ninh,20CF,Chi cục HQ CK Cảng Hòn Gai,00,
Quảng Ninh,20CG,Chi cục HQ CK Cảng Cẩm Phả,00,
Quảng Trị,32BB,Đội Nghiệp vụ -Tổng hợp           ,00,
Quảng Trị,32BC,Chi cục HQ CK La Lay,00,
Quảng Trị,32BD,Đội Nghiệp vụ -Tổng hợp           ,00,
Quảng Trị,32CD,Chi cục HQ CK Cảng Cửa Việt,00,
Quảng Trị,32VG,Đội Kiẻm soát HQ Quảng Trị        ,00,
Tây Ninh,45B1,Đội Nghiệp vụ,00,
Tây Ninh,45B2,Đội Quản lý Khu TM - CN Mộc Bài   ,00,
Tây Ninh,45BD,Chi cục HQ Phước Tân,00,
Tây Ninh,45BE,Chi cục HQ CK Kà Tum,00,
Tây Ninh,45C1,Đội Nghiệp vụ,00,
Tây Ninh,45C2,Đội thủ tục Hải quan Chàng Riệc   ,00,
Tây Ninh,45F1,Đội Nghiệp vụ,00,
Tây Ninh,45F2,Đội TTHQ KCN Phước Đông,00,
Thanh Hoá,27B1,Chi cục HQ CK Quốc tế Na Mèo,00,
Thanh Hoá,27B2,Đội TTHQ CK Tén Tằn,00,
Thanh Hoá,27F1,Đội TT - Chi cục HQ CK Cảng Thanh Hóa,00,
Thanh Hoá,27F2,Đội TTHQ cảng Nghi Sơn,00,
Thanh Hoá,27NJ,Chi cục HQ Quản lý các KCN Hà Nam,00,
Thanh Hoá,27PC,Đội Nghiêp vụ ,00,
Thanh Hoá,27PC,HQ cảng Ninh Phúc,02,
Thanh Hoá,27PE,Chi cục HQ Nam Định,00,
Thừa Thiên-Huế,33BA,Đội Nghiệp vụ - Chi cục HQ CK A Đớt,00,
Thừa Thiên-Huế,33BA,Đội Nghiệp vụ Hồng Vân,01,
Thừa Thiên-Huế,33CC,Chi cục HQ CK Cảng Thuận An,00,
Thừa Thiên-Huế,33CF,Chi cục HQ CK Cảng Chân Mây,00,
Thừa Thiên-Huế,33PD,Chi cục HQ Thủy An,02,
Hồ Chí Minh,02DS  ,Đội Thủ tục hàng hóa XNK 1,01,
Hồ Chí Minh,02DS  ,Đội Thủ tục hàng hóa XNK 2,02,
Hồ Chí Minh,02DS  ,Đội Thủ tục hàng hóa XNK 3,03,
Hồ Chí Minh,02DS  ,Đội Thủ tục hàng hóa XNK 4,04,
Hồ Chí Minh,02DS  ,Chi cục HQ CPN - Đội DHL,A1,Khai báo hàng PMD
Hồ Chí Minh,02DS  ,Chi cục HQ CPN - Đội FEDEX,A2,Khai báo hàng PMD
Hồ Chí Minh,02DS  ,Chi cục HQ CPN - Đội UPS,A3,Khai báo hàng PMD
Hồ Chí Minh,02DS  ,Chi cục HQ CPN - Đội TNT,A4,Khai báo hàng PMD
Hồ Chí Minh,02DS  ,Chi cục HQ CPN - Đội EMS,A5,Khai báo hàng PMD
Hồ Chí Minh,02DS  ,Chi cục HQ CPN - Đội THANTOC,A6,Khai báo hàng PMD
Hồ Chí Minh,02DS  ,Chi cục HQ CPN - Đội KERRY,A7,Khai báo hàng PMD
Hồ Chí Minh,02DS  ,Chi cục HQ CPN - Đội HOPNHAT,A8,Khai báo hàng PMD
Hồ Chí Minh,02CV  ,Đội Thủ tục hàng hóa nhập khẩu,01,
Hồ Chí Minh,02CV  ,Đội Thủ tục hàng hóa xuất khẩu,02,
Hồ Chí Minh,02CI  ,Đội thủ tục hàng hóa Nhập khẩu,01,
Hồ Chí Minh,02CI  ,Đội thủ tục hàng hóa Xuất khẩu,02,
Hồ Chí Minh,02CI  ,Đội Giám sát,03,
Hồ Chí Minh,02CC  ,Đội thủ tục hàng hóa XNK,01,
Hồ Chí Minh,02CC  ,Đội Giám sát,02,
Hồ Chí Minh,02H1,Đội Thủ tục hàng hóa XNK 1 (cảng Bến Nghé),00,
Hồ Chí Minh,02H2,Đội thủ tục và Giám sát Xăng dầu (kho Xăng dầu),00,
Hồ Chí Minh,02H3,Đội Thủ tục hàng hóa XNK 2 (cảng VICT),00,
Hồ Chí Minh,02IK  ,Đội Thủ tục hàng hóa Nhập khẩu,01,
Hồ Chí Minh,02IK  ,Đội Thủ tục hàng hóa Xuất khẩu,02,
Hồ Chí Minh,02B1,Đội Thủ tục hàng hóa XNK – TCS,00,
Hồ Chí Minh,02B4,Đội Thủ tục hàng hóa XNK – SCSC,00,
Hồ Chí Minh,02CX  ,Đội Thủ tục hàng hóa XNK,00,
Hồ Chí Minh,02F1,Đội Nghiệp vụ 1 (Linh Trung),00,
Hồ Chí Minh,02F2,Đội Nghiệp vụ 2 (Linh Trung 2),00,
Hồ Chí Minh,02F3,Đội Thủ tục Khu Công nghệ cao,00,
Hồ Chí Minh,02XE  ,Đội nghiệp vụ,00,
Hồ Chí Minh,02PG  ,Đội Thủ tục hàng Đầu tư và Kinh doanh,01,
Hồ Chí Minh,02PG  ,Đội Thủ tục hàng Sản xuất xuất khẩu và Gia công,02,
Hồ Chí Minh,02PJ  ,Đội Thủ tục hàng Gia công,01,
Hồ Chí Minh,02PJ  ,Đội Thủ tục Hàng sản xuất xuất khẩu,02,
