id,name,model_id:id,group_id:id,perm_read,perm_write,perm_create,perm_unlink
access_feosco_promotion_profile,Access Feosco Promotion Profile Employee,model_feosco_promotion_profile,base.group_user,1,1,1,1
access_feosco_promotion_product,Access Feosco Promotion Product Employee,model_feosco_promotion_product,base.group_user,1,1,1,1
access_feosco_promotion_method,Access Feosco Promotion Method Employee,model_feosco_promotion_method,base.group_user,1,1,1,1