id,name,model_id:id,group_id:id,perm_read,perm_write,perm_create,perm_unlink
access_feosco_digital_requisition_public,feos_access_feosco_digital_requisition_public,model_feosco_digital_requisition,base.group_public,1,0,0,0
access_feosco_digital_requisition_portal,feos_access_feosco_digital_requisition_portal,model_feosco_digital_requisition,base.group_portal,1,1,1,0
access_digital_requisition_nhom_chi_cuc_hai_quan,feosco.digital.requisition,model_feosco_digital_requisition,digital_base.nhom_chi_cuc_hai_quan,1,1,1,0
access_digital_requisition_nhom_cuc_hai_quan,feosco.digital.requisition,model_feosco_digital_requisition,digital_base.nhom_cuc_hai_quan,1,1,1,0
access_digital_requisition_nhom_giam_sat,feosco.digital.requisition,model_feosco_digital_requisition,digital_base.nhom_giam_sat,1,1,1,0
access_digital_requisition_nhom_tong_cuc_hai_quan,feosco.digital.requisition,model_feosco_digital_requisition,digital_base.nhom_tong_cuc_hai_quan,1,1,1,0

access_ir_attachment_public,feos_access_ir_attachment_public,base.model_ir_attachment,base.group_public,1,0,0,0
access_ir_attachment_nhom_chi_cuc_hai_quan,feosco.ir.attachment,base.model_ir_attachment,digital_base.nhom_chi_cuc_hai_quan,1,1,1,0
access_ir_attachment_nhom_cuc_hai_quan,feosco.digital.requisition,base.model_ir_attachment,digital_base.nhom_cuc_hai_quan,1,1,1,0
access_ir_attachment_nhom_giam_sat,feosco.ir.attachment,base.model_ir_attachment,digital_base.nhom_giam_sat,1,1,1,0
access_ir_attachment_nhom_tong_cuc_hai_quan,feosco.ir.attachment,base.model_ir_attachment,digital_base.nhom_tong_cuc_hai_quan,1,1,1,0