id,name,model_id:id,group_id:id,perm_read,perm_write,perm_create,perm_unlink

access_feosco_contract_mass_consumption_user,access_feosco_contract_mass_consumption_user,model_feosco_contract_mass_consumption,base.group_user,1,0,0,0
access_feosco_contract_mass_consumption_manager,access_feosco_contract_mass_consumption_manager,model_feosco_contract_mass_consumption,base.group_sale_manager,1,1,1,0

access_feosco_contract_payment_penalties_user,access_feosco_contract_payment_penalties_user,model_feosco_contract_payment_penalties,base.group_user,1,0,0,0
access_feosco_contract_payment_penalties_manager,access_feosco_contract_payment_penalties_manager,model_feosco_contract_payment_penalties,base.group_sale_manager,1,1,1,0

access_feosco_contract_support_policy_user,access_feosco_contract_support_policy_user,model_feosco_contract_support_policy,base.group_user,1,0,0,0
access_feosco_contract_support_policy_manager,access_feosco_contract_support_policy_manager,model_feosco_contract_support_policy,base.group_sale_manager,1,1,1,0

