{
    "ru_frontend_msk_remote": {
        "person_id": "sergey",
        "job_id": "frontend",
        "location_id": "moscow",
        "lang": "ru",
        "is_remote": true,
        "experiences_ids": ["aff", "serenity", "neurocore", "finstar", "advertle", "ibank", "w1", "handmagic"]
    },
    "es_sr_dev": {
        "person_id": "sergey",
        "job_id": "developer",
        "location_id": "moscow",
        "lang": "es",
        "is_remote": true,
        "experiences_ids": ["aff", "serenity", "neurocore", "finstar", "advertle", "ibank", "w1", "handmagic"]
    },
    "pt_sr_dev": {
        "person_id": "sergey",
        "job_id": "developer",
        "location_id": "moscow",
        "lang": "pt",
        "is_remote": true,
        "experiences_ids": ["aff", "serenity", "neurocore", "finstar", "advertle", "ibank", "w1", "handmagic"]
    },
    "ru_sr_dev_msk_remote": {
        "person_id": "sergey",
        "job_id": "developer",
        "location_id": "moscow",
        "lang": "ru",
        "is_remote": true,
        "experiences_ids": ["aff"]
    },
    "ru_fullstack_msk_remote": {
        "person_id": "sergey",
        "job_id": "fullstack",
        "location_id": "moscow",
        "is_remote": true,
        "lang": "ru"
    },
    "ru_devops_msk_remote": {
        "person_id": "sergey", 
        "job_id": "devops",
        "location_id": "moscow",
        "lang": "ru"
    },
    "ru_backend_msk_remote": {
        "person_id": "sergey", 
        "job_id": "backend",
        "location_id": "moscow",
        "lang": "ru"
    },
    "ru_ecomerce": {
        "person_id": "sergey",
        "job_id": "ecomerce",
        "location_id": "moscow",
        "lang": "ru"
    },
    "ru_frontend_spb_remote": {
        "person_id": "sergey",
        "job_id": "frontend",
        "location_id": "spb",
        "lang": "ru"
    },
    "ru_fullstack_spb_remote": {
        "person_id": "sergey",
        "job_id": "fullstack",
        "location_id": "spb",
        "lang": "ru"
    },
    "ru_devops_spb_remote": {
        "person_id": "sergey",
        "job_id": "devops",
        "location_id": "spb",
        "lang": "ru"
    },
    "ru_backend_spb_remote": {
        "person_id": "sergey",
        "job_id": "backend",
        "location_id": "spb",
        "lang": "ru"
    },
    "ru_frontend_ekb_remote": {
        "person_id": "sergey",
        "job_id": "frontend",
        "location_id": "ekb",
        "lang": "ru",
        "is_remote": true,
        "experiences_ids": ["neurocore2", "aff", "serenity", "neurocore", "finstar", "advertle", "ibank", "w1"]
    },
    "ru_backend_ekb_remote": {
        "person_id": "sergey",
        "job_id": "backend",
        "location_id": "ekb",
        "lang": "ru",
        "is_remote": true,
        "experiences_ids": ["neurocore2", "aff", "serenity", "neurocore", "finstar", "advertle", "ibank", "w1"]
    },
    "ru_fullstack_ekb_remote": {
        "person_id": "sergey",
        "job_id": "fullstack",
        "location_id": "ekb",
        "lang": "ru",
        "is_remote": true,
        "experiences_ids": ["neurocore2", "aff", "serenity", "neurocore", "finstar", "advertle", "ibank", "w1"]
    },
    "ru_frontend_novosibirsk_remote": {
        "person_id": "sergey",
        "job_id": "frontend",
        "location_id": "novosibirsk",
        "lang": "ru",
        "is_remote": true,
        "experiences_ids": ["neurocore2", "aff", "serenity", "neurocore", "finstar", "advertle", "ibank", "w1"]
    },
    "ru_backend_novosibirsk_remote": {
        "person_id": "sergey",
        "job_id": "backend",
        "location_id": "novosibirsk",
        "lang": "ru",
        "is_remote": true,
        "experiences_ids": ["neurocore2", "aff", "serenity", "neurocore", "finstar", "advertle", "ibank", "w1"]
    },
    "ru_fullstack_novosibirsk_remote": {
        "person_id": "sergey",
        "job_id": "fullstack",
        "location_id": "novosibirsk",
        "lang": "ru",
        "is_remote": true,
        "experiences_ids": ["neurocore2", "aff", "serenity", "neurocore", "finstar", "advertle", "ibank", "w1"]
    },
    "ru_frontend_kazan_remote": {
        "person_id": "sergey",
        "job_id": "frontend",
        "location_id": "kazan",
        "lang": "ru",
        "is_remote": true,
        "experiences_ids": ["neurocore2", "aff", "serenity", "neurocore", "finstar", "advertle", "ibank", "w1"]
    },
    "ru_backend_kazan_remote": {
        "person_id": "sergey",
        "job_id": "backend",
        "location_id": "kazan",
        "lang": "ru",
        "is_remote": true,
        "experiences_ids": ["neurocore2", "aff", "serenity", "neurocore", "finstar", "advertle", "ibank", "w1"]
    },
    "ru_fullstack_kazan_remote": {
        "person_id": "sergey",
        "job_id": "fullstack",
        "location_id": "kazan",
        "lang": "ru",
        "is_remote": true,
        "experiences_ids": ["neurocore2", "aff", "serenity", "neurocore", "finstar", "advertle", "ibank", "w1"]
    },
    "ru_frontend_rostov_remote": {
        "person_id": "sergey",
        "job_id": "frontend",
        "location_id": "rostov",
        "lang": "ru",
        "is_remote": true,
        "experiences_ids": ["neurocore2", "aff", "serenity", "neurocore", "finstar", "advertle", "ibank", "w1"]
    },
    "ru_backend_rostov_remote": {
        "person_id": "sergey",
        "job_id": "backend",
        "location_id": "rostov",
        "lang": "ru",
        "is_remote": true,
        "experiences_ids": ["neurocore2", "aff", "serenity", "neurocore", "finstar", "advertle", "ibank", "w1"]
    },
    "ru_fullstack_rostov_remote": {
        "person_id": "sergey",
        "job_id": "fullstack",
        "location_id": "rostov",
        "lang": "ru",
        "is_remote": true,
        "experiences_ids": ["neurocore2", "aff", "serenity", "neurocore", "finstar", "advertle", "ibank", "w1"]
    }
}