	Activity: Breakfast, duration: 02:58:08
	Activity: Grooming, duration: 02:40:42
	Activity: Toileting, duration: 02:20:34
	Activity: Sleeping, duration: 11:03:31
	Activity: Leaving, duration: 03:44:44
	Activity: Spare_Time/TV, duration: 22:28:55
	Activity: Snack, duration: 00:06:01
	Activity: Showering, duration: 01:34:09
	Activity: Lunch, duration: 05:13:31

