-20     85  5
15      72  5
25      60  5
30      50  5
40      20  7
-20     40  7
-20     10  8
-20     90  0
-10     85  0
-10     80  5
10      80  0
0      30  6
25      70  0
30      55  0
40      50  0
40      45  5