channelTitle,channelid,description,country,title,publishedAt,statistics,contentDetails,id
aileen3141976,UCO4BlD9JYHiYoAYsWwwZaLA,"This is a project for the youth undertaken by the Digos Water District, the Global Village Association Macau and the Global Village Association Philippines.",NoCountryDefined,Ecological Farming Project: Students-at-the-Farm Program,2010-02-11T08:41:15.000Z,"{'viewCount': '244', 'likeCount': '2', 'dislikeCount': '0', 'favoriteCount': '0', 'commentCount': '0'}","{'duration': 'PT4M44S', 'dimension': '2d', 'definition': 'sd', 'caption': 'false', 'licensedContent': False, 'projection': 'rectangular'}",1VBVLlyTvEU
PacificRimInstitute,UCz_YRjsLFHL1jgv3rEousfg,Why take Ecological Agriculture at PRI? Learn about sustainable food production.,NoCountryDefined,Ecological Agric @ Pac Rim - Sustainable gardening.avi,2010-03-29T21:29:52.000Z,"{'viewCount': '27', 'likeCount': '0', 'dislikeCount': '0', 'favoriteCount': '0', 'commentCount': '0'}","{'duration': 'PT42S', 'dimension': '2d', 'definition': 'sd', 'caption': 'false', 'licensedContent': False, 'projection': 'rectangular'}",dzJhZfi4kH8
EvensTruthsTV,UC_RvzGC-bJr_3AjEveNjfHA,,NoCountryDefined,Enviroment and we need to have ecological farming 3 of 5.avi,2010-04-10T03:21:36.000Z,"{'viewCount': '9', 'likeCount': '0', 'dislikeCount': '0', 'favoriteCount': '0', 'commentCount': '0'}","{'duration': 'PT9M4S', 'dimension': '2d', 'definition': 'sd', 'caption': 'false', 'licensedContent': False, 'projection': 'rectangular'}",grzI6PKKn_M
EvensTruthsTV,UC_RvzGC-bJr_3AjEveNjfHA,,NoCountryDefined,Enviroment and we need to have ecological farming 1 of 5.avi,2010-04-10T00:33:20.000Z,"{'viewCount': '40', 'likeCount': '0', 'dislikeCount': '0', 'favoriteCount': '0', 'commentCount': '0'}","{'duration': 'PT10M58S', 'dimension': '2d', 'definition': 'sd', 'caption': 'false', 'licensedContent': False, 'projection': 'rectangular'}",SeesJ4stcmI
