Periodo,Titulo,autor,formato,link
2018.0,"Caracterización agroecológica de solares mayas, José María Morelos y una comunidad San Felipe I, Quintana Roo, México",María Isabel Oble Delgadillo ; José Nelson Montoya Toledo,ARTÍCULO,
2014.0,Agroecología y Seguridad Alimentaria. Una visión desde Cuba,Reynaldo Jiménez Guethón ; Niurka Alina Anton Torres,ARTÍCULO,
2018.0,TRABALHO E ESTRANHAMENTO: A DETERMINAÇÃO SOCIAL DA SAÚDE EM ASSENTAMENTOS,Paulo Victor Rodrigues de Azevedo Lira ; Pedro Costa Cavalcanti de Albuquerque ; Idê Gomes Dantas Gurgel,ARTÍCULO,
2011.0,"Agroecología del agroecosistema café (Coffea arabiga) y su relación con la erodabilidad de laderas en el Valle de Orosi, Cartago, Costa Rica","Cortés Granados, Víctor Ml.",ARTÍCULO,
2011.0,"La gestión pública ambiental rural, un tema abierto al debate",Eduardo García Villegas ; Aída Cecilia Gálvez Abadía,ARTÍCULO,
2011.0,Efecto Antagónico in vitro de Actinomicetos Aislados de Purines de Chipaca (Bidens pilosa L.) Frente a Phytophthora infestans (Mont) de Bary In vitro Antagonistic Effect of Actinomycetes Isolated from Chipaca (Bidens pilosa L.) Purins Against Phytophthora infestans (Mont) de Bary,Yudy Astrid Fonseca Ardila ; Diana Edith Castellanos Suárez ; Tomás Enrique León Sicard,ARTÍCULO,
2012.0,"Gestão ambiental e democracia: análise crítica, cenários e desafios","Porto, Marcelo Firpo de Souza ; Schütz, Gabriel Eduardo",ARTÍCULO,
2018.0,"Diseño, implementación y evaluación de un sistema silvopastoril en un rancho con lechería tropical de la costa de Oaxaca",Jonathan Arreola Silva ; Oscar G. López-Santiago ; Pedro Cisneros Saguilán ; Julemmy Rodríguez Arreortúa,ARTÍCULO,
2018.0,"Democratització de la comunicació, aprenentatge mutu i acció política col·lectiva: reflexions des de Guatemala",Mar Escarrabill Jané,ARTÍCULO,
2018.0,Diálogo de saberes y prácticas de resistencia en Santiago del Estero,María Angélica Arias,ARTÍCULO,
2012.0,Estabilidad de cruzas intervarietales de maíz (Zea mays L.) para la región semicálida de Guerrero,"Palemón-Alberto, Francisco ; Gómez-Montiel, Noel O ; Castillo-González, Fernando ; Ramírez-Vallejo, Porfirio ; Molina-Galán, José D ; Miranda-Colín, Salvador",ARTÍCULO,
2018.0,EL IMPACTO MEDIOAMBIENTAL DE LA FERTILIZACIÓN ORGÁNICA SOBRE LOS CULTIVOS. IMPORTANCIA EN LA FORMACIÓN DE PROFESIONALES DE LA AGRONOMÍA,Johnny Alberto Camacho Abril,ARTÍCULO,
2012.0,Quince 'CPP': new dwarf rootstock for pear trees on organic and high density planting,Renato Vasconcelos Botelho ; Everton Schneider ; Danielle Machado ; Rafael Piva ; Andricia Verlindo,ARTÍCULO,
2018.0,The family in agroecology,Mauricio Alzate Gómez ; Jeison Loaiza González,ARTÍCULO,
2012.0,Efectos de la biodiversidad en el control biológico dentro de los agroecosistemas,Jonhy Alexander Hidalgo Martín ; Álvaro Acevedo Osorio,ARTÍCULO,
2012.0,"Aportes de la investigación en cítricos al manejo agroecológico del cultivo en el piedemonte del departamento del Meta, Colombia","Cleves Leguízamo, José Alejandro ; Orduz Rodríguez, Javier Orlando ; Fonseca Carreño, Jorge Armando",ARTÍCULO,
2018.0,"Constituição das comunidades negras rurais na América Latina e os efeitos das atividades econômicas nas territorialidades de Quilombo e Palenque, Brasil e Colômbia",Lucas Bento Silva,ARTÍCULO,
2011.0,De la agroecología maya a la arqueología demográfica: ¿Cuántas casas por familia?,"Zetina Gutiérrez, María De Guadalupe ; Bernice Faust, Betty",ARTÍCULO,
2011.0,"Balance emergético en la evaluación de emprendimientos rurales. Estudio de caso: economía semicampesina en Sogamoso, Boyacá",Adriana María Chaparro A,ARTÍCULO,
2019.0,Prácticas agroecológicas en territorios rururbanos del Área Metropolitana de Concepción. Aportes desde la Economía Social y Solidaria a la sustentabilidad urbana,"Mabel Loreto Alarcón-Rodríguez, Dra ; Montserrat Delpino Chamy ; Sandra Valeska Fernández Castillo ; Jocelyn Soto Abarzúa",ARTÍCULO,
2019.0,Proposal of actions for the agro ecological reconversion of a farm in Las Tunas municipality,Oscar Carmenate Figueredo ; Carlos Pupo Feria ; Javier Antonio Herrera Toscano,ARTÍCULO,
2019.0,O DESENVOLVIMENTO RURAL NOS DISCURSOS PARA A EDUCAÇÃO BÁSICA DO CAMPO,Alessandra Luther ; Tatiana Engel Gerhardt,ARTÍCULO,
2019.,"Bienes comunes urbanos en tensión: el caso de la ecoaldea Velatropa, en Argentina/ Urban Commons in Tension: The Case of the Velatropa Ecovillage in Argentina",Giuliana Fiore,ARTÍCULO,
2011.0,"EL ACCESO A LA TIERRA ASUNTO CLAVE PARA LAS MUJERES CAMPESINAS EN ANTIOQUIA, COLOMBIA ACCESS TO LAND KEY ISSUE FOR FARMERS WOMEN IN ANTIOQUIA, COLOMBIA",Gloria Patricia Zuluaga Sánchez,ARTÍCULO,
2019.,De la soya hacia la agroecología: agriculturas en disputa/ From Soy to Agroecology: Agriculture in Dispute,Kaue Pessoa,ARTÍCULO,
2018.0,School Agroecology and health-related quality of life to adolescents,Daniela Moyano ; María Cecilia Scándolo ; Nilda Raquel Perovic,ARTÍCULO,
2019.,El metabolismo social de las Cadenas Cortas de Comercialización: Una aportación a la sostenibilidad desde el trabajo colectivo,Pablo Saralegui Díez,ARTÍCULO,
2018.0,¿Es relevante la agroforestería pecuaria en la educación agropecuaria superior en México?,Jesús Daniel Grande-Cano ; José Nahed Toral ; José Manuel Palma García,ARTÍCULO,
2018.0,"Movimientos sociales populares frente el Tercer Sector: estudio comparado de organizaciones campesinas de Brasil, Argentina y México","Pinto, Lucas Henrique",ARTÍCULO,
2011.0,"Procesos agroecológicos, en Ventaquemada Boyacá",Francisco Gracía ; Nubia Plazas ; Diana Cortés ; Yurani Rodríguez,ARTÍCULO,
2018.0,"Construcción participativa de estrategias para el desarrollo endógeno1 de la vereda el trigo, municipio de guayabal de síquima, cundinamarca, colombia",Deisy Elizabeth Briceño Gómez,ARTÍCULO,
2014.0,Crítica ecológica al concepto de Desarrollo y nuevas alternativas desde América Latina,"Matos De Oliveira, Ana Luíza",ARTÍCULO,
2011.0,"AGROECOLOGÍA DEL AGROECOSISTEMA CAFÉ (""COFFEA ARABIGA"") Y SU RELACIÓN CON LA ERODABILIDAD DE LADERAS EN EL VALLE DE OROSI, CARTAGO, COSTA RICA","Granados, Víctor Ml. Cortés",ARTÍCULO,
2019.,"Estructura funcional y patrones de especialización en las relaciones planta-polinizador de un agroecosistema en el Valle del Cauca, Colombia",Diana Aguado ; Catalina Gutierrez-Chacón ; Marcia Carolina Muñoz,ARTÍCULO,
2018.0,Concepciones de los campesinos del Oriente Antioqueño acerca de las prácticas agronómicas tradicionales y las agroecológicas,"Hernández Urrego, Caterine ; Monsalve Barrera, Sonia",ARTÍCULO,
2012.0,"La agroecología, ciencia para el desarrollo rural sustentable. Estudio de caso",Leidy Casimiro Rodríguez ; Silvia Manuela Pacheco Méndez ; Rosaidy López Jorge,ARTÍCULO,
2017.0,"Sembrando agroecología en campesinos indígenas y afrodescendientes de Colombia, Ecuador y Perú","Villafuerte Holguín, Jhonny Saulo",ARTÍCULO,
2013.0,"Las escuelas campesinas de agroecología, centros de formación campesina y los custodios de semillas en los Andes tulueños (Colombia)","Álvarez Ramírez, Fernando De Jesús ; Castaño Arcila, Guillermo ; Montes Moreno, José Ferney ; Valencia Trujillo, Francis Liliana",ARTÍCULO,
2013.0,Hacia una ontología de la Agri-Cultura en perspectiva del pensamiento ambiental,"Giraldo, Omar",ARTÍCULO,
2013.0,Situated knowledge and biodiversity: tensions between organic smallholders from Southern Brazil and the international intellectual property regime,Guilherme Francisco Waterloo Radomsky,ARTÍCULO,
2018.0,Nuevos actores e innovaciones sociales para el desarrollo rural: el caso de las zonas periurbanas de Madrid y Guadalajara (España),"Mancha Cáceres, Olga ; Ramírez García, Susana",ARTÍCULO,
2013.0,La revalorización de la agroecología andina : estrategia local de diálogo de saberes para enfrentar problemas globales,María Arguello ; Kelvin Cueva,ARTÍCULO,
2013.0,"Efectos de Purines de Chipaca (Bidens pilosa L.) y de Microorganismos en la Incidencia y Severidad de Phytophthora infestans (Mont.) De Bary en Papa Criolla (Solanum phureja) Cultivada en Tenjo (Cundinamarca, Colombia) / Effects of Chipaca (Bidens pilosa",Tomas Enrique León Sicard ; Alejandro Coca Castro ; Wilmer Alexander Forigua Osorio ; Diana Edith Castellanos Suárez,ARTÍCULO,
2013.0,Conocimientos situados y biodiversidad: tensiones entre prácticas de pequeños agricultores ecológicos del sur del Brasil y el régimen internacional de propiedad intelectual,"Waterloo Radomsky, Guilherme Francisco",ARTÍCULO,
2018.0,Los saberes y decisiones productivo-tecnológicas en la agricultura familiar pampeana: Un mecanismo de resistencia al modelo de agricultura industrial,Lia Nora Tamagno ; Maria Jose Iermano ; Santiago Javier Sarandón,ARTÍCULO,
2013.0,INFLUENCIA DEL CULTIVO INTERCALADO EN LA PRODUCCIÓN Y CALIDAD DEL FRUTO DE TOMATE CEREZA,Fabricio Rossi ; Edmilson José Ambrosano ; Eliana Aparecida Schammass ; Glaucia María Bovi Ambrosano ; Nivaldo Guirado ; Fabio Luis Ferreira Días ; Roberto Antonio Arévalo ; Edna Ivani Bertoncini,ARTÍCULO,
2013.0,Bases pluriepistemológicas de los estudios en agroecología,Libia Esperanza Nieto Gómez ; Francis Liliana Valencia Trujillo ; Reinaldo Giraldo Díaz,ARTÍCULO,
2014.0,Mercados municipales y tecnologías digitales: entre el e-comercio y nuevas formas de convivialidad,"Robles, Juan",ARTÍCULO,
2014.0,Factores críticos en una extensión tecnológica. El caso de Talamanca en el Programa de Regionalización Interuniversitario,Ana Rosa Ruiz-Fernández,ARTÍCULO,
2014.0,"Adaptación a la variabilidad climática entre los caficultores de las cuencas de los ríos Porce y Chinchiná, Colombia",Sandra Turbay ; Beatriz Nates Cruz ; Fabio Luis Jaramillo Vallejo ; Jorge Julián Vélez ; Olga Lucía Ocampo,ARTÍCULO,
,"LA AGROECOLOGÍA COMO PROPUESTA DE MODELO DE PRODUCCIÓN APLICADO AL CULTIVO DE CHILE HABANERO EN PETO, YUCATÁN","Tamayo Manrique, José ; Martínez Y Ojeda, Enrique ; Monforte Méndez, Gustavo ; Munguía Gil, Alfonso ; Ruiz Martínez, Alfredo",ARTÍCULO,
2013.0,Los Guardianes de Semillas : una red de agroecología,Oliver Torres,ARTÍCULO,
2013.0,Micorriza arbuscular. Recurso microbiológico en la agricultura sostenible,Beatriz Elena Guerra Sierra,ARTÍCULO,
2013.0,Metodología participativa para el diagnóstico de la agricultura familiar en la red agroecológica campesina del municipio de Subachoque - Cundinamarca,Alex Angarita ; Alvaro Acevedo ; Karen Franco ; Edward Mendoza ; Monica León,ARTÍCULO,
2013.0,Análisis conceptual del uso agrícola del suelo: Su incidencia en la sostenibilidad,Maldané Cuello Espinosa,ARTÍCULO,
2012.0,"Contributions of research to agroecological management in citrus cultivation in the foothills of the department of Meta, Colombia",José Alejandro Cleves Leguízamo ; Javier Orlando Orduz Rodríguez ; Jorge Armando Fonseca Carreño,ARTÍCULO,
2012.0,LA EDUCACIÓN AMBIENTAL CON ENFOQUE INTERCULTURAL. ATISBOS LATINOAMERICANOS,Helio Manuel García Campos,ARTÍCULO,
2018.0,La agroecología: alternativa de desarrollo sustentable ante la crisis ambiental en un mundo globalizado,"Martínez Girón, Jader ; Marin Rivera, Jenny Vanessa ; Murillo Lopera, Karla Ivon ; Rodríguez Delgado, Iris Cecilia",ARTÍCULO,
2012.0,Cultivando la educación agroecológica: el huerto colectivo urbano como espacio educativo,"Merçon, Juliana ; Escalona Aguilar, Miguel Ángel ; Noriega Armella, María Isabel ; Figueroa Núñez, Ingrid Ivette ; Atenco Sánchez, Aketzali ; González Méndez, Enid Daniela",ARTÍCULO,
2018.0,"Agroecología, instrumento para la gestión del turismo rural en Quintana Roo",Edel J. Fresneda ; José A. Fresneda,ARTÍCULO,
2018.0,Agroecología y cambio climático: ¿adaptación o transformación?,Miguel A. Altieri ; Clara Nicholls,ARTÍCULO,
2013.0,"AGROECOLOGY: BASIS OF SUSTAINABILITY AGROECOSYSTEMSDiante da insustentabilidade ambiental dos sistemas de produção agrícolas na atualidade, o enfoque agroecológico surge como uma alternativa sustentável aos agroecossistemas. A ciência agroecológica trabal Agroecologia: base da sustentabilidade dos agroecossistemas",Daiane Loreto Vargas ; Andréia Furtado Fontoura ; José Geraldo Wizniewsky,ARTÍCULO,
2013.0,La agroecología frente a la crisis alimentaria global,Miguel Altieri,ARTÍCULO,
2013.0,Modelo agroecológico en la zona de amortiguamiento del Santuario de Flora y Fauna de Iguaque,Javier Enrique Tovar-Puentes ; Álvaro Enrique Alvarado-Gaona,ARTÍCULO,
2013.0,Valoraciones de calidad en alimentos orgánicos y de origen local entre consumidores de la red Comida Sana y Cercana en Chiapas,"Gutiérrez-Pérez, Cynthia ; Morales, Helda ; Limón-Aguirre, Fernando",ARTÍCULO,
2013.0,DISEÑO DE UN SISTEMA INTEGRADO DE PRODUCCIÓN AGROPECUARIA EN EL MUNICIPIO DE POPAYÁN (CAUCA),Leadith Alexandra Gutiérrez V ; Lisbeth Rocio Ruiz M ; Nelson José Vivas-Quila ; Luis Alfredo Londoño-Velez,ARTÍCULO,
2018.0,Agroecological conversion for the security and food sovereignty of a family farm,Darío Lucantoni ; Alfredo Jiménez González ; Isidro Rolando Acuña Velázquez ; Mariol Morejón García ; Alfredo Lesvel Castro Lindín,ARTÍCULO,
2018.0,"Las agriculturas alternativas en el contexto del agronegocio. Experiencias en la provincia de Buenos Aires, Argentina","Palmisano, Tomás",ARTÍCULO,
2013.0,Anotaciones para una historia de la agroecología en Colombia,Carmen Cecilia Rivera ; Tomás Enrique León Sicard,ARTÍCULO,
2018.0,With the earth in the hands: Motivations of the agro-ecological practice in the Antioquia East,Juan Camilo Rojas ; Luisa Fernanda Hoyos,ARTÍCULO,
2019.0,"RESENHA DO LIVRO “CONSCIÊNCIA DE CLASSE E DE LUGAR, PRÁXIS E DESENVOLVIMENTO TERRITORIAL” DE MARCOS AURELIO SAQUET",Arthur Breno Stürmer,ARTÍCULO,
2014.0,Processos de formação e produção de conhecimento: cinco olhares sobre a Educação Popular e Saúde,"David, Helena Maria Scherlowski Leal ; Batista, Ivanilde Vieira ; Um, Julio Alberto Wong ; Cavalcanti, Paulette ; Barbosa, Regina Helena Simões ; Heck, Selvino",ARTÍCULO,
,A agroecologia: estratégias de pesquisa e valores,Rubens Onofre Nodari ; Miguel Pedro Guerra,ARTÍCULO,
2018,"A Agroecologia Ontem, Hoje e Amanhã em Terras Tupiniquins: Conceito, Contexto e Perspectivas",Kárita de Jesus Boaventura ; Wesley Fonseca Vaz ; Éder Dasdoriano Porfírio Júnior ; Carlos de Melo E Silva Neto ; Murilo Mendonça Oliveira de Souza,ARTÍCULO,
2016.0,"Agroecología, territorio, recampesinización y movimientos sociales",Peter Michael Rosset ; María Elena Martínez Torres,ARTÍCULO,
2017.0,Cultivando relaciones sociales. Lo común y lo “comunitario” a través de la experiencia de dos huertos urbanos de Madrid,Nuria Del Viso ; José Luis Fernández Casadevante ; Nerea Morán,ARTÍCULO,
2016.0,"Agricultura familiar, agroecologia e desenvolvimento sustentável: análise fotográfica da revista Agroecologia e Desenvolvimento Rural Sustentável-EMATER/RS",João Gabriel Da Silva Brito ; Betania Araújo Maciel,ARTÍCULO,
2016.0,"Maíz, potencial productivo y seguridad alimentaria: el caso de San Nicolás de Los Ranchos, Puebla-México","Damián Huato, Miguel Angel ; Romero - Arenas, Omar ; Sangerman Jarquín, Dora María De Jesús ; Reyes - Muro, Luis ; Parraguirre Lezama, C. ; Orozco Cirilo, Sergio",ARTÍCULO,
2016.0,Agroecología del sistema de aboneras en el litoral atlántico de Honduras,Bernard Triomphe,ARTÍCULO,
2016.0,CARACTERIZACIÓN DE LAS FERIAS FRANCAS DE PRODUCTORES AGROPECUARIOS EN LA PROVINCIA DE CÓRDOBA (ARGENTINA),G. Ferrer ; M. Barrientos ; G. Saal,ARTÍCULO,
2017.0,Ecología de la restauración en México: estado actual y perspectivas,"López-Barrera, Fabiola ; Martínez-Garza, Cristina ; Ceccon, Eliane",ARTÍCULO,
2016.0,Brecha de género en los países miembros de la Alianza del Pacífico,"Vázquez Parra, José Carlos ; Arredondo Trapero, Florina ; de La Garza, Jorge",ARTÍCULO,
2016.0,"Voces de pastores: discursos, prácticas y demandas de las asociaciones de la FEP (FEP). Un sujeto político en proceso de construcción desde la ganadería extensiva","Sánchez, Verónica ; Gallar Hernández, David",ARTÍCULO,
2016.0,"Técnicas y tecnologías en campesinos caso de estudio: caficultores cocaleros en Miranda, Cauca, Colombia","Gómez Sánchez, Andrés Mauricio ; Cadena Durán, Olga Lucía",ARTÍCULO,
2017.0,Hacia un estado del arte y un marco conceptual de la soberanía alimentaria,Ana María Rivero Santos,ARTÍCULO,
2015.0,"Miradas desde la agroecología a aparentes proyectos antagónicos en la comunidad indígena de Puerta de Platanares, Nayarit, México",Jesús Antonio Madera Pacheco ; Jazmín Elizabeth Vargas Arreola,ARTÍCULO,
2015.0,"A comunidade remanescente de quilombo do Engenho Siqueira: territorialidade, identidade quilombola e potencialidade da agroecologia","Gondim De Araújo, Marli",ARTÍCULO,
2015.0,A agroecologia: uma ilustração da fecundidade da pesquisa multiestratégica,Hugh Lacey,ARTÍCULO,
2016.0,Agricultura ecológica al sur de Brasil: de alternativa a contratendencia,"Charão Marques, Flávia ; Oliveira, Daniela",ARTÍCULO,
2015.0,Migración y remesas: ¿están afectando la sustentabilidad de la agricultura y la soberanía alimentaria en Chiapas?,"Morales, Helda ; Aguilar-Støen, Mariel Cristina ; Castellanos-López, Edwin Josué",ARTÍCULO,
2016.0,Considerations about recultivation of Coffea arabica L in exhausted coffee plantations,Pedro Antonio Álvarez Olivera,ARTÍCULO,
2016.0,La agroecología como opción política para la paz en Colombia,Laura Mateus Moreno,ARTÍCULO,
2017.0,Sprout density for the production of organic mini-cabbage from mother plant regrowth,"Souza, Jacimar Luis de ; Guarçoni, Rogério Carvalho ; Favarato, Luiz Fernando ; Angeletti, Maria Da Penha ; Bahiense, Douglas Vianna ; Ribeiro, Camila de Souza",ARTÍCULO,
2017.0,Relación y resultados entre actividades productivas y legislación ambiental: estudio desde el metabolismo social en las regiones Atlántico/Caribe y Chorotega de Costa Rica (1950-2015),Edgar Eduardo Blanco Obando,ARTÍCULO,
2017.0,Propuesta de unos principios generales para la ciencia de la agroecología: una reflexión,"Gómez Echeverri, Luis Fernando ; Ríos Osorio, Leonardo ; Eschenhagen Durán, María Luisa",ARTÍCULO,
2016.0,Determinación de los niveles de resiliencia/vulnerabilidad en iniciativas de agroecología urbana en el suroeste andaluz,"Peredo Parada, Santiago ; Vela Campoy, María ; Jiménez Gómez, Alberto",ARTÍCULO,
2016.0,De von Bertalanffy a Luhmann: Deconstrucción del concepto “agroecosistema” a través de las generaciones sistémicas,Lorena Casanova ; Juan Martínez ; Silvia López ; Gustavo López,ARTÍCULO,
2016.0,Transgénicos: transgénicos en Laudato si. Una visión integradora.,"Senent De Frutos, Juan Antonio",ARTÍCULO,
2016.0,Factores socioeconómicos asociados al aprovechamiento de la agrobiodiversidad de la milpa en Yucatán,"Salazar Barrientos, Lucila L. ; Magaña Magaña, Miguel Angel ; Aguilar - Jiménez, Astrid Nohely ; Ricalde, Mª Fernanda",ARTÍCULO,
2016.0,"Los estados inmaduros de Phyllophaga heteronycha, P. leonina y P. angulicollis (Coleoptera: Melolonthidae: Melolonthinae)","Morón, Miguel Ángel ; Rojas-Gómez, César V. ; Arce-Pérez, Roberto",ARTÍCULO,
2016.0,Efecto de sustratos orgánicos en el crecimiento de seis variedades de chile jalapeño (Capsicum annuum L.),"Beltrán Morales, Félix Alfredo ; García Hernández, José Luis ; Ruiz Espinoza, Francisco Higinio ; Valdez Cepeda, Ricardo David ; Preciado Rangel, Pablo ; Fortis Hernández, Manuel ; González Zamora, Alberto",ARTÍCULO,
2016.0,"Les agricultures territorialitzades, oportunitats i reptes davant del paradigma agroindustrial",Susana Ramírez-García ; Olga Inmaculada Mancha-Cáceres ; Consuelo Del-Canto-Fresno,ARTÍCULO,
2016.0,Seguridad alimentaria y desarrollo sostenible en las laderas de Centro América: retos futuros para la investigación y la formulación de políticas,Michael López ; Fernando Mendoza,ARTÍCULO,
2016.0,"Comercio justo, seguridad alimentaria y globalización: construyendo sistemas alimentarios alternativos","Calisto Friant, Martin",ARTÍCULO,
2016.0,La conversión agroecológica de la agricultura cubana ante nuevos escenarios / Agroecological Conversion of Cuban Agriculture to New Scenarios,Beatriz Díaz González,ARTÍCULO,
2016.0,Evaluación de la sustentabilidad de agroecosistemas familiares campesinos en la microcuenca del río Cormechoque (Boyacá),Jorge Armando Fonseca-Carreño ; José Alejandro Cleves-Leguízamo ; Tomás León-Sicard,ARTÍCULO,
2016.0,"Diseño de ruta turística agroecológica, provincia de ""El Oro"", Ecuador","Lalangui Ramírez, Jessica Ivonne ; Domínguez Junco, Osvaldo",ARTÍCULO,
2014.0,Tecnologias usadas no Brasil para a recuperaçao de sementes crioulas,"Zúñiga Mosquera, Óscar Emerson",ARTÍCULO,
2017.0,Herramientas para la comprensión de acciones colectivas que propenden a una transición agroecológica,Natalia Pinzón López,ARTÍCULO,
2015.0,"Caracterización de nueve agroecosistemas de café de la cuenca del río Porce, Colombia, con un enfoque agroecológico","Machado Vargas, Mónica María ; Nicholls, Clara Inés ; Márquez, Sara María ; Turbay, Sandra",ARTÍCULO,
2014.0,El enfoque del decrecimiento como estrategia de empoderamiento y transformación social. Estudio de caso de los grupos de consumo agroecológico de Granada (España),Consuelo Díaz-Escobar,ARTÍCULO,
2017.0,La sustentabilidad de las huertas urbanas y periurbanas con base agroecológica: el caso de Quito,"Clavijo Palacios, Catalina Elizabeth ; Cuvi, Nicolás",ARTÍCULO,
2014.0,Aproximación matemática a los modelos bioeconómicos: Análisis de caso para el modelo mutualista de Lotka-Volterra,Víctor David Jaramillo Mejía ; Andrés Fernando Jaramillo Mejía ; Euclides Díaz Arcos,ARTÍCULO,
2017.0,Agroecologia: saberes e práticas locais como componentes do Bem Viver,Luciane Cristina Dos Santos ; Franciele Lourenço ; Isabel Jurema Grimm ; Iala Serra Queiroz ; Nívea Maria de Oliveira Silva ; Osíris Canciglieri Junior,ARTÍCULO,
2014.0,Perspectiva ecofeminista de la Soberanía Alimentaria: la Red de Agroecología en la Comunidad Moreno Maia en la Amazonía brasileña | Ecofeminist perspective of Food Sovereignty: the Agroecological Network in Moreno Maia Community in,Irene García Roces ; Marta Soler Montiel ; Assumpta Sabuco I Cantó,ARTÍCULO,
2014.0,"Caracterización de la agricultura familiar campesina, comuna de Cayes-Jacmel, Haití","Severe, Rolord ; Vera O, María Beatriz",ARTÍCULO,
2014.0,"El mejoramiento de los suelos: una experiencia desde la agroecología en la Cooperativa de Producción Agropecuaria ""Celso Maragoto Lara""","García Carrasco, Mireya ; Díaz Pita, Andrés L. ; Valdés Sáenz, Maria Adela",ARTÍCULO,
2014.0,Ecofeminismo y Ciudad: Mujeres pensando una ciudad más saludable,"Perales Blanco, Verónica",ARTÍCULO,
2017.0,Agroecologia e gênero: perspectivas para a emancipação das mulheres e a agricultura familiar,Daiana Paula Varotto,ARTÍCULO,
2017.0,A influência do Centro de Apoio e Promoção da Agroecologia (CAPA) na organização agrícola do Sudoeste do Paraná,Tiago Arcanjo Orben,ARTÍCULO,
2014.0,Local markets and digital technologies: Among e-commerce and new forms of conviviality ; Mercados municipales y tecnologías digitales: entre el e-comercio y nuevas formas de convivialidad,"Robles, Juan",ARTÍCULO,
2017.0,Los Sistemas Participativos de Garantía en el Ecuador. Aproximaciones a su desarrollo,Mauricio Pino Andrade,ARTÍCULO,
2017.0,Biomasa de hojas caídas y otros indicadores de sustentabilidad en asociaciones de especies forestales con cacao “CCN51” en la zona Central del Litoral ecuatoriano,Gary Ramírez Huila ; Emma Torres Navarrete ; Nicolás Cruz Rosero ; Shirley Álava Ormaza ; Alexandra Elizabeth Barrera Álvarez ; Marta Jiménez Águila,ARTÍCULO,
2017.0,Efectos de la contratación de exempleados de multinacionales en la capacidad de absorción en empresas locales,"Leiva, Juan Carlos ; Rodríguez Álvarez, Juan Antonio ; Monge González, Ricardo",ARTÍCULO,
2017.0,Lineamientos agroecológicos para el desarrollo del agroecoturismo en páramos,Alejandra Estefanía Verano Jiménez ; Andrea Viviana Villamizar González,ARTÍCULO,
2014.0,"Agroecología, economías con solidaridad, perspectiva de género y bienestar: una lectura de lo ambiental con opciones válidas para conservar y acrecentar la vida",Olga Lucía Cadena Durán,ARTÍCULO,
2014.0,Valoración agroecológica de las micorrizas vesículo arbúsculares,"Cué García, Jorge Luis ; Torres García, Antonio",ARTÍCULO,
2015.0,Cambio climático: las contradicciones del capitalismo contemporáneo en la producción de maíz en México,"Espinosa Sánchez, Manuel Antonio",ARTÍCULO,
2015.0,EL CONCEPTO DE SOSTENIBILIDAD EN AGROECOLOGÍA,Luis Fernando Gómez ; Leonardo Alberto Ríos-Osorio ; María Luisa Eschenhagen Durán,ARTÍCULO,
2015.0,Agroecología y complejidad: Acoplamiento de la técnica a la organización ecosistémica,"Giraldo, Omar Felipe",ARTÍCULO,
2015.0,Arbuscular mycorrhiza and their effect on the soil structure in farms with agroecological and intensive management,Juan David Lozano Sánchez ; Inge Armbrecht ; James Montoya Lerma,ARTÍCULO,
2015.0,Biotecnología aplicada al desarrollo agropecuario colombiano,Sandra Patrícia Montenegro Gómez ; Yeni Katerine Hernández Ossa,ARTÍCULO,
2015.0,Biotecnología aplicada al desarrollo agropecuario colombiano,"Montenegro Gómez, Sandra Patricia ; Hernández Ossa, Yeni Katerine",ARTÍCULO,
2015.0,Diagnóstico socio-ambiental de la producción agrícola en el páramo de Rabanal (Colombia) como base para su reconversión agroecológica,Dalia Soraya Useche de Vega ; Sara María Márquez-Girón,ARTÍCULO,
2017.0,Integração Cultural na Escola Latino Americana de Agroecologia,Andréa Marcia Legnani ; Mauro José Ferreira Cury,ARTÍCULO,
2018.0,Construcción de alternativas alimentarias en cuatro provincias de Argentina,Daiana Perez ; Julieta Seplovich ; Natalia Gusman ; Violeta Vidal,ARTÍCULO,
2017.0,"Investigación ecológica participativa como apoyo de procesos de manejo y restauración forestal, agroforestal y silvopastoril en territorios campesinos. Experiencias recientes y retos en la sierra Madre de Chiapas, México","García-Barrios, Luis ; González-Espinosa, Mario",ARTÍCULO,
2015,"Acción comunitaria frente al fenómeno del cambio climático, en el páramo de la región del Guavio, Cundinamarca, Colombia",Sonia Astrid Mendoza Velásquez ; Juan Guillermo Cano Muñoz ; Fabián Rojas Sánchez,ARTÍCULO,
2015.0,2015: el Año Internacional de los Suelos,Floria Bertsch ; Carlos Henríquez,ARTÍCULO,
2017.0,La Ecología Evolutiva del Desarrollo en México,"Álvarez-Buylla, Elena R. ; Garay-Arroyo, Adriana ; García-Ponce de León, Berenice ; Sánchez, María de La Paz ; González-Ortega, Emmanuel ; Dávila-Velderrain, José ; Martínez-García, Juan Carlos ; Piñeyro-Nelson, Alma",ARTÍCULO,
2017.0,Is agroecology a participatory extension? The case of rural schools in Mexico,Emanuel Gómez Martínez ; Bernardino Mata García ; María Virginia González Santiago,ARTÍCULO,
2014.0,La resignificación campesinista de la ruralidad: La Universidad Rural Paulo Freire,"Gallar Hernández, David",ARTÍCULO,
2015.0,La ‘nueva ruralidad’ en Cañuelas. Entre la agroecología y las nuevas urbanizaciones,Fernando González,ARTÍCULO,
2006.0,Tropical biology,"Deinert, Erika",Archivo de computadora,
,"Fluctuación poblacional de afidos e incidencia de virosis durante el ciclo del cultivo de chile (Capsicum annuum) en el Valle de Zapotitán, El Salvador",,Artículo,
,Abundancia estacional y daño de Anastrepha striata en genotipos de Guayaba y cas,Carballo V. Manuel,Artículo,
,Falsa mancha angular del frijol :,"Barrantes S., Walter",Artículo,
,"Efecto de la aplicación del hongo entomógeno Nomuraea rileyi, sobre la dinámica de la micosis en el cogollero Spodoptera frugiperda en el cultivo de maíz","Gladstone, Sally",Artículo,
,Efecto de la cal y la urea en el manejo del moko de las musáceas,"Núñez, Gabriel",Artículo,
,"Efecto de la rotación con leguminosas sobre la productividad del cultivo de piña (Ananas comosus [L.] Merr.) y cultivos intercalados en Tabasco , México","García de la Cruz, Rubén",Artículo,
,Efecto de los sustratos celulosa y glucano sobre antagonistas de phytophthora infestans en tomate,"Pérez Mancía, Juana E.",Artículo,
,Efecto de sustratos sobre crecimiento y supervivencia de bacterias antagonistas a mycosphaerella fijiensis,"Ruiz Silvera, Carlos",Artículo,
,Efecto de tres fungicidas sobre siete aislamientos del entomopatógeno Lecanicillium (=Verticillium) lecanii,"Olán, Francisco",Artículo,
,Efecto de fungicidas sobre la germinación y el crecimiento de Beauveria bassiana,"Durán, Joaquín",Artículo,
,Efecto del fósforo y del calcio en la severidad del tizon temprano. Alternaria solo en tomate a nivel de invernadero,"Alas García, Jorge",Artículo,
,"Efectos de la aplicación de cal dolomítica y yeso agrícola en cafetales (Coffea arabica) afectados con mal de viñas, en Guatemala","Braeuner, Mario",Artículo,
,"Eficacia de cepas nativas de hongos entomopatógenos sobre Bemisia tabaci, en el laboratorio","Herrera, Francois",Artículo,
,Eficacia de invasión de Tecia solanivora y Clavipalpus ursinus por el nemátodo Steinernema feltiae,"Sáenz A., Adriana",Artículo,
,Eficacia del farnesol y de un extracto de semilla de ayote como repelentes de Atta mexicana,"Gladstone, Sally",Artículo,
,"El ""Status actual de las plagas forestales en Costa Rica""","Hilje Quirós, Luko",Artículo,
,"El caucho, un hongo y la guerra :","Hilje, Luko",Artículo,
,Efecto del tiempo y la profundidad en el suelo sobre la persistencia de la semilla de echinochloa colona,"Cháves, Lilliana",Artículo,
,Efecto de factores de estrés tecnológico en la predisposición del café al ataque de patógenos fungosos,"Lobos Medina, Héctor",Artículo,
,Efecto de enmiendas orgánicas y de un hongo micorrícico sobre radopholus similis en banano,"Ayuso, Federico",Artículo,
,Efecto de enmiendas foliares sobre el desarrollo del tizon temprano causado por alternaria solani y sobre la población bacterial en tomate (lycopersícon esculontun miel),"Okumote, Shuichi",Artículo,
,"Determinación de las fuentes de inóculo del moteado amarillo del tomate (Toymov), en Guayabo, Costa Rica","Jovel, Juan",Artículo,
,"Determinación de niveles de daño económico de Bemisia tabaci de tomate en el norte del César, Colombia","Bolaño, Rafael",Artículo,
,Diagnóstico acerca del combate químico de las polillas de la papa (Lepidoptera:,"Hilje, Quirós Luko",Artículo,
,Diagnóstico de Xylella fastidiosa en la vid y malezas asociadas con el cultivo,"Hernández Garboza, Livia",Artículo,
,"Diagnóstico de la problemática de la caminadora (rottboellia cochinchinensis) en dos zonas productoras de maiz de la provincia de Guanacaste, Costa Rica","Calvo Domingo, Gustavo",Artículo,
,"Diagnóstico de la problemática fitosanitaria del cultivo de tomate, con énfasis en mosca blanca, Bemisia tabaci (Ginnadius)","Quirós, Carlos Arturo",Artículo,
,Diagnóstico del uso de insecticidas utilizados contra Bemisia tabaci (Gennadius) en tomate y chile en Costa Rica,"Araya R., Lisbeth",Artículo,
,Diseminación del banano en latinoamérica y el Caribe y su relación con la presencia de radopholus similis,"Marín, Douglas H.",Artículo,
,Distribución agroecología de enfermedades del frijol en Costa Rica,"Araya Fernández, Carlos Manuel",Artículo,
,Distribución espacial y comparación de métodos de muestreo de larvas de Keiferia lycopersicella(Lepidoptera :,"Cubillo, Douglas",Artículo,
,"Distribución espacio-temporal del virus del moteado amarillo (Toymov) en parcelas de tomate, en Turrialba, Costa Rica","Jovel, Juan ... [et al.]",Artículo,
,"Dynamis nitidulus (coleoptera: curculionidae), nueva plaga del pejibaye","Vásquez, Joel",Artículo,
,Efecto bioherbicida de extractos vegetales para el manejo de malezas en algodón en el Caribe colombiano,"Jarma Orozco, Alfredo de J.",Artículo,
,Efecto de cepas de Beauveria bassiana (bals.) vuill sobre la mortalidad de ecdytolopha torticornis (meyrick) (lep:,"González, Herbert O",Artículo,
,Efecto de dos extractos botánicos y un insecticida convencional sobre el depredador chrysoperla externa,"Lamas, Gerardo",Artículo,
,"El conocimiento ecológico y la complejidad para el manejo integrado de plagas, en el mundo posmoderno","Vandermeer, John",Artículo,
,"Fluctuación de las capturas de las polillas de la papa Scrobipalpopsis solanivora Povolny y Phthorimasa opercubella Zeller (Lepidoptera, GelechÃüdae) en Cartago, Costa Rica","Rodríguez V, Carlos",Artículo,
,El efecto de prácticas agronómicas sobre el nivel poblacional de áfidos y virosis en Carica papaya L.,"Robles, Wilfredo",Artículo,
,El manejo integrado de plagas:,"Pareja, Mario R",Artículo,
,Evaluación de dos cepas del hongo entomopatógeno Metarhizium anisopliae y seis insecticidas granulados en el control de salivazo (Aeneolamia postica) (Hom:,"Salazar Blanco, José Daniel",Artículo,
,Evaluación de extractos de meliáceas para el control de Heterotermes tenuis,"Castiglioni, Enrique",Artículo,
,"Evaluación de fuentes de fertilización orgánica para tomate de invernadero en Oazaca, México","Mendoza-Netzahual, Hugo",Artículo,
,Evaluación de insecticidas sintéticos y biológicos para el control de antigastra catalaunalis en ajonjolí,"Lozano Tovar, María Denis",Artículo,
,Evaluación de la distribución y uso de los servicios de información y documentación en el área de fitoprotección del CATIE,"Arboleda-Sepúlveda, Orlando",Artículo,
,Evaluación de líneas de tomate de mesa resistentes a Pseudomonas solanacearum en época seca en Costa Rica,,Artículo,
,Evaluación de dos aislamientos de verticilluim sp. como agente de control biológico de la roya (H. vastatrix) del cafeto (coffea arabica) en condiciones de invernaderos,"Monzón, Arnulfo",Artículo,
,Evaluación de posibles repelentes de Bemisia tabaci:,"Gómez, Paul",Artículo,
,Evaluación de resistencia de cultivares criollos de chile dulce (Capsicum annuum) A. Phytophthora capsici,"Mercado Mejía, Jorge A",Artículo,
,Evaluación de trampa amarillas para el control de aeneolamia varia,"Badilla Fernández, Francisco",Artículo,
,"Evaluación de un método agronómico, biológico y químico para el combate de Amerrhinus ynca en plantaciones de coco","Lacerda Moura, José Ignacio",Artículo,
,Evaluando la diversidad de plantas en los agroecosistemas como estrategia para el control de plagas,"Muriel R., Sandra B.",Artículo,
,Existe la tolerancia genética del cacao (Theobroma cacao a Rosellinia pepo),,Artículo,
,Extractos acuosos de nim para el combate de la broca de café,,Artículo,
,Evaluación de prácticas agrícolas para el manejo de Bemisia tabaci en tomate,"Salas, Jorge",Artículo,
,Etiología del amachamiento del frijol común en Costa Rica,"Morales, Francisco",Artículo,
,Estudio de la relación incidencia severidad de las principales enfermedades del café (Coffea arabica L) en Nicaragua,"Mendoza, Ramón",Artículo,
,"Estrategia de manejo para romper el ciclo del vector brevipapus ssp.-rhadovirus, causante de la leprosis de los cítricos","Childers, Carl C.",Artículo,
,El picudo del chile (Anthonomus eugenii Cano) su reconocimiento y posible manejo,"Coto, Daniel",Artículo,
,El uso de entomopatógenos en el control de la broca del café en Colombia,"Bustillo, Alex E.",Artículo,
,"El virus 2 del mosaico de la sandía (wmv-2), fluctuación poblacional de vectores y su presencia en El Salvador","Rivas Platero, Gonzalo Galileo",Artículo,
,Elementos para el manejo integrado de los picudos (curculionidae) del palmito,"Alpizar M., Dennis",Artículo,
,Elementos para un sistema de manejo integrado de fitonemátodos,"Marbán Mendoza, Nahúm",Artículo,
,Enfermedades de la piel y plaguicidas sintéticos,"Penagos G., Homero",Artículo,
,Enfermedades foliares en café orgánico y convencional,"Samayoa Juarez, Jorge Omar",Artículo,
,Enfoque indígena agroecológico,"Martínez Castillo, Róger",Artículo,
,"Entomofauna perjudicial, enemigos naturales y malezas útiles en palma aceitera (Elaeis guineensis)","Mexzón, Ramón G",Artículo,
,Epidemiología y producción del patosistema Coffea-hemileia,"Loásiga, Hiparco",Artículo,
,Escala para estimar el daño de insectos en el maíz almacenado,"Silva A., Gonzalo",Artículo,
,"Estatus de las principales enfermedades del cultivo de frijol, y posibilidades organizativas en Costa Rica","Araya, Carlos Manuel",Artículo,
,Estatus del manejo de Bemisia tabaci en América Latina y el Caribe :,"Hilje Quirós, Luko",Artículo,
,"Estimación de la abundancia de la Taltuza Orthogeomys heterodus (Rodentia, Geomyidae) y el daño producido en una zona horticola de Costa Rica","Bonino, Never",Artículo,
,Estimación de pérdidas e identificación del geminivirus transmitido al tomate por la mosca blanca Bemisia tabaci genn (Homoptera:,,Artículo,
,"El género Phytophthora II. P. cinnamomi, P. infestans y P. palmivora, tres especies contrastantes","Phillips-Mora, Wilberth",Artículo,
,"Fundamentos culturales, sociales y económicos de la agroecología","Martínez Castillo, Róger",Artículo,
,"Identificación y potencial del hongo Hirsutella thompsou, fisher para el control de acaros de importancia económica en América Central",,Artículo,
,Germinación y reproducción in vitro de la bacteria Paenibacillus (=Bacillus) lentimorbus,"Fernandez Redondo, Geovanny",Artículo,
,Racionalidad en la toma de desiciones de MIP por pequeños y medianos caficultores de Nicaragua,"Gómez, Diego",Artículo,
,Prácticas agrícolas para el manejo de Benisia Tabaci,"Hilje Quirós, Luko",Artículo,
,Prospección fitonematológica en ornamentales de follaje de Costa Rica,"Marbán Mendoza, Nahúm",Artículo,
,Prospección de hongos entomophtorales para el control natural de insectos en Bahía Brasil,"Méndez Sánchez, Saúl Edgardo",Artículo,
,Produtos naturais e sintéticos no controle do bicho-mineiro-do-cafeeiro Leucoptera coffeella e seus efeitos sobre a vespa predadora Polybia scutellaris,,Artículo,
,Producción del Baculovirus Vpnha en Heliothis armigera y Spodoptera exigua,"Borges Maracajá, Patricio",Artículo,
,Producción de abono orgánico con pulpa de café mediante el lombricompostaje,"Siles C., J.",Artículo,
,"Procedimientos para el registro, aislamiento, mantenimiento, preservación y sistematización de una colección de hongos entomopatógenos",Estrada V. María N.,Artículo,
,Presencia del ácaro rojo de los cítnico Panonychus citri (McGregor) (Acari :,"Aguilar, Hugo",Artículo,
,Preparación de lixiviados de compost y lombricompost,"Larco, Eric",Artículo,
,Predisposición de rottboellia cochinchinensis al ataque de patógenos nativos en respuesta a factores de estrés,"Zúñiga, Cristhian",Artículo,
,Potencial de hormigas como depredadoras de la broca del café (Hypothenemus hampei) en Costa Rica,"Varon, Edgar H.",Artículo,
,Potencial de depredación de hypsipyla grandella por hormigas en cafetales de Costa Rica,"Varon, Edgar H.",Artículo,
,Posibilidades del uso de nemátodos entomopatógenos para el control de Aeneolamia varia en caña de azúcar,"Ferrer, Francisco",Artículo,
,"Por qué la ingeniería genética no garantizará la seguridad alimentaria, ni protegerá el ambiente ni reducirá la pobreza en el tercer mundo","Altieri, Miguel A.",Artículo,
,Planteamiento sobre una agroecología indígena Talamanca,"Martínez Castillo, Róger",Artículo,
,Períodos críticos de protección y efecto de la infestación de Plutella xylostella L. (Lepidoptera : Plutellidae) sobre el rendimiento del repollo,"Carballo V, Manuel",Artículo,
,Perspectivas para el manejo cultural y químico de las pudriciones en la nuez de macadamia (Macadamia integrifolia),"Umaña, Gerardina",Artículo,
,Perspectivas del uso del control microbiológico para plagas de maíz en Nicaragua,"Gladstone, Sarah M",Artículo,
,Perspectivas de la agricultura mundial para el siglo XXI,"Borlaug, Norman E.",Artículo,
,Patogenicidad del virus costarricense del mosaico dorado de Sida (SIGMCRV) en varias especies de plantas cultivadas,"Jovel, Juan",Artículo,
,"Patogenicidad de Metarhizium anisopliae en adultos de la ""Chinche salivosa"" Aeneolamia albofasciata y Prosapia spp. (Homoptera:","Badilla, Francisco",Artículo,
,Participación de las familias rurales en procesos de capacitación relacionados con plaguicidas,"Rugama, Rosa Argentina",Artículo,
,Opciones para el manejo del picudo del plátano,"Carballo, Manuel",Artículo,
,Opciones para el manejo de radopholus similis en banano mediante hongos endomicorrízicos y compost,"Urribarrí, Larry",Artículo,
,Opciones para el manejo de nemátodos en el café,"Marbán Mendoza, Nahúm",Artículo,
,Observaciones ecológicas sobre la mosca blanca bemisia tabaci (gennadius) en Costa Rica,"Hilje Quirós, Luko",Artículo,
,Reconocimiento y oviposición del parasitoide encarsia lutea en bemisis tabaci,"De Siqueira, Kátia",Artículo,
,Nuevos representantes de la familia Tetranychidae (Acari) en Costa Rica,"Vargas, Carlos",Artículo,
,"Reconocimiento, caracterización morfológica e incidencia de Neozygites fresenii en la regulación natural de áfidos en Andalucía, España","Méndez Sánchez, Saúl",Artículo,
,"Reproducción masiva de Verticillium sp., hiperparásito de la roya del café, Hemileia vastatrix","Canjura Saravia, Evelyn M.",Artículo,
,Uso y producción de virus de la poliedrosis nuclear en Nicaragua,"Rizo Z., Carmen Marina",Artículo,
,Una prueba de control biológico de baba de cubebra en pastos,"Hernández R. , Juan",Artículo,
,Una interpretación de las moscas blancas,"Gerling, Dan",Artículo,
,Una base agroecológica para el diseño de sistemas diversificados de cultivo en el trópico,"Altieri, Miguel A.",Artículo,
,Un programa exitoso de control biológico de insectos plaga de la caña de azúcar en Costa Rica,"Badilla Fernández, Francisco",Artículo,
,Un método agroecológico rápido para la evaluación de la sostenibilidad de cafetales,"Altieri, Miguel A.",Artículo,
,Un modelo de colabaración agrícola internacional para el manejo de moscas blancas y geminivirus en América Latina y El Caribe,"Hilje Quirós, Luko",Artículo,
,Tratado fundamental para el control y eliminación de contaminantes orgánicos persistentes,"Henao, Samuel",Artículo,
,Tras nuevas formas de producción agrícola,"Marín González, Rocío",Artículo,
,Translocación y cuantificación del ADN viral de geminivirus asociados con el mosaico amarillo del tomate,"Rivas P, Gonzalo Galileo",Artículo,
,Toxicidad sobre Apis mellifera de cebos empleados en el combate de moscas de la fruta,"Domínguez, Víctor",Artículo,
,Susceptibilidad de cyclocephala comata a diferentes agentes de control biológico,"Posos Ponce, Pedro",Artículo,
,Supresión de enfermedades mediante el uso de compost,"Hoitink, H.A.",Artículo,
,Silenciamiento de genes virales :,"Jovel, Juan",Artículo,
,Severidad del moteado amarillo de tomate y reducción del rendimiento del cultivo en respuesta a la densidad de adultos viruliferos de bemisia tabaci,"Salazar, Eduardo...[et al.]",Artículo,
,SelÃçao de colônias de Beauveria bassiana resistente a productos fitosanitarios,"Cavalcanti, Ricardo S.",Artículo,
,Selectividad y eficacia del nicosulfuron para el control de malezas en maíz,"Salazar P., Luis Carlos",Artículo,
,"Selectividad de plaguicidas a oxystyla pulchella, molusco depredador de orthezia praelonga","Macêdo Borges, Carlos A.",Artículo,
,Selección y evaluación en laboratorio y campo de microorganismos glucanoliticos antagonistas a mycosphaerella fijiensis,"Talavera S., Mario",Artículo,
,Selección de patógenos nativos de Costa Rica para el control biológico de rottboellia cochinchinensis,"Zúñiga, Cristhian",Artículo,
,Selección de antagonistas para el control biológico de Phytophthora infestans en tomate,"Sánchez Garita, Vera",Artículo,
,Selección de Microorganismos Quitinoliticos en el control de Sigatoka Negra (Mycosphaerella fijienses) en Banano,,Artículo,
,"Riquezas y abundancia de hongos entomógenos en tres sistemas de manejo de cacao en Choroní , Venezuela","Rojas, Thamara",Artículo,
,Respuesta del virus de la mancha anular del papayo (PRSV) en tres sistemas de manejo,"Hernández Castro, Elías",Artículo,
,Resistencia de la ixophorus unisetus a herbicidas inhibidores de la sintetasa del acetolactato,"Chaves, Lilliana",Artículo,
,Resistencia de Bemisia argentifolii a insecticidas:,"Ortega Arenas, Laura Delia",Artículo,
,Reproducción y esporulación in vitro de la bacteria Paenibacillus (Bacillus) lentimorbus para el control de larvas de Phyllophaga elenans,"Fernández Redondo, Geovanny",Artículo,
,Redescubriendo a Alexander Von Humboldt,"Ezcurra, Exequiel",Artículo,
,Generación de información científica y técnica sobre manejo integrado de plagas en Centroamérica,"Arboleda Sepúlveda, Orlando",Artículo,
,Nuevos registros de hongos en semillas de Oryza sativa en Cuba,"Barrios, L.M.",Artículo,
,Niveles de daño económico de Keiferia lycopersicella en tomate,"Ramírez B, Alexander",Artículo,
,La protección de cultivos en la agricultura sostenible :,"Arauz Cavallini, Luis Felipe",Artículo,
,La necrosis rayada del arroz,"Morales G., Francisco José",Artículo,
,La necesidad de la multirracionalidad en la construcción del paradigma agroecológico y el desarrollo rural,"Mora Delgado, Jairo R.",Artículo,
,La identificación y distribución de los salivazos de la caña de azúcar y los pastos (Homoptera:,"Thompson, Vinton",Artículo,
,La estadística no paramétrica para el análisis e interpretación de estudios de plagas :,,Artículo,
,La electroterapia como alternativa para la eliminación del virus DMV en malanga,"Igarza Castro, Janet",Artículo,
,La diversidad de insectos en cítricos y su importancia en los programas de manejo integrado de plagas,"León M., Guillermo",Artículo,
,La dinámica del banco de semillas de malezas en sistemas de producción de granos básicos,"Eiszner, Helmut",Artículo,
,La búsqueda de un sistema de resistencia estable en plantas cultivadas,Bustamante Rojas Elkin,Artículo,
,Karl Hoffmann :,"Hilje Quirós, Luko",Artículo,
,Inventario y fluctuación poblacional de insectos y arañas asociadas con citrus sinensis en la región Huetar Norte de Costa Rica,"Elizondo Solís, Jorge Mario",Artículo,
,Introducción de agentes de control biológico de rhizoctonia solani en suelos solarizados o encalados en condiciones de invernadero,"Muñoz Ruiz, C. ... [et al.]",Artículo,
,Interacción de hongos endomicorrízicos con Meloidogyne exigua en café,"Rivas-Platero, Gonzalo",Artículo,
,Insectos polinizadores de frutales tropicales,"Peña, J.E.",Artículo,
,Insectos plaga de macadamia en la zona atlántica de Costa Rica,"Coto, Daniel",Artículo,
,Insecticidas vegetales :,"Silva A., Gonzalo",Artículo,
,Influencia de los procesos de investigación participativa sobre la experimentación campesina,"Wiegel, Jennífer",Artículo,
,Influencia de la humedad del suelo sobre la susceptibilidad de Brachiaria a hongos patógenos,,Artículo,
,Influencia de la fertilización nitrogenada en la interferencia de digitaria sanguinalis sobre maracuya,"Santos, Bielinski M.",Artículo,
,Influencia de la biotecnología en el manejo integrado de plagas de los cultivos tropicales,"Sequeira, Luis",Artículo,
,Infección del virus del rizado de las hojas del tomate (ToLCV-Pan) por bemisia tabaci en Panamá,"Valderrama, Anayansi",Artículo,
,"Detección del viroide de la exocortis en una plantación comercial de naranja dulce, utilizando la lesección 861.S1 del citrus medica L.)","Villalobos, William",Artículo,
,Identificación de acidovorax avenae citrulli en semillas de sandía en Nicaragua,"Muñoz, Mercedes",Artículo,
,Identificación de acaros en coberturas vivas y malezas en Costa Rica,"Vargas, Carlos",Artículo,
,Hacia un uso racional de los plaguicidas sintéticos:,"Arauz, Luis Felipe",Artículo,
,Hacia un movimiento agroecológico en América Latina,"Bogantes D., Javier",Artículo,
,Germinivirus transmitidos por Moscas Blancas,"Ramírez, Pilar",Artículo,
,La relevancia del enfoque de género en el manejo integrado de plagas,"Fassaert, Cecile",Artículo,
,"Nuevos hibridos de tomate, tolerantes al TYLCV","Piñon, Mayte",Artículo,
,La resistencia genética de coffea spp. a meloidogyne paranaensis,"Anthony, F.",Artículo,
,La situación entomológica de la papa en Costa Rica,"Rodríguez V, Carlos",Artículo,
,Nemátodos que atacan cultivos ornamentales,"Ortuño, Noel",Artículo,
,Métodos de análisis económico para su aplicación en el manejo integrado de plagas,"French, James B.",Artículo,
,Mortalidad de adultos de bemisia tabaci con extractos de hombre grande (quassia amara),"Cubillo, Douglas",Artículo,
,Moléculas activadoras de la inducción de resistencia incorporadas en programas de agricultura sostenible,"Rib}veros Angarita, Alba",Artículo,
,"Modelo de extensión y metodología de capacitación utilizado en la transferencia de MIP-MAIZ, con pequeños agricultores en la región occidental del pacífico de Nicaragua","Baca, Pedro C.",Artículo,
,Micorrizas,"Rivas-Platero, Gonzalo",Artículo,
,Micobiota epífita y contaminantes fungosos del establecimiento in vitro de Eucalyptus grandis,,Artículo,
,Material compostado y trichoderma harzianum como supresores de Rhizoctonia solani y promotores del crecimiento de la lechuga,"Vargas Gil, S.",Artículo,
,Manejo integrado de problemas fitosanitarios en palma aceitera Elaeis guineensis en América Central,"Chinchilla, Carlos Manuel",Artículo,
,Manejo integrado de jobotos phyllhaga spp. (scarabaeidae) en el cultivo de la caña de azúcar en Costa Rica,"Badilla Fernández, Francisco",Artículo,
,Manejo integrado de Hypothenemus hampei bajo dos modelos de capacitación y difusión en México,"Jarquín-Gálvez, Ramón",Artículo,
,Manejo ecológico de la broca del cafeto (hypothenemus hampel) en América Central,"Guharay, Falguni",Artículo,
,Manejo de malezas en el cultivo de frijol en CentroamÃèrica,"Cruz, Ramiro de la",Artículo,
,Manejo de la fertilidad de suelos e insectos plaga :,"Nicholls, Clara I.",Artículo,
,Manejo de cyperus rotundus L. En algunas áreas agrícolas tropicales,"Cruz, Ramiro de la",Artículo,
,Manejo de bemisia tabaci en América Central y el Caribe :,"Hilje, Luko",Artículo,
,Malla de polipropileno para prevenir los daños de virus de la mancha anular en semilleros de papayo (carica papaya L.) Maradol roja,"Hernández Castro, Elías",Artículo,
,Malezas hospedantes de geminivirus en campos de frijol en Cuba,"Sampedro Romero, Javier",Artículo,
,Luis Alberto Fournier Origgi :,"García G., Jaime E.",Artículo,
,Los áfidos alados de la papa y su fluctuación poblacional en Costa Rica,"Meneses R, , Roger",Artículo,
,Los herbicidas empleados en arroz de secano y efectividad ante el incremento de Rottboellia cochinchinensis lour,"Salazar P, Luis Carlos",Artículo,
,Los geminivirus,"Ramírez, Pilar",Artículo,
,Lista preliminar y consideraciones generales acerca de los animales vertebrados plaga en Costa Rica,"Hilje Quirós, Luko",Artículo,
,Leguminosas de cobertura para el manejo de Rottboellia cochinchinensis en el asocio yuca/maíz,,Artículo,
,"Las langostas del género Schistocerca, nomenclatura, biología y distribución geografía de las especies migratorias de Centro y Sur América; notas breves y literatura selecta","Shannon, P.J",Artículo,
,Las feromonas y sus usos en el manejo integrado de plagas,"Blanco-Metzler, Helga",Artículo,
,Las enfermedades del café :,"Cadena Gómez, Gabriel",Artículo,
,La rotación de cultivos como alternativa ecológica y económica para el monocultivo del algodón,"Eiszner, Helmut",Artículo,
,Descripción taxonómica de plagas de importancia agrícola del orden Lepidoptera,"Coto A, Daniel",Artículo,
,Zonificación agro-ecológica para frijol con información edafológica generada por la clasificación campesina de tierras,"Sotelo Ruiz, Erasto Domingo",Artículo,
,Desarrollo de la feromona sexual de spodoptera sunia (lepidóptera:,,Artículo,
2015.0,La construcción discursiva de la competencia eco-ciudadana en la escuela,"Rekondo, Miren",Artículo,
1990.0,Evaluación de trampas de feromona sexual en la captura de machos de plutella xylostella L. (Lepidóptera : plutellidae) En repollo (Brassica oleracea var capitata),"Mora C, Nidia",Artículo,
1989.0,Las arañas,"Chiri, Angel A.",Artículo,
1988.0,Nota descriptiva del pulgón lanígero (Eriosoma lanigerum) de la manzana en Costa Rica,"Hernández R, Juan",Artículo,
,"Utilización de trampas de luz para la captura de adultos de phyllophaga spp. en caña de azúcar, en Costa Rica","Badilla, Francisco",Artículo,
,Acaros fitoparásitos asociados al cultivo del mango (mangifera indica L) En Costa Rica,"Ochoa, Ronald",Artículo,
,Acciones de prevención contra la leprosis de los cítricos en Costa Rica,"Araya González, Eliécer",Artículo,
,Acción conjunta del paraquat y el 2.4-D en malezas asociadas al café en Costa Rica,"Echegoyén, Plutarco Elías",Artículo,
,Acercamiento a una agroecología indígena,"Martínez Castillo, Róger",Artículo,
,Actividad in vivo de Trichoderma harzianum sobre Sclerotium rolfsii en plántulas de tomate,"Alonso Reyes, Reynaldo",Artículo,
,Adherencia y parasitismo de Pasteuria penetrans en Meloidogyne incognita y Meloidogyne arabicida,"Rojas Miranda, Tomás",Artículo,
,Agroecología :,"Martínez Castillo, Róger",Artículo,
,Agroecología y desarrollo rural sostenible en América Latina,"Altieri, Miguel",Artículo,
,"Agroforestería, forestería comunitaria y agroecología","Varela, Rafael",Artículo,
,Algunas relaciones tróficas entre insectos y malezas en cultivos de América Central,"Coto, Daniel",Artículo,
,"Analisis económico del manejo del picudo de chile (Anthonomus eugenii Cano) En Zacapa, Guatemala",,Artículo,
,"Anotaciones sobre historia ambiental, ecológica política y agroecológica en una perspectiva latinoamericana","Alimonda, Héctor",Artículo,
,"Antecedentes y estrategias para el combate de Diaprepes abbreviatus, plaga invasora del Caribe","Lapointe, Sthephen L.",Artículo,
,Aportes al conocimiento del manejo del complejo mosca blanca-geminivirus en Costa Rica,"Ramírez, Pilar",Artículo,
,Apreciación agroecológica del agroecosistema indígena,"Martínez Castillo, Róger",Artículo,
,Aprendizaje de agricultores vinculado con procesos ecológicos para un mejor manejo de plagas :,"Staver, Charles",Artículo,
2015.0,"Comentario al libro Metabolismos, naturaleza e historia : hacia una teoría de las transformaciones sociológicas, de Manuel González de Molina y Víctor Manuel Toledo","López López, Maximiliano,",Artículo,
2014.0,"Avifauna en sistemas silvopastoriles en el Corredor Biológico Mesoamericano, Tabasco, México","González Valdivia, Noel",Artículo,
2014.0,"Effect of soil drying on rate of rate stress development, leaf gas exchange and proline accumulation in robusta coffe (Coffea canephora pierre ex froehner) clones","Tesfaye, S. G.",Artículo,
2014.0,Nitrous oxide and carbon dioxide emission from maize (Zea mays L.) under fertiliser application and elevated carbon dioxide in northwest India,"Daripa, A.",Artículo,
2007.0,Experiencias y perspectivas del manejo de plagas forestales en Costa Rica,"Arguedas Gamboa, Marcela,",Artículo,
2008.0,Fundación Madre Verde : trabajando en Palmares,"Rodríguez, Cindy",Artículo,
2008.0,Promueven producción agroecológica para disminuir crisis alimentaria :,"Gutiérrez Wa-chong, Tatiana",Artículo,
2006.0,Certificación ambiental en apogeo : sellos verdes facilitan venta de productos a unas 37 empresas en Europa y Estados Unidos,"González, César",Artículo,
2004.0,Análisis comparativo de dos fincas productoras de café orgánico utilizando los métodos del balance energético y agroeconómico,"Marozzi Rojas, Marino",Artículo,
2003.0,Metodologías participativas de investigación,"Martínez Castillo, Róger",Artículo,
2011.0,Cambio climático y cultivos ecológicos,"Leahy, Stephen",Artículo,
2011.0,Agrobiodiversidad y desarrollo sostenible :,"Onofre Nodari, Rubens",Artículo,
2002.0,Manejo integrado de plagas :,"Rugama, R. A.",Artículo,
2012.0,Globalización de la agricultura y la alimentación ,"Martínez Castillo, Róger; Investigador, Universidad Nacional.",Artículo,https://www.repositorio.una.ac.cr/handle/11056/34
,Avances en el control biológico de Botritys cinerea en chile y tomate cultivados bajo techo,"Salas Brenes, William",Artículo,
2012.0,"Señas agroclimáticas andinas en la agrobiodiversidad en la comunidad campesina de koriñahui del distrito de pukara, provincia de lampa, región puno (Perú)","Fernández, Luis Fernando",Artículo,
,Desarrollo de un método de muestreo para las larvas de opsiphanes cassina felder en palma aceitera,"Rhainds, Marc",Artículo,
1995.0,"Incidencia de alternaria sp. y tallo hueco en dieciseis cultivares de brocoli (brassica oleracea) Var Italica en san Pablo de Oreamuno, costa Rica","Monge Guevara, José E.",Artículo,
1995.0,Fluctuación poblacional de las especies de áfidos(aphididae: homóptera) y su distribución en la planta de brocoli (brassica oleracea var italica),"Cerón Hernández, Oscar José",Artículo,
2014.0,Cropping system effects on soil quality for three agro-ecosystems in India,"Sinha, Nishant K.",Artículo,
2014.0,Del manejo tradicional al manejo orgánico del olivar,"González de Molina Navarro, Manuel",Artículo,
2014.0,Contribuciones de la historia ambiental para la sustentabilidad local,"Cariño Olvera, Martha Micheline",Artículo,
2014.0,Determinants of small scale dairy sheep producer’ decisions to use middlemen for accessing markets and getting loans in dry marginal areas in Syria,"Abdelali-Martini, Malika",Artículo,
2014.0,Differential response of maize and mungbean to tobacco allelopathy,"Farooq, Muhammad",Artículo,
2014.0,On-farm evaluation of the effects of the principles and components of conservation agriculture on maize yield and weed biomass in Malawi,"Ngwira, A. R.",Artículo,
2014.0,Seguridad y cultura alimentaria en comunidades productoras de alimentos,"Velásquez Hernández, José Ramón,",Artículo,
1996.0,"Abundancia estacional y daño de plutella xylostella (L). (Lepidóptera: plutellidae) y el cultivo de repollo durante la época seca en Alfaro Ruiz, Alajuela, Costa Rica","Barrantes A., Juan Antonio",Artículo,
,"Avances en el manejo integrado de bemisia tabasi en tomate y chile en Oaxaca, México","Ruiz V., Jaime",Artículo,
,Abejas silvestres y polinización,"Nates-Parra, Guiomar",Artículo,
,Bases para el manejo integrado de Thrips palmi,"Vázquez, Luis",Artículo,
,Combate del ácaro Tetranychus urticae (koch) en fresas (Fragaris sp.) en Costa Rica,"Masís, Carlos",Artículo,
,"Control del saltahojas de la caña de azúcar Perkinsiella saccharicida con los hongos Metarhizium anisopliae y Beauveria bassiana en el Ingenio San Carlos, en Ecuador","Badilla, Francisco",Artículo,
,Combate químico de arañitas rojas (ACARI :,"Ochoa, Ronald",Artículo,
,Comparación de la incidencia de enfermedades del fruto en sitemas de producción de café orgánico y convencional,,Artículo,
,Comparación de sistemas para la producción de plántulas de tomate frente al complejo moscas blancas-geminivirus,"Piñon, Mayte",Artículo,
,Compatibilidad de Beauveria bassiana y extractos acuosos de Nim (Azadirachta indica) para el control de la broca del cafeto (Hypothenemus hampei),,Artículo,
,Competencia de caminadora Rattboellia cochinchinensis en cultivo de frijol rojo Phaseolus vulgaris L.,"Ulloa F,, Marcos",Artículo,
,"Competencia nutricional de arachis pintoi, como cultivo de cobertura durante el establecimiento de pejibaye (bactris gasípaes H.B.K.)","Domínguez V, José A",Artículo,
,"Comportamiento biológico del cyperus rotundus L. I Fases fenoñópgicas, dinámica de crecimiento y capacidad reproductiva","Gamboa M, William",Artículo,
,"Comunidad de arañas (Arachnida, Araneae) del cultivo de alfalfa (Medicago sativa) en Buenos Aires, Argentina","Armendano, Andrea",Artículo,
,Combate de fusarium thapsinum y claviceps africana mediante semillas de sorgo tratadas con productos naturales,"Montes Belmont, Roberto",Artículo,
,Conceptualización del manejo integrado de plagas en escalas espaciales y niveles de integración más amplios,"Kogan, Marcos",Artículo,
,Conservación y uso de los recursos naturales,"Madrigal, Víctor",Artículo,
,Consideraciones sobre plaguicidas peligrosos en América Central,"Wesseling, Catharina",Artículo,
,"Consideraciones teóricas y prácticas sobre el compost, y su empleo en la agricultura orgánica","Soto, Gabriela",Artículo,
,Control de Atta spp. con prácticas agrícolas e insecticidas botánicos,"Gruber, Anne Kathrina",Artículo,
,Cultivos asociados y uso de arrope para el manejo de Bemisia tabaci y el virus del mosaico Dorado frijol,"González Bez, Miguel",Artículo,
,Control de malezas en banano (Musa spp.) mediante hojarasca del cultivo,,Artículo,
,Cultivo in vitro de ojo de gallo,"González Vargas, Manrique",Artículo,
,Control de tetranychus tumidus mediante phytoseiulus macropilis en viveros de plátano,"Ramos Lima, Mayra",Artículo,
,"Cuantificación de daños por insectos en los frutos del tempate, Atropha curcas (Euphorbiaceae) a través de una tabla de vida","Grimm, Christoph",Artículo,
,Copro-necrophagous beetle (Coleoptera:,"Reyes Novelo, Enrique",Artículo,
,"Avances hacia el manejo sostenible del complejo mosca blanca-geminivirus en tomate, en Costa Rica","Hulje, Luko",Artículo,
,Combate biológico de Liriomyza sp. (Diptera:,"Carballo, Manuel",Artículo,
,Control microbiológico de phytophthora infestans en tomate,"Sánchez Garita, Vera",Artículo,
,Desarrollo de estrategias de manejo integrado de plagas para eliminar las barreras sanitarias que restringen la exportación de productos agrícolas,"Follet, Peter A.",Artículo,
,Caficultura orgánica como alternativa a la crisis,"Marín, Gerardo",Artículo,
,Biología y enemigos naturales de tetranychus urticae en pimentón,"Gallardo, Antonio",Artículo,
,Clorito Picado :,"Hilje Quirós, Luko",Artículo,
,"Calendarización, uso racional, sustitución y rediseño :","Clavijo, Neidy",Artículo,
,Captura de adultos de liriomyza huidobrensis (Blanchard) mediante trampas y su relación con el daño producido en plantas de papa (solanum tuberosum),"Gómez Bonilla, Yannery",Artículo,
,Cómo medir la calidad de los abonos orgánicos,"Soto, Gabriela",Artículo,
,Caracteres agronómicos afectados por la aparición de Steneotarsonemus Spinki en arroz en Cuba,"Miranda Cabrera, Ileana",Artículo,
,"Caracterización agroeconómica de la fitoprotección en el cultivo del tomate, Valle Central de Costa Rica",,Artículo,
,Caracterización de aislamiento de phytophthora infestans nativos de Costa Rica,"Sánchez Garita, Vera",Artículo,
,Caracterización morfológica de larvas de Anastrepha obliqua y Anastrepha suspensa en Cuba,"Rodriguez, Yilianys",Artículo,
,Caracterización y magnitud de los daños producidos por Thrips tabaci en cebolla en Cuba,,Artículo,
,Caracterización y patogenicidad de bacterias asociadas con el ataque de neosilba sp. (Diptera:,,Artículo,
,Cómo determinar la repelencia de sustancias aleloquímicas sobre las moscas blancas,"Hilje Quirós, Luko",Artículo,
,Biología de Antiteuchus tripterus L. (Hemiptera:,"Umaña M, Edgar",Artículo,
,Ciclo biológico y morfología del salerillo Paratrioza cockerelli (sulc.) (Homoptera:,,Artículo,
,Biodiversidad y diseño agroecológico :,"Nichills, Clara",Artículo,
,Ciclo biológico y reproducción de thrips tabaci Lindeman (thysanoptera : thripidae) en cebolla y ajo,"Jiménez Jiménez, Santiago F.",Artículo,
,Biodiversidad como fundamento en la exclusión y manejo de plagas,"Bustamante, Elkin",Artículo,
,Bibliografía sobre Biotecnología aplicada a la fitoprotección,,Artículo,
,"Brote de larvas de Rothschildia orizaba (Lepidoptera: Saturniidae) en café, una experiencia en manejo integrado de plagas","Quesada, José Rutilio",Artículo,
,"Biología y manejo del descortezador de pinos, Dendroctonus frontalis","Cibrián Tovar, David",Artículo,
1997.0,Memorias /,Curso Agroecología 97-7,Conferencia,
1999.0,Memorias /,Curso Agroecología 99-7,Conferencia,
2000.0,Memoria /,Curso Agroecología 2000-7,Conferencia,
2001.0,Memoria /,Curso Agroecología 2001-7,Conferencia,
1991.0,Memoria /,Curso Agroecología : el futuro de latinoamérica 91-7,Conferencia,
1994.0,Memoria /,Curso Agroecología 94-7,Conferencia,
1993.0,Memoria /,Curso Agroecología : nuevas visiones 93-7,Conferencia,
1995.0,Memoria /,Curso Agroecología 95-7,Conferencia,
2007.0,Escalonando la agroecología :,"Ranaboldo, Claudia",Monografía,
2005.0,Produccion agroecologica :,"Gamboa Moya, Margarita",Monografía,
2006.0,Alimentos sanos y una mejor calidad de vida: agricultura orgánica /,"Bravo, Patricia",Monografía,
2005.0,Producción de lechuga. /,"Blanco Metzler, Helga,",Monografía,
2005.0,Efectos del pago por servicios ambientales y la certificación forestal en el desempeño ambiental y socioeconómico del manejo de bosques naturales en Costa Rica /,"Garay, Miluzka",Monografía,
2007.0,Regionalidad y localidad en la globalización /,,Monografía,
2004.0,Multi-scale integrated analysis of agroecosystems /,"Giampietro, Mario",Monografía,
2006.0,Génesis y trayectoria de un modelo agro-ecológico :,"Samandú, Luis",Monografía,
2003.0,Taller :,,Monografía,
2006.0,De la sociología rural a la agroecología /,"Sevilla Guzmán, Eduardo",Monografía,
2006.0,Introduction to agroecology :,"Wojtkowski, Paul Anthony,",Monografía,
2003.0,Tropical agroecosystems /,"Vandermeer, John H.",Monografía,
2006.0,Los ’90 y el nuevo siglo en los sistemas de extensión rural y transferencia de tecnología públicos en el Mercosur /,"Thornton, Ricardo Dominic",Monografía,
1995.0,Memoria /,,Monografía,
2002.0,Agroecología :,"Gliessman, Stephen R.",Monografía,
1986.0,Estudios agroclimáticos y zonificación agroecológica de cultivos :,"Rojas, Oscar E.",Monografía,
1987.0,Zonificación agroecológica para el cultivo del café (coffea arabica) en Costa Rica /,"Rojas, Óscar E.",Monografía,
1982.0,Mammal Ecology /,"Delany, M. J.",Monografía,
2007.0,Agroecosystems in a changing climate /,"Newton, Paul C. D.",Monografía,
1987.0,Agroecology :,"Altieri, Miguel A.",Monografía,
1989.0,Programa Nacional de Investigación y Transferencia de tecnología para el cultivo de la Guanabana.,,Monografía,
1993.0,El sistema agroecológico de Guanacaste :,"Hagnauer, Werner",Monografía,
1993.0,Modelos edafológicos de sistemas agroforestales /,"Fassbender, Hans W.",Monografía,
1995.0,Desarrollo agroecológico y asociatividad campesina /,"Nuñez Soto, Orlando",Monografía,
1996.0,Memoria /,Curso Agroecología 96-7,Monografía,
1997.0,Promover la agricultura sostenible en América Central :,"Baumeister, Eduardo",Monografía,
1998.0,Agroecology :,"Gliessman, Stephen R.",Monografía,
1999.0,Nuevas alianzas para la agricultura sostenible /,"Thrupp, Lori Ann, editora",Monografía,
1999.0,Biodiversity in agroecosystems /,"Collins, Wanda Williams",Monografía,
2000.0,Introducción a la agroecología como desarrollo rural sostenible /,"Guzmán Casado, Gloria I.",Monografía,
2000.0,"Café, ambiente y sociedad en la cuenca del río Virilla, Costa Rica :","Rojas Chaves, Gladys Elena",Monografía,
2001.0,Elementos de agroecología de suelos /,Ministerio de Agricultura y Ganadería,Monografía,
2002.0,Uso de leguminosas en la agricultura de cobertura en los Chimalapas :,"Vargas Nicasio, Ángel Antonio",Monografía,
2002.0,Landscape ecology in agroecosystems management. /,,Monografía,
2002.0,Ecología del paisaje :,"Burel, Francoise",Monografía,
2007.0,Escuelas Campesinas Agroecológicas.,"Posso L., Liliana,",Monografía,
2013.0,En busca de la igualdad :,,Monografía,
2007.0,"Valoración económica, ecológica y ambiental :","Cisneros, Jesús",Monografía,
2007.0,Memoria.,"Foro Internacional de Agronegocios de frutas tropicales (III: 2006: San José, C.R)",Monografía,
2012.0,Agroecology and strategies for climate change /,"Lichtfouse, Eric",Monografía,
2012.0,"Manejo, conservación y desarrollo de la agrobiodiversidad en frijol. /","Rosas, Juan Carlos",Monografía,
2012.0,Managing agricultural greenhouse gases :,"Liebig, Mark A.",Monografía,
2012.0,Conociendo el Distrito Federal /,,Monografía,
2012.0,Diseños agroecológicos para potenciar el control biológico de plagas :,"Altieri, Miguel A",Monografía,
2012.0,Manejo agroecológico. /,"Sierra Agustinus, Alejandra",Monografía,
2013.0,"Movimientos sociales, participación y ciudadanía en Andalucía /","Escalera Reyes, Javier",Monografía,
2013.0,Tópicos y problemas de la historia ambiental costarricense :,"Hernández Rodríguez, Carlos A.",Monografía,
2013.0,Microbial ecology in sustainable agroecosystems /,"Cheeke, Tanya E., editora",Monografía,
2012.0,Agrosistemas :,"Civeira, Gabriela",Monografía,
2014.0,"Género, agroecología y soberanía alimentaria :","Siliprandi, Emma",Monografía,
2015.0,Ideas latinoamericanas sobre el enfoque de cadenas globales de mercancías /,"Díaz Porras, Rafael,",Monografía,
2016.0,Vislumbrando agroecosistemas menos vulnerables a la variabilidad climática en los Andes de Colombia :,"Muñoz López, Juliana,",Monografía,
2016.0,"Género, etnia, seguridad y soberanía alimentaria :","Madden Arias, Lidiethe,",Monografía,
2016.0,Temperate crop science and breeding :,"Bekuzarova, Sarra A., editor",Monografía,
2017.0,Sostenibilidad de la agricultura campesina :,"Chaparro Africano, Adriana María,",Monografía,
2017.0,¿Quién alimenta realmente al mundo? :,"Shiva, Vandana,",Monografía,
2017.0,Manejo sanitario del agrosistema /,"Garrido Rivero, Rubén,",Monografía,
2018.0,Ecología política de la agricultura :,"Giraldo, Omar Felipe,",Monografía,
,Agroecología /,"Ponce, P.",Monografía,
,Agroecología y sustentabilidad.,"Gutiérrez Cedillo, Jesús Gastón",Monografía,
2015.0,"Agroecology, ecosystems, and sustainability /","Benkeblia, Noureddine, editora",Monografía,
2011.0,Manejo agroecológico como ruta para lograr la sostenibilidad de fincas con café y ganadería /,"Villanueva, Cristóbal",Monografía,
2012.0,Estrategia de equidad e igualdad de género :,"Siles, Jackie",Monografía,
2011.0,Cultivo de morera (morus spp) y su uso en la alimentación animal /,"Castro Ramírez, Álvaro,",Monografía,
2007.0,Agroecology in action :,"Warner, Keith Douglass",Monografía,
2008.0,Agricultural systems :,"Pound, Barry",Monografía,
2008.0,Planificación agroecológica de fincas ganaderas :,"Villanueva, Cristóbal",Monografía,
2008.0,Ecological basis of agroforestry /,"Batish, Daizy Rani",Monografía,
2008.0,Bee pollination in agricultural ecosystems /,"Pitts-Singer, Theresa L.",Monografía,
2008.0,Evaluación agro-ecológica de suelos :,"Rosa Acosta, Diego de la",Monografía,
2008.0,Manual para la reproducción de semillas de hortalizas.,,Monografía,
2008.0,Etnoagroecología en Talamanca. /,"Martínez Castillo, Rogér",Monografía,
,Memoria,"Simposio sobre Agroecología ([199-] abr. 20-21 : Heredia, C. R.)",Monografía,
2008.0,Ecoagricultura :,"McNeely, Jeffrey A.",Monografía,
2009.0,Desarrollo de indicadores ambientales y de sustentabilidad en México /,,Monografía,
2011.0,Cultivo agroecológico del aguacate :,"Larios Guzmán, Antonio",Monografía,
1982.0,Agroecología del trópico americano /,"Montaldo, Patricio",Monografía,
2011.0,Crop adaptation to climate change /,"Yadav, Shyam S., editor",Monografía,
2009.0,Ecological management and sustainable development in the humid tropics of Costa Rica /,"Kohlmann, Bert",Monografía,
2010.0,Nature´s matrix :,"Perfecto, Ivette,",Monografía,
2011.0,Introduction to wildlife conservation in farming /,"Burchett, Stephen,",Monografía,
2010.0,Agroecología y producción ecológica. /,"Bello, Antonio",Monografía,
2011.0,Testamento agrícola :,"Mejía Gutiérrez, Mario",Monografía,
2010.0,Manual agropecuario :,,Monografía,
2009.0,Estrategia Regional Agro-Ambiental y de salud :,,Monografía,
2011.0,Agricultura orgánica y cambio climático. /,"Castro Ch., Jonathan",Monografía,
2011.0,The ecology of agroecosystems /,"Vandermeer, John H.",Monografía,
,Características de la agrobiotecnología,"Martínez C., Róger",Seriada,
2018.0,Diversidad genética del maíz criollo y su conservación in situ en huertos familiares de la Zona Norte de Costa Rica. /,"Barrientos Matamoros, Guido,",Tesis,
2014.0,Efecto de la suplementación con moros alba Linn en la ceba de ovinos /,"Alpízar Naranjo, Andrés",Tesis,
1991.0,"La capacitación y la concientización críticas, instrumentos básicos para la planificación hacia el eco-desarrollo: un ejercicio en la microcuenca ubicada en la provincia de Santa Lucia, Departamento de Boaco, Región V, Nicaragua /","Miranda Franca, Wellington",Tesis,
2013.0,Validación de modelo financiero de cuantificación de los servicios agroecosistémicos en fincas campesinas /,"Fallas Henriquez, Andrea",Tesis,
2004.0,Factores que inciden en la inserción laboral de los graduados del C.T.P. de Buenos Aires durante los períodos 2001 a 2003 /,"Martínez Segura, Marcela,",Tesis,
2011.0,"El desarrollo de los sistemas de cultivo de banano, palma africana, arroz y melón y su relación con el uso agrícola del agua en el cantón Parrita (1938-2010) /","Ledezma Díaz, Rafael Ángel",Tesis,
2014.0,Principios de estrategias agroecológicas para el combate de enfermedades en hortalizas :,"Torres Asuaje, Pedro Emilio",Tesis,
2006.0,"Efectos del clorpirifos en la salud de trabajadores bananeros de la Lima, Honduras ","Wesseling, Catharina; Aragón, Aurora; Rojas, Marianela; Blanco, Luis; López, Lylliam; Soto, Arlen; Fúnez, Aura; Ruepert, Clemens; Miranda, Jamilet; López, Indiana",articulo,https://www.repositorio.una.ac.cr/handle/11056/8583
2010.0,Alternativas educativas y jurídicas por y para los pueblos indígenas de latinoamerica :propuestas decoloniales ,"Pineau Joly, Fanny Pauline Jeannette; Trillo Pérez, Erick Abraham",Tesis,https://www.repositorio.una.ac.cr/handle/11056/14422
2012.0,Edad al primer parto y efecto sobre parámetros (re)productivos en vacas Holstein de lechería especializada en Costa Rica: periodo 2000 - 2011 ,"Salazar Carranza, Mauren",Tesis,https://www.repositorio.una.ac.cr/handle/11056/12949
2012.0,Relaciones de género: reconocer y comprender las relaciones entre hombres y mujeres / ,"Blanco Lobo, Monserrat",Monografía,https://www.repositorio.una.ac.cr/handle/11056/2634
2012.0,"METODOLOGIAS PARTICIPATIVAS DE INVESTIGACIÓN: UN APORTE AGROECOLÓGICO , AL DESARROLLO ENDÓGENO ","Martínez CastIllo, Róger; Profesor-Asociado UNA-UCR.",articulo,https://www.repositorio.una.ac.cr/handle/11056/3205
2003.0,"Control documental en el cantón de Puriscal, San José, Costa Rica / ","Bogantes Sánchez, Gabriela; Campos Camacho, Ana Cecilia; Mora García, Blanca Rosa",tesis,https://www.repositorio.una.ac.cr/handle/11056/2502
2013.0,El compromiso de las universidades centroamericanas con la población trabajadora ,"Bermúdez Madriz,Juan",articulo,https://www.repositorio.una.ac.cr/handle/11056/8587
2013.0,Las Noticias Centroamericanas. Volumen 8 Completo. ,Programa SALTRA,otro,https://www.repositorio.una.ac.cr/handle/11056/10549
2015.0,Del manejo tradicional al manejo orgánico del olivar: aplicaciones prácticas del conocimiento histórico.Del manejo tradicional al manejo orgánico del olivar: aplicaciones prácticas del conocimiento histórico. ,"González de Molina Navarro, Manuel; Infante-Amate, Juan; Guzmán Casado, Gloria",articulo,https://www.repositorio.una.ac.cr/handle/11056/11842
2016,"Manejo fitosanitario del ""limón mesina"" (Citrus latifolia Tan.) Aranjuez, Puntarenas, Costa Rica ","Jiménez Fernández, María Daniela",tesis,https://www.repositorio.una.ac.cr/handle/11056/13485
2016,"Evaluación de los servicios de polinización de Apis Mellifera L. (Hymenoptera: Apidae) en el cultivo del aguacate (Persea Americana Mill Var. Hass) y su aporte en la producción. San Pablo de León Cortés, San José, Costa Rica ","Jiménez Masís, Rosa María",tesis,https://www.repositorio.una.ac.cr/handle/11056/13486
2016,Propuesta metodológica para cuantificar y compensar los servicios agroecosistémicos generados por la aplicación de buenas prácticas agropecuarias ,"Fallas Henríquez, Andrea",tesis,https://www.repositorio.una.ac.cr/handle/11056/13809
2016,Efecto del compost y condiciones agroecológicas sobre la concentración de polifenoles de mora (Rubus adenotrichos Schtdl) en dos localidades de Costa Rica ,"López Abarca, Ronald Saúl",tesis,https://www.repositorio.una.ac.cr/handle/11056/13662
2016,"Evaluación de hongos y extractos naturales aplicados vía foliar para el combate del amachamiento del frijol, causado por el nemátodo Aphelenchoides besseyi (CHRISTIE) ","Fallas Garita, Carolina",tesis,https://www.repositorio.una.ac.cr/handle/11056/13660
2016,"Efecto de los áfidos, las hormigas y su asociación sobre el aborto de los cojines florales enhíbridos de Theobroma Cacao ","Garita Rojas, Cristian",tesis,https://www.repositorio.una.ac.cr/handle/11056/13686
2017,"Aislamiento e identificación molecular de la bacteria Pasteuria penetrans en fincas bananeras comerciales de la región Caribe de Costa Rica, y su evaluación in vitro contra el nemátodo barrenador Radopholus similis (Thorne) y Meloidogyne Goeldi, 1892 ","Oses Ramírez, Luis Carlos",tesis,https://www.repositorio.una.ac.cr/handle/11056/14190
2017,Zonificación de las áreas propensas a incidentes por ataques de crocodylus acutus en el Pacífico Central de Costa Rica utilizando un sistema de información geográfico ,"Sandoval Murillo, Luis Fernando",tesis,https://www.repositorio.una.ac.cr/handle/11056/14254
2017,"Negociación de servicios ambientales de pequeños agricultores de Nicaragua, Guatemala y Brasil en el mercado voluntario de carbono ","Amador Benavides, Manuel H.",tesis,https://www.repositorio.una.ac.cr/handle/11056/14133
2017,Desarrollo de una metodología para la evaluación de la patogenicidad y selección in vitro de hongos entomopatógenos y sus metabolitos para el manejo de Psudococcus elisae (Hemíptera: pseudococcidae) en banano (musa AAA) ,"Solera González, Karen Graciela",tesis,https://www.repositorio.una.ac.cr/handle/11056/14571
2017,"La red de mujeres rurales :la experiencia de organización. Estudio de caso en los cantones de Los Chiles, Upala, Siquirres y Buenos Aires de Costa Rica ","Bonilla Leiva, Alejandra",tesis,https://www.repositorio.una.ac.cr/handle/11056/14242
2017,"Evaluación de cinco tratamientos aplicados a las especies forestales utilizadas en la restauración de bosques de la estación experimental Forestal Horizontes, Guanacaste, Costa Rica ","Rico Urones, Alberto",tesis,https://www.repositorio.una.ac.cr/handle/11056/14137
2017,Efecto del cambio climático y variabilidad climática en la distribución de áreas aptas para la producción de arroz en secano para Costa Rica ,"Quesada Hernández, Luis Eduardo",tesis,https://www.repositorio.una.ac.cr/handle/11056/14244
2017,"Repelencia de tres extractos naturales en el combate de mosca blanca Bemista tabaci (Hemiptera: Aleyrodidae) en el cultivo del melón en la zona de Trinidad Vieja de Salinas, Puntarenas, Costa Rica ","Corrales Castillo, Jordan Eliécer",tesis,https://www.repositorio.una.ac.cr/handle/11056/14030
2018,"Efecto del abastecimiento hídrico en ambiente protegido sobre el rendimiento y variable morfo-fisiológicas de chile (Capsicum annuum) y pepino (Cucumis sativus L.) en Heredia, Costa Rica ","Jara Víquez, Fabián",tesis,https://www.repositorio.una.ac.cr/handle/11056/14579
2018,Dinámica de la estructura del paisaje en el ecosistema de páramo y su relación con factores climáticos e incendios : Cerro de la Muerte (Buena Vista) 1992 y 2012 ,"Vega Mena, Baleska; Rodríguez Solano, Francinie",tesis,https://www.repositorio.una.ac.cr/handle/11056/14868
2018,Diversidad genética del maíz criollo y su conservación in situ en huertos familiares de la Zona Norte de Costa Rica ,"Barrientos Matamoros, Guido",tesis,https://www.repositorio.una.ac.cr/handle/11056/14858
2018,"Evaluación de la tolerancia de cinco líneas de café derivadas del ""Sarchimor T5296"" contra el nemátodo agallador Meloidogyne exigua (Gûeldi 1887) en etapa de almácigo, en San Isidro de Alajuela ","Artavia Carmona, Ademar",tesis,https://www.repositorio.una.ac.cr/handle/11056/14863
2018,Evaluación nutricional y económica de la producción de forraje verde hidropónico de maíz (Zea mays) empleando grano comercial ,"Moreno Alvarado, Isaac",tesis,https://www.repositorio.una.ac.cr/handle/11056/14958
2018,"Factores de éxito en la comunidad de Salinas de Guaranda, Bolívar, Ecuador, que han permitido la sostenibilidad de emprendimientos comunitarios y distintas estrategias hacia un desarrollo rural inclusivo e integral ","Heredia Heredia, Ángel Humberto",tesis,https://www.repositorio.una.ac.cr/handle/11056/15118
2018.0,"Agroecología, soberanía alimentaria y feminismo. La Red de Mujeres Rurales de Costa Rica. ","Bonilla Leiva, Alejandra",Conferencia,https://www.repositorio.una.ac.cr/handle/11056/14810
2019.0,Aprendizajes Intergeneracionales para la Sustentabilidad Ambiental en un Programa para Mayores en Costa Rica ,"León Fernández, Maribel; Vega García, Heidy; Corrales Camacho, Ismael",Conferencia,https://www.repositorio.una.ac.cr/handle/11056/15032
2012.0,A AGRICULTURA CAMPONESA E OS DESAFIOS DO PRONAF NO MUNICÍPIO DO CRATO/CE ,"de Lima, Cícero Erivaldo; Geografia – UFC. Fortaleza – Ceará – Brasil.",articulo,https://www.repositorio.una.ac.cr/handle/11056/5991
2012.0,A RELAÇÃO DE TRABALHO NO ASSENTAMENTO DE REFORMA AGRÁRIA “CONQUISTA DA LIBERDADE” RS/BRASIL ,"Mantelli, Jussara; Universidade Estadual de Maringá – Brasil.; Rodrigues Nóbrega, Michelle; Universidade Estadual de Maringá – Brasil.; Ferreira da Luz, Tânia; Universidade Estadual de Maringá – Brasil.",articulo,https://www.repositorio.una.ac.cr/handle/11056/5972
2012.0,"A TERRITORIALIZAÇÃO DA AGROECOLOGIA NO TERRITÓRIO RURAL DO VALE DO RIBEIRA, PARANÁ, BRASIL ","Muterlle, Juliana Carla; Universidade Estadual de Ponta Grossa; Gonçalves Cunha, Luiz Alexandre; Universidade Estadual de Ponta Grossa",articulo,https://www.repositorio.una.ac.cr/handle/11056/6678
2012.0,Algunos aspectos sobre los transgénicos ,"Martínez Castillo, Róger",articulo,https://www.repositorio.una.ac.cr/handle/11056/2413
2012.0,"CAMPESINATO, RESISTÊNCIA E EMANCIPAÇÃO: O MODELO AGROECOLÓGICO ADOTADO PELO MST NO ESTADO DO PARANÁ ","Gonçalves, Sérgio; Universidade Federal de Uberlândia (FACIP – Ituiutaba-MG).",articulo,https://www.repositorio.una.ac.cr/handle/11056/5963
2012.0,CINTURÃO DE ÁREAS PROTEGIDAS EM RONDÔNIA/BRASIL: CORREDORES DE PAISAGEM PARA SALVAGUARDA DO BIOMA AMAZÔNICO ,"Machado Gontijo, Bernardo; UFMG, Brasil.",articulo,https://www.repositorio.una.ac.cr/handle/11056/6021
2012.0,"GEOGRAFÍA, CONSTRUCCIÓN DE TERRITORIO Y JUSTICIA SOCIAL: PRÁCTICAS ESPACIALES, GÉNERO Y DESARROLLO EN CHILE ","Fernández Castillo, Sandra; Universidad de Concepción, Chile",articulo,https://www.repositorio.una.ac.cr/handle/11056/6316
2012.0,POLÍTICAS PÚBLICAS EM AGRICULTURA URBANA E PERIURBANA NO BRASIL ,"Videiro Rosa, Pedro Paulo; Instituto Brasília Ambiental – IBRAM.",articulo,https://www.repositorio.una.ac.cr/handle/11056/5947
2012.0,PRODUÇÃO ALIMENTAR DE BASE AGROECOLÓGICA NA AGRICULTURA FAMILIAR ,"Mantelli, Jussara; Geografia FURG/RS – Brasil.; Santos de Moura, José Francisco; Geografia FURG/RS – Brasil.",articulo,https://www.repositorio.una.ac.cr/handle/11056/5995
2012.0,"Plan integral para el manejo agroecológico de plantaciones de plátano (Musa sp) en la zona de Talamanca, Limón ","Víquez Elizondo, Raquel",tesis,https://www.repositorio.una.ac.cr/handle/11056/13258
2013.0,"Pueblos indígenas amazónicos, autodeterminación y derechos colectivos en el siglo XXI ","Leal Rodrigues, Deborah",revista,https://www.repositorio.una.ac.cr/handle/11056/7955
2012.0,TERRITORIALIDADES OU FRAGMENTOS NA PAISAGEM: ,"Gianasi,, Lussandra M.; Instituto de Geociências e Pesquisadora do Laboratório de Geografia Agrária e Agricultura Familiar.",articulo,https://www.repositorio.una.ac.cr/handle/11056/6001
