channelTitle,channelid,contentDetails/caption,contentDetails/definition,contentDetails/dimension,contentDetails/duration,contentDetails/licensedContent,contentDetails/projection,country,description,id,publishedAt,statistics/commentCount,statistics/dislikeCount,statistics/favoriteCount,statistics/likeCount,statistics/viewCount,title,Caption
Nekudat Chen,Nekudat Chen,False,hd,2d,PT12M12S,False,rectangular,DK,"יום העיון של נקודת ח""ן 2016- שער לחקלאות אקולוגית- אתר מידע בנושא אגרואקולוגיה ד""ר יעל גבריאלי וד""ר אילאיל פרת...",ypQPrjM_hmo,2016-09-25T06:51:38.000Z,0.0,0.0,0,1.0,130,ד&quot;ר יעל גבריאלי- שער לחקלאות אקולוגית - אתר מידע בנושא אגרואקולוגיה,NoCaption
Greens EFA,Greens EFA,True,hd,2d,PT4M28S,False,rectangular,DK,,bLqYE-m2nE4,2017-10-16T10:53:20.000Z,6.0,9.0,0,237.0,11118,Agroecology explained to children....parents can watch,"Agroecology
Explained to kids
parents can watch Agro - eco - logy
Agro = agriculture Logo = reflect
and Eco = home in other words: the planet It's agriculture
Working within nature /natural limits??? Which is opposed to agro industry
which is agriculture to extract-as-much-as-possible' How does industrial agriculture work? To 'exploit natural resources' on a large
intensive scale you have to 'produce uniformity' en masse
which is against the fundamental characteristics of living things,
which are diverse, letting them adapt to thier environment Which couldn't work without using chemical
fertilisers and pesticides (which are actually sold by the same huge
companies who sell the seeds) Ca fait des agriculteurs des stérilisateurs
which is by nature,totally opposed to what they ought to be World farming look like this:
patents capital
Dependence on chemical inputs and lobbies
and that's where the profits are It's revolting!!! Yes, but luckily
That was BEFORE today, this
agrindustrial model is outdated Because we all share a simple idea: We have no second planet
So we'd rather go for agroecology: Producing our food WITH nature
not against nature This is why we invest in creating and protecting
biodiversity, and we protect it as a natural resource With high biodiversity and beneficial species,
living soils, which will provide long term fertility and productivity
... working WITH nature and luckily
when the rules are changed to promote agroecology, It works! And creates lots of real new jobs, And biodiversity working to help farmers. Who boost natural processes and thanks to
that make a decent living not only in one place but in every country this is true for us
but not only for us but also for others
On the condition that we put an end to intensive monocultures
blind and mercantile, trade for trade's sake???? Propped up by / dependent on chemical inputs??
to leave space for low input agriculture that respects nature, and adapts to climate change this is a beautiful and efficient solution
to feed all people agroecology
is about farming WITH nature not against nature
Cooperating with other people not competing against them???? "
מועצה אזורית יואב,מועצה אזורית יואב,False,sd,2d,PT2M,False,rectangular,DK,"מועצה אזורית יואב מעודדת שמירה על הסביבה, אגרואקולוגיה , מיחזור וטיפוח השטחים הפתוחים.",QeF1rWrJZGg,2017-12-31T09:16:55.000Z,0.0,0.0,0,0.0,42,אגרואקולוגיה במועצה - שומרים על הסביבה,NoCaption
בידיים,בידיים,False,hd,2d,PT49M21S,True,rectangular,DK,"במסגרת יום הצגת עבודת הדיפלומה של יותם קיי, רוני אשור ועידו הרפז (בהנחייתה של קרן יעבץ), ערך עידו סיור הצגת...",pMANmE8Y3jI,2011-12-29T16:03:33.000Z,0.0,0.0,0,4.0,1513,סיור עם עידו הרפז במגמה לאגרואקולוגיה עירונית,NoCaption
כפר הנוער עיינות הערוץ הרשמי,כפר הנוער עיינות הערוץ הרשמי,False,hd,2d,PT2M48S,False,rectangular,DK,לפרטים והרשמה: 072-3945886 http://ayanot.org.il/ https://www.facebook.com/ayanot.is.fun/ אצלנו תמצאו תיכון ייחודי וחדשני שיוביל אתכם אל מקצוע...,miKueBX2QXM,2018-02-11T21:24:00.000Z,0.0,0.0,0,3.0,650,כפר הנוער עיינות - סרטון תדמית,NoCaption
Food and Agriculture Organization of the United Nations,Food and Agriculture Organization of the United Nations,False,hd,2d,PT15M27S,False,rectangular,IT,http://www.fao.org/about/meetings/afns/en/ The video outlines three case studies of farmers utilizing agroecological practices in their farming systems. It focuses ...,GO7e5yrQuEI,2014-09-26T17:14:30.000Z,,,0,,11121,Agroecology: farmer&#39;s perspectives,NoCaption
מכללת ספיר,מכללת ספיר,False,hd,2d,PT1M4S,False,rectangular,IL,בוגרי התכנית למדעים שנה א' בספיר משתפים. התכנית ללימודי מדעים שנה א׳ בספיר מאפשרת לסטודנטים שלא עמדו בתנאי...,EA7e1-cM47k,2018-07-11T11:13:52.000Z,0.0,0.0,0,1.0,472,מדעים שנה א&#39; בספיר - אפיק מעבר לאוניברסיטאות,NoCaption
המכללה האקדמית אחוה,המכללה האקדמית אחוה,False,hd,2d,PT1H30M5S,False,rectangular,IL,"אתגרי הקיימות בניהול המרחב העירוני והכפרי - כנס הקיימות השנתי במכללה האקדמית אחוה, יום שלישי 9 במאי 2017. חלק...",L6hhZswBoLw,2017-05-11T09:57:34.000Z,0.0,0.0,0,1.0,77,כנס הקיימות באחוה - חלק א&#39;,NoCaption
כפר הנוער עיינות הערוץ הרשמי,כפר הנוער עיינות הערוץ הרשמי,False,hd,2d,PT1M45S,False,rectangular,IL,לפרטים והרשמה: 072-3945886 http://ayanot.org.il/ https://www.facebook.com/ayanot.is.fun/ אצלנו תמצאו תיכון ייחודי וחדשני שיוביל אתכם אל מקצוע...,YjTW88jDASk,2018-02-07T12:53:50.000Z,0.0,0.0,0,1.0,43,"אלעד, חניך בכפר הנוער עיינות מספר איך עזרו לו לבנות ביטחון עצמי ולהכיר חברים חדשים!",NoCaption
כפר הנוער עיינות הערוץ הרשמי,כפר הנוער עיינות הערוץ הרשמי,False,hd,2d,PT52S,False,rectangular,IL,לפרטים והרשמה: 072-3945886 http://ayanot.org.il/ https://www.facebook.com/ayanot.is.fun/ אצלנו תמצאו תיכון ייחודי וחדשני שיוביל אתכם אל מקצוע...,1j4TnMOQffI,2018-02-07T20:37:29.000Z,0.0,0.0,0,0.0,37,"רויטל, חניכה בכפר הנוער עיינות מספרת על מגוון הפעילויות בכפר!",NoCaption
כפר הנוער עיינות הערוץ הרשמי,כפר הנוער עיינות הערוץ הרשמי,False,hd,2d,PT1M58S,False,rectangular,IL,לפרטים והרשמה: 072-3945886 http://ayanot.org.il/ https://www.facebook.com/ayanot.is.fun/ אצלנו תמצאו תיכון ייחודי וחדשני שיוביל אתכם אל מקצוע...,_CQsHrBNKuE,2018-02-07T08:11:50.000Z,0.0,0.0,0,1.0,32,"הגר, בוגרת כפר הנוער עיינות מספרת על התרומה של הכפר להצלחה שלה!",NoCaption
כפר הנוער עיינות הערוץ הרשמי,כפר הנוער עיינות הערוץ הרשמי,False,hd,2d,PT2M44S,False,rectangular,IL,לפרטים והרשמה: 072-3945886 http://ayanot.org.il/ https://www.facebook.com/ayanot.is.fun/ אצלנו תמצאו תיכון ייחודי וחדשני שיוביל אתכם אל מקצוע...,EHrHnJOiCac,2018-02-07T19:40:17.000Z,0.0,0.0,0,0.0,29,"רועי, בוגר כפר הנוער עיינות מספר על השינוי המדהים שעבר במקום!",NoCaption
כפר הנוער עיינות הערוץ הרשמי,כפר הנוער עיינות הערוץ הרשמי,False,hd,2d,PT2M39S,False,rectangular,IL,לפרטים והרשמה: 072-3945886 http://ayanot.org.il/ https://www.facebook.com/ayanot.is.fun/ אצלנו תמצאו תיכון ייחודי וחדשני שיוביל אתכם אל מקצוע...,-uYEcsElAag,2018-02-07T13:29:54.000Z,0.0,0.0,0,0.0,41,"כנרת, אמא של רועי, בוגר כפר הנוער עיינות מספרת על היחס החם לו זכה הבן שלה ועל ההצלחה המדהימה שלו!",NoCaption
כפר הנוער עיינות הערוץ הרשמי,כפר הנוער עיינות הערוץ הרשמי,False,hd,2d,PT1M3S,False,rectangular,IL,לפרטים והרשמה: 072-3945886 http://ayanot.org.il/ https://www.facebook.com/ayanot.is.fun/ אצלנו תמצאו תיכון ייחודי וחדשני שיוביל אתכם אל מקצוע...,hzIQ7rlvO_E,2018-02-07T20:09:33.000Z,0.0,0.0,0,0.0,50,"סניה, עולה חדשה מניו-יורק מספרת על היחס החם בעיינות!",NoCaption
כפר הנוער עיינות הערוץ הרשמי,כפר הנוער עיינות הערוץ הרשמי,False,hd,2d,PT1M50S,False,rectangular,IL,לפרטים והרשמה: 072-3945886 http://ayanot.org.il/ https://www.facebook.com/ayanot.is.fun/ אצלנו תמצאו תיכון ייחודי וחדשני שיוביל אתכם אל מקצוע...,ryRQvOFIZpQ,2018-02-07T08:27:31.000Z,0.0,0.0,0,0.0,23,"אריק, אבא של נועה, חניכה בכפר הנוער עיינות מספר על ההצלחה של הבת שלו!",NoCaption
כפר הנוער עיינות הערוץ הרשמי,כפר הנוער עיינות הערוץ הרשמי,False,hd,2d,PT2M12S,False,rectangular,IL,לפרטים והרשמה: 072-3945886 http://ayanot.org.il/ https://www.facebook.com/ayanot.is.fun/ אצלנו תמצאו תיכון ייחודי וחדשני שיוביל אתכם אל מקצוע...,2aiUaWJOMpk,2018-02-07T11:58:44.000Z,0.0,0.0,0,1.0,50,"דנה, מנהלת ביה&quot;ס בכפר הנוער עיינות מספרת על ההשקעה והיחס האישי לכל תלמיד!",NoCaption
כפר הנוער עיינות הערוץ הרשמי,כפר הנוער עיינות הערוץ הרשמי,False,hd,2d,PT1M55S,False,rectangular,IL,לפרטים והרשמה: 072-3945886 http://ayanot.org.il/ https://www.facebook.com/ayanot.is.fun/ אצלנו תמצאו תיכון ייחודי וחדשני שיוביל אתכם אל מקצוע...,Qd0FWm4EH9g,2018-02-07T20:56:11.000Z,0.0,0.0,0,0.0,60,"לינוי, חניכה בכפר הנוער עיינות מספרת על החברים שהכירה בכפר!",NoCaption
המכללה האקדמית אחוה,המכללה האקדמית אחוה,False,hd,2d,PT2H25M21S,False,rectangular,IL,"אתגרי הקיימות בניהול המרחב העירוני והכפרי - כנס הקיימות השנתי במכללה האקדמית אחוה, יום שלישי 9 במאי 2017. חלק...",RO42xEDuCf0,2017-05-11T13:54:32.000Z,0.0,0.0,0,1.0,111,כנס הקיימות באחוה - חלק ג&#39;,NoCaption
כפר הנוער עיינות הערוץ הרשמי,כפר הנוער עיינות הערוץ הרשמי,False,hd,2d,PT2M9S,False,rectangular,IL,לפרטים והרשמה: 072-3945886 http://ayanot.org.il/ https://www.facebook.com/ayanot.is.fun/ אצלנו תמצאו תיכון ייחודי וחדשני שיוביל אתכם אל מקצוע...,g1w1qCtdZyU,2018-02-07T13:26:08.000Z,0.0,0.0,0,3.0,169,"גנט, מנהלת הפנימייה בכפר הנוער עיינות מספרת על מגוון הכלים שמעניק הכפר להתפתחות אישית של כל חניך!",NoCaption
כפר הנוער עיינות הערוץ הרשמי,כפר הנוער עיינות הערוץ הרשמי,False,hd,2d,PT1M20S,False,rectangular,IL,לפרטים והרשמה: 072-3945886 http://ayanot.org.il/ https://www.facebook.com/ayanot.is.fun/ אצלנו תמצאו תיכון ייחודי וחדשני שיוביל אתכם אל מקצוע...,540niWu2qB0,2018-02-08T15:45:25.000Z,0.0,0.0,0,5.0,168,"נעם, מנהל כפר הנער עיינות מספר על מגוון הכלים שמעמיד הכפר להצלחת החניכים!",NoCaption
כפר הנוער עיינות הערוץ הרשמי,כפר הנוער עיינות הערוץ הרשמי,False,hd,2d,PT2M51S,False,rectangular,IL,לפרטים והרשמה: 072-3945886 http://ayanot.org.il/ https://www.facebook.com/ayanot.is.fun/ אצלנו תמצאו תיכון ייחודי וחדשני שיוביל אתכם אל מקצוע...,-GjJGmxaJzQ,2018-02-07T20:25:40.000Z,0.0,0.0,0,3.0,43,"יעל, בוגרת כפר הנוער עיינות מספרת על השינוי שעברה במקום!",NoCaption
Ruth Berkowitz,Ruth Berkowitz,False,sd,2d,PT4M37S,False,rectangular,IL,"מפגש החלפת זרעים שנערך במכללת פרמה במושב בית נחמיה, קיץ 2013. מידי שנה אנו עורכים מפגש החלפת זרעי מורשת במכללה....",7Q7Pn_QUPq8,2013-06-01T17:27:09.000Z,0.0,1.0,0,3.0,852,מפגש החלפת זרעים במכללת פרמה,NoCaption
כפר הנוער עיינות הערוץ הרשמי,כפר הנוער עיינות הערוץ הרשמי,False,hd,2d,PT1M35S,False,rectangular,IL,לפרטים והרשמה: 072-3945886 http://ayanot.org.il/ https://www.facebook.com/ayanot.is.fun/ אצלנו תמצאו תיכון ייחודי וחדשני שיוביל אתכם אל מקצוע...,OaMytmf0S04,2018-02-07T19:48:06.000Z,0.0,0.0,0,0.0,114,"אושרית, מדריכה בכפר הנוער עיינות מספרת על מגוון החוגים והפעילויות בכפר!",NoCaption
כפר הנוער עיינות הערוץ הרשמי,כפר הנוער עיינות הערוץ הרשמי,False,hd,2d,PT1M47S,False,rectangular,IL,לפרטים והרשמה: 072-3945886 http://ayanot.org.il/ https://www.facebook.com/ayanot.is.fun/ אצלנו תמצאו תיכון ייחודי וחדשני שיוביל אתכם אל מקצוע...,0EolkpzmtM4,2018-02-07T12:59:56.000Z,0.0,0.0,0,0.0,61,"קטיה, חניכה בכפר הנוער עיינות מספרת איך עזרו לה לשפר את ההתנהגות!",NoCaption
כפר הנוער עיינות הערוץ הרשמי,כפר הנוער עיינות הערוץ הרשמי,False,hd,2d,PT1M37S,False,rectangular,IL,לפרטים והרשמה: 072-3945886 http://ayanot.org.il/ https://www.facebook.com/ayanot.is.fun/ אצלנו תמצאו תיכון ייחודי וחדשני שיוביל אתכם אל מקצוע...,WRRWHcfPy4k,2018-02-07T20:01:52.000Z,0.0,0.0,0,0.0,41,"שליו, חניך בכפר הנוער עיינות מספר על כל החברים שהכיר בכפר!",NoCaption
מאיר חזן,מאיר חזן,False,sd,2d,PT3M20S,False,rectangular,IL,,mtsgaWcgbCc,2017-11-16T15:10:16.000Z,,0.0,0,2.0,13,שומרים על הסביבה,NoCaption
Nekudat Chen,Nekudat Chen,False,hd,2d,PT5M27S,False,rectangular,IL,"יום העיון של נקודת ח""ן 2016- צעדים להטמעתה של חקלאות תומכת סביבה בגולן- קובי גביש, אלאור לוי (מועצה אזורית גולן)...",Bc86N9GiLyo,2016-09-25T07:05:44.000Z,0.0,0.0,0,2.0,240,ד&quot;ר לירון אמדור- צעדים להטמעתה של חקלאות תומכת סביבה בגולן,ok quando eu sair campeão chega tarde e é quando ele se lançou de acesso à linha assim os idosos mas ele sabe que o google e assim o é a sony está dando posso dizer que quando chega e fala e chamá-lo e damba daí eu usei a ama como show me liga achei que tinha uma meia irmã com rosé e le roy conli dois anos a tiracolo com um leve toque ele falou dela só volta a subir no ranking e não corre bem entrou na van e um carro sair por le carré aimar no onze na liça macho show le goff praia se não sabe se lá mo felipe massa abandonou o filho fernando gaúcho chegou por volta de chão até ser macho chapão não garanto meu amor no domingo 16 à noite né e marília fora de jogo e vença o bicho negativos é super-homem corda no chamado chico que uma língua que une o que você fala assim ai ai ai eu vim para cá quem vazou a família havia ali olhando de chato nem ao todo ocupado por aqui muita gente acreditar que a vale vai ver filme é leila já se imagina a derrota é s 
יעל גבריאלי,יעל גבריאלי,True,sd,2d,PT6M13S,False,rectangular,IL,"לצפייה עם כתוביות בעברית, לחצו על כפתור ה-CC בתחתית הנגן.",Vmrm1GrQWNk,2012-03-20T17:59:42.000Z,0.0,0.0,0,0.0,231,קו המוצרים,the IDC dermo cosmetic line as 14 products products that allow the skin to function in perfect oh most assists and help look like it did many years prior the IDC line was designed to offer a complete and effective beauty regimen enabling the skin to activate and moderate specific mechanisms responsible for skin aging to optimize the use of the IDC products you need to follow a very easy beauty regimen the IDC beauty regimen is as easy as 123 step one is the step where you prepare your skin with the Pearl cleansing gel this step is crucial the skin needs to be ready to receive idc's technology given in step 2 in this cleansing step you remove excess sebum you exfoliate and purify the skin at the same time step 2 is the step where you correct the process of aging by stimulating or inhibiting the mechanisms involved in skin aging to do so you apply our region 16 technology to the skin first on the face area with one of our highly active anti-aging serums and second while using one of IDC specific products which bring results on specific skin concerns like redness dark spots or deep wrinkles like expression lines to prevent the aging process to delay its course the use of first wrinkles is perfect if what you want is prevention and correction the anti-wrinkle and firming is the perfect product for you while if you are seeking ultimate correction we would suggest the use of our ultimate anti-aging serum alt image is a specially designed for skin that needs more more attention more care more cosmetic actives this ultimate serum as a concentration of 40 % cosmetic actives this level of concentration has never been seen before in the cosmetic industry our male clientele can also benefit from the anti-wrinkle and firming men this anti-aging bomb was especially formulated for the reality of mens skin skin that is known to be thicker to age differently than its female counterpart but also skin that has to endure a severe mechanical aggression daily shaving for skin facing pigment aerie problems such as uneven skin tone and brown spots IDC has developed the image below anti-aging complexion brightener with a forty-one percent concentration of lightening cosmetic active ingredients this serum has won the prestigious French award livak Tour de la boutique an award given by consumers to products showing the best results the complete step 2 or corrective aging IDC has developed specific products products to be applied on specific areas of the skin areas that require special attention the one we strongly suggest to everyone is the anti-wrinkle I a four in one product to treat and resculpt the eye contour area this product was designed for the very sensitive and thin skin around the eyes to diminish the appearance of wrinkles puffiness and dark circles while firming and resculpt in the eye contour area consumer is preoccupied by deep wrinkles wrinkles surrounding the lips or excessive expression lines will love the results they will be getting by including deep wrinkles into their beauty routine if your specific skin concern is hypersensitive reactive skin or redness IDC's red lists is designed formulated and tested to target these unfortunate skin concerns concerns more and more associated with modern skin aging however if your skin shows specific pigment hairy spots idc's image blogspot reducer will diminish the appearance of brown spots and modernizes the skin tone of the face other specific areas that need to be focused on if you seek a global approach to anti-aging our hands neck and decollete hands are often assigned and proof of archaeological age the IDC eternal and cream will reduce the appearance of age spots while maintaining your skin hydrated and looking youthful and radiant eternal provides a handful of integral youth finally the power of gravity and time combined will work their unwanted magic on the neck and decollete at one point the skin under the chin will start to sag the neck and decollete will show wrinkles and age spots profile integral correction care for the neck and decollete will reduce the appearance of wrinkles fine lines and age spots while keeping the skin firm hydrated in with an even complexion the final step step 3 is the step where you seal in all actives and technology from IDC by applying I Drasil SPF 25 during the day and idriss ill during the night you will moisturize your skin via concentrated but yet very fluid creams sealing your skin with these hydrocele creams allows you to optimize your IDC beauty routine by fully benefiting from the other IDC products you have nourished your skin with the ring step one and two the idriel products will bring through moisture to your skin while protecting it against the armful effects of UVA and UVB rays 
Nekudat Chen,Nekudat Chen,False,hd,2d,PT9M9S,False,rectangular,IL,"יום העיון של נקודת ח""ן 2016- דברי פתיחה והצגת ספר המרעה פרופ' אבי פרבולוצקי * צילום: אלעד ברמי http://www.eladbrami.com/...",plzx52iBNZY,2016-09-19T09:26:32.000Z,0.0,0.0,0,0.0,87,פרופ&#39; אבי פרבולוצקי- דברי פתיחה והצגת ספר המרעה,NoCaption
Nekudat Chen,Nekudat Chen,False,hd,2d,PT26M9S,False,rectangular,IL,"יום העיון של נקודת ח""ן 2016- שחזור נוף ושיקום אקולוגי בעמק יזרעאל- פרויקט חקלאות תומכת סביבה מיקי ליפשיץ (יעוץ...",SQvDO-4H6ww,2016-09-25T06:57:21.000Z,0.0,0.0,0,1.0,77,מיקי ליפשיץ: שחזור נוף ושיקום אקולוגי בעמק יזרעאל - פרויקט חקלאות תומכת סביבה,NoCaption
Nekudat Chen,Nekudat Chen,False,hd,2d,PT27M58S,False,rectangular,IL,"יום העיון של נקודת ח""ן 2016- יחסי הגומלין בין מקורות המידע, העמדות הסביבתיות והבחירה בנוהג סביבתי בקרב חקלאים...",YHmoD0nBQkw,2016-09-25T07:03:53.000Z,0.0,0.0,0,1.0,124,"צרויה שבח- חסי הגומלין בין מקורות המידע, העמדות הסביבתיות והבחירה בנוהג סביבתי בקרב חקלאים",NoCaption
Nekudat Chen,Nekudat Chen,False,hd,2d,PT24M52S,False,rectangular,IL,"יום העיון של נקודת ח""ן 2016- תפיסות חקלאים לגבי ממשק עיבוד משמר קרקע ומים בגידולי שדה בישראל, החסמים לאימוצם...",7hL3CdS09BA,2016-09-25T06:49:02.000Z,0.0,0.0,0,1.0,114,הילה שגיא- תפיסות חקלאים לגבי ממשק עיבוד משמר קרקע ומים בגידולי שדה בישראל,NoCaption
