Titulo,link,autor,Periodo,formato
"Estándar para el aprovechamiento económico sostenible de los sistemas de uso directo (productivos agropecuarios y extractivos), indirecto (servicios ecoturísticos y locales) y su combinación (artesanía), en áreas protegidas traslapadas con grupos étnicos de Parques Nacionales Naturales de Colombia",http://repositorio.bibliotecaorton.catie.ac.cr/handle/11554/8605?show=full,"Author
Rozo Melo, Adriana M.","Date
2016",Tesis
"Governability and institutionality for the management, protection and use of water resources in the municipality of Valle de Angeles, Honduras",http://repositorio.bibliotecaorton.catie.ac.cr/handle/11554/5177?show=full,"Author
Angulo Aguilar, Oscar G.","Date
2007",Tesis
Consideraciones epidemiológicas para el manejo de la marchitez por Fusarium (Fusarium oxysporum f. sp. cubense) del banano en la región central del Perú,http://repositorio.bibliotecaorton.catie.ac.cr/handle/11554/4680?show=full,"Author
Román Jeri, Carlos H.","Date
2012",Tesis
"Diversidad y almacenamiento de carbono, en dos sitios con diferente grado de intensificación de uso de suelo de Nicaragua",http://repositorio.bibliotecaorton.catie.ac.cr/handle/11554/8278?show=full,"Author
Caicedo Albán, Willan J.","Date
2016",Tesis
Impactos humanos en la provisión de servicios ecosistémicos por bosques tropicales muy húmedos: un enfoque de ecología funcional,http://repositorio.bibliotecaorton.catie.ac.cr/handle/11554/5221?show=full,"Author
Aquino Yaringaño, Sandro","Date
2010",Tesis
Seguridad alimentaria en comunidades indígenas de Costa Rica: el caso de comunidades Cabécar de Alto Chirripó,http://repositorio.bibliotecaorton.catie.ac.cr/handle/11554/5523?show=full,"Author
Chalampuente Flores, Doris S.","Date
2012",Tesis
"Contribución de las especies leñosas en los medios de vida y la producción ganadera en Tenantitla, Municipio de Benito Juárez, Veracruz, México",http://repositorio.bibliotecaorton.catie.ac.cr/handle/11554/8619?show=full,"Author
Hernández Hernández, Erika","Date
2017",Tesis
