channelTitle,channelid,contentDetails/caption,contentDetails/definition,contentDetails/dimension,contentDetails/duration,contentDetails/licensedContent,contentDetails/projection,country,description,id,publishedAt,statistics/commentCount,statistics/dislikeCount,statistics/favoriteCount,statistics/likeCount,statistics/viewCount,title,contentDetails/regionRestriction/blocked/0
전여농,전여농,false,hd,2d,PT37M15S,false,rectangular,,전국여성농민회총연합 2017 농생태학학교 1차시에서 한 강연. 후원계좌// 농협 078-01-154633 전국여성농민회총연합.,pzS7QknAzXE,2017-04-19T08:04:48.000Z,0,0,0,0,133,20170412 안철환 전통농업의 재해석과 지향해야할 농생태학의 방향 3,
전여농,전여농,false,hd,2d,PT37M15S,false,rectangular,,전국여성농민회총연합 2017 농생태학학교 1차시에서 한 강연. 후원계좌// 농협 078-01-154633 전국여성농민회총연합.,YUww4h-Viag,2017-04-18T05:03:03.000Z,0,0,0,0,90,20170412 김석기 농생태학 현장의 사례 전통농업속의 농생태학 1,
전여농,전여농,false,hd,2d,PT12M23S,false,rectangular,,전국여성농민회총연합 2017 농생태학학교 1차시에서 한 강연. 후원계좌// 농협 078-01-154633 전국여성농민회총연합.,7Ym413b1wxk,2017-04-19T07:47:47.000Z,0,0,0,0,185,20170412 안철환 전통농업의 재해석과 지향해야할 농생태학의 방향 2,
전여농,전여농,false,hd,2d,PT37M3S,false,rectangular,,전국여성농민회총연합 2017 농생태학학교 1차시에서 한 강연. 후원계좌// 농협 078-01-154633 전국여성농민회총연합.,YWjrtFATnho,2017-04-18T04:56:16.000Z,0,0,0,1,85,20170412 김석기 농생태학 현장의 사례 전통농업속의 농생태학 2,
전여농,전여농,false,hd,2d,PT13M44S,false,rectangular,,전국여성농민회총연합 2017 농생태학학교 1차시에서 한 강연. 후원계좌// 농협 078-01-154633 전국여성농민회총연합.,D3JWm3sJaB0,2017-04-19T08:03:59.000Z,0,1,0,0,104,20170412 안철환 전통농업의 재해석과 지향해야할 농생태학의 방향 4,
전여농,전여농,false,hd,2d,PT37M14S,false,rectangular,,전국여성농민회총연합 2017 농생태학학교 1차시에서 한 강연. 1분 부터 보세요. 초반에 화면이 많이 흔들립니다. ㅠㅠ 후원계좌// 농협 078-01-154633...,1K4QuauvhxU,2017-04-19T08:09:32.000Z,0,0,0,4,564,20170412 안철환 전통농업의 재해석과 지향해야 할 농생태학의 방향 1,
시흥아카데미,시흥아카데미,false,hd,2d,PT2H42M42S,false,rectangular,,강의명 : 허준약초학교 11강 내 용 : 약용식물의 다양성 강 사 : 장근정 /식물분류생태학박사 촬영일시 : 2015. 5. 27 (수) 영상길이 : 124분 —————...,hBIboNgnOOk,2015-06-04T03:10:36.000Z,0,9,0,41,11450,[시흥아카데미] 허준약초학교1기 11강 「약용식물의 다양성」 - 장근정(식물분류생태학박사),
전여농,전여농,false,hd,2d,PT37M14S,false,rectangular,,전국여성농민회총연합 2017 농생태학학교 1차시에서 한 강연. 후원계좌// 농협 078-01-154633 전국여성농민회총연합.,2H2MvV1_790,2017-04-19T08:46:58.000Z,0,1,0,4,306,20170413 임경수 퍼머컬쳐를 통해 본 농생태학의 원리와 개념 1,
시흥아카데미,시흥아카데미,false,hd,2d,PT1H20M37S,false,rectangular,,강의명 : 산림경영학교 제7강 내 용 : 약용식물의 이해 강 사 : 이정웅 / 대구광역시 도시농업위원회 위원 촬영일시 : 2014. 12. 08 (월) 영상길이...,vi3Tv2ikbXI,2014-12-10T03:52:07.000Z,1,3,0,14,4443,[시흥아카데미] 산림경영학교 7강 「약용식물의 이해」 - 이정웅(대구도시농업위원회),
시흥아카데미,시흥아카데미,false,hd,2d,PT2H14M23S,false,rectangular,,"강의명 : 허준약초학교2기12강 내 용 : 도시농업 강 사 : 조우현 / 한국민속식물원장,세종대석사 촬영일시 : 2015. 12. 23 (수) 영상길이 : 2시간...",xNJxvXTmBB4,2015-12-29T09:12:41.000Z,0,0,0,3,1251,"[시흥아카데미] 허준약초학교2기 12강 「도시농업」 - 조우현(한국민속식물원장, 세종대석사)",
시흥아카데미,시흥아카데미,false,hd,2d,PT1H36M,false,rectangular,,강의명 : 백년정원학교 2기 2강 2교시 내 용 : 도시농업의 필요성과 도심속의 자연이 주는 혜택 강 사 : 민동욱/서울도시농업네트워크 운영위원장...,xlxOwBNLrRU,2015-02-09T23:10:45.000Z,2,0,0,5,1333,[시흥아카데미] 백년정원학교2기 2강2교시 「도시농업의 필요성과 도심속의 자연이 주는 혜택」 - 민동욱(서울도시농업네트워크 운영위원장),
youngmin Lee,youngmin Lee,false,sd,2d,PT22M19S,false,rectangular,,,0llzf72lHFg,2016-02-03T04:10:29.000Z,0,0,0,4,1033,생태적삶 유기농업 2부 농부 성기남,
한국직업방송,한국직업방송,false,hd,2d,PT56M8S,true,rectangular,KR,[신 직업의 발견 170420] 약용식물전문가.,Pxd0zUTV67g,2017-04-20T00:30:00.000Z,0,0,0,21,2239,[신 직업의  발견 170420] 약용식물전문가,
종합교육기업에듀피디,종합교육기업에듀피디,false,hd,2d,PT24M56S,false,rectangular,KR,자연생태복원기사 필기시험 환경생태학개론 2016년 제2회 기출문제 해설 강좌 1강 강사명: 백정애 교수님 제공: 에듀피디 http://www.edupd.com/,3F4xlsVnS0o,2016-08-24T09:18:01.000Z,0,0,0,4,1127,2016년 제2회 자연생태복원기사 환경생태학개론 기출문제 해설 1강,
쌈박의 풍경TV,쌈박의 풍경TV,false,hd,2d,PT24M1S,false,rectangular,KR,"농사대신 산에서 약초를 캐며 생계를 이어간 정선 약초마을사람들의 이야기와 함께 떠나는 힐링로드 맛과 멋... 강원도 정선에서, 향긋하고 쌉싸름...",EVegc7fhMKY,2014-12-17T07:23:50.000Z,4,11,0,108,44753,힐링로드 맛과멋 &#39;정선약초마을&#39;,
주경야독,주경야독,false,sd,2d,PT38M1S,false,rectangular,KR,"생태계에서 가장 중요한 건 생산자, 소비자, 분해자이다. #자연생태복원기사 #자연생태복원기사필기 #자연생태복원기사생태계 책에도 없는 내용도...",5dARkyFq1Xk,2019-04-11T07:38:26.000Z,0,0,0,1,153,자연생태복원기사 필기 중독성 있는 강의!,
서울덕성기술학원 동영상강의,서울덕성기술학원 동영상강의,false,hd,2d,PT49M21S,true,rectangular,,필답형 1. 서울덕성기술학원의 자체 교재로 강의 - 자연생태복원 전임 교수의 직강 동영상으로 높은 합격률 2. 기출문제 포인트 위주로 팩트있게...,0BjeuRAQiAA,2018-07-17T07:41:15.000Z,0,1,0,6,1044,"자연생태복원(산업)기사 실기(설계, 필답) 동영상 [자연생태복원 쉽게 따는법, 기초 생태복원수업 ] 자연생태복원 주관식 실기, 복원생태학, 대체공법, 생태복원설계)",
자구TV,자구TV,false,sd,2d,PT8M3S,false,rectangular,,여기는 안산시 부곡동 수리산 자락 도시농업의 태동지로 유명한 '바람들이농장'​ 자갈밭과 진배없는 마른땅에 괭이로 고랑을 파고 볍씨를 뿌립니...,Pvrt_rDVsEQ,2019-06-30T04:21:02.000Z,0,0,0,1,43,[막걸리 토크쇼/ 건답직파] 도시농업 태동지 바람들이농장 건답직파 그리고 풍곡 안철환 선생 1부,
국가기술자격 원격평생교육원. 세인에듀,국가기술자격 원격평생교육원. 세인에듀,false,hd,2d,PT14M48S,true,rectangular,KR,세인에듀에서 제작한 유기농업 필기 단과 - 유기농업개론 샘플 동영상입니다 자세한 내용은 홈페이지에서 확인하실 수 있습니다 PC 바로가기...,RZ8LjfCs9QM,2017-09-12T07:33:48.000Z,,5,0,13,3765,[세인에듀] 유기농업 필기 단과 - 유기농업개론,
LEE Mun-Woong,LEE Mun-Woong,false,hd,2d,PT1H22M17S,false,rectangular,,"하루 토종학교_변현단(#2): “씨앗에서 농사, 밥상 그리고 삶” KBS1 TV [6시 내고향]의 6000회 특집으로 개최되었던 [토종 씨앗축제: 나만의 텃밭...",yA3s1NoHF_0,2016-05-12T00:10:12.000Z,1,1,0,10,1188,"하루 토종학교_변현단(#2): “씨앗에서 농사, 밥상 그리고 삶”",
전여농,전여농,false,hd,2d,PT20M47S,false,rectangular,,전국여성농민회총연합 2017 농생태학학교 1차시에서 한 강연. 후원계좌// 농협 078-01-154633 전국여성농민회총연합.,pROepPQznAg,2017-04-19T08:57:57.000Z,0,0,0,0,62,20170413 임경수 퍼머컬쳐를 통해 본 농생태학의 원리와 개념 4,
시흥아카데미,시흥아카데미,false,hd,2d,PT2H40M46S,false,rectangular,,강의명 : 허준약초학교 3강 내 용 : 질병에 필요한 한약재 선택 강 사 : 이영종 / 가천한의대학 교수 촬영일시 : 2015. 4. 1 (월) 영상길이 : 126분...,Z4Mg60XTrYw,2015-04-08T02:27:34.000Z,4,11,0,93,25018,[시흥아카데미] 허준약초학교1기 3강 「질병에 필요한 한약재 선택」 - 이영종(가천한의대학교수),
소비자TV,소비자TV,false,hd,2d,PT57S,false,rectangular,KR,고부가가치가 창출되기 위해서는 청년 농업인구의 증대가 절실한 상황 친환경농업의 각 분야 멘토들과 새롭게 청년농업을 실행하려는 사람들과...,mDbqmxcTLD0,2019-05-20T07:27:40.000Z,0,0,0,2,90,[예고] 에코스쿨 1부 - 농업인구 200만시대,
오창석,오창석,false,hd,2d,PT7M28S,false,rectangular,,,LgTSybOluBY,2018-08-23T00:33:40.000Z,1,0,0,6,190,2018년  감물생태학습관 여름캠프 6차 영상,
EBSCulture (EBS 교양),EBSCulture (EBS 교양),false,hd,2d,PT20M53S,true,rectangular,,"공식 홈페이지 : 우리가 경제학을 알아야 하는 이유 경제학자 장하준교수와 서대문자연사박물관 이정모 관장의 만남 인문,사회,철학,예술,교육,...",P6nc_ibx0h0,2016-09-21T09:35:44.000Z,0,0,0,27,2896,EBS 특별기획 통찰(洞察) - 우리가 경제학을 알아야 하는 이유_#003,
aving,aving,false,hd,2d,PT1M37S,true,rectangular,KR,,nepocECx_9s,2014-08-08T19:55:23.000Z,0,0,0,1,96,"[Natural Week 2014 영상]맑고 깨끗한 친환경농업 특구 양평의 &#39;로컬푸드, 내몸엔 발효 뽕잎차&#39;",
강동구도시농업,강동구도시농업,false,hd,2d,PT43M1S,false,rectangular,,도시텃밭 현장 농부학교 1강이론 -도시에서 농사 짓기.,kW-OsTiY3KA,2016-05-12T08:26:56.000Z,4,0,0,31,3141,도시에서 농사를 지워보자!,
전여농,전여농,false,hd,2d,PT37M4S,false,rectangular,,전국여성농민회총연합 2017 농생태학학교 1차시에서 한 강연. 후원계좌// 농협 078-01-154633 전국여성농민회총연합.,kz_K2piNfiU,2017-04-19T09:01:54.000Z,0,0,0,0,80,20170413 임경수 퍼머컬쳐를 통해 본 농생태학의 원리와 개념 2,
전여농,전여농,false,hd,2d,PT37M3S,false,rectangular,,전국여성농민회총연합 2017 농생태학학교 1차시에서 한 강연. 후원계좌// 농협 078-01-154633 전국여성농민회총연합.,6QnNm0sjSeQ,2017-04-19T08:59:28.000Z,0,0,0,0,63,20170413 임경수 퍼머컬쳐를 통해 본 농생태학의 원리와 개념 3,
서울덕성기술학원 동영상강의,서울덕성기술학원 동영상강의,false,hd,2d,PT38M27S,true,rectangular,,2015년 시험대비 자연생태복원 기사/산업기사 실기 강의 서울덕성기술학원 이선아 선생님 http://j.duck-sung.co.kr.,nePimTVfxH8,2015-05-07T05:33:46.000Z,1,2,0,20,4393,2015년 시험대비 자연생태복원 기사/산업기사 실기(설계) 강의,
전여농,전여농,false,hd,2d,PT4M1S,false,rectangular,,"2017년 여성농민의 새로운 도전 ""지속가능한 농업을 위한 농생태학 학교""",yREBN2uuzHo,2017-11-28T09:32:39.000Z,0,0,0,0,2,나의 동영상,
KBS창원,KBS창원,false,hd,2d,PT4M21S,true,rectangular,KR,"징그럽게만 보였던 곤충이 우리의 친구가 될 수 있다는 사실, 알고 계셨나요? 반려동물보다 더 사랑스럽게~ 군것질보다 더 맛있게 다가올, ...",_qLEWIU-W1o,2018-06-07T01:03:56.000Z,1,0,0,4,468,"[생생투데이-창원] 경남에서 꿈꾸는 벅스라이프! ①  곤충아 놀자~ 온갖 곤충들을 체험해 볼 수 있는 곤충생태학습관    (2018.06.05,화)",
tbs 시민의방송,tbs 시민의방송,false,hd,2d,PT2M14S,true,rectangular,KR,"[tbs현장렉] 생태학습의 장, 연의근린공원 연의근린공원에서는 다양한 생태체험을 할 수 있는데요. 아이들은 연의생태학습관에서 지구온난화를...",8nwxlo9GbUk,2018-10-31T02:20:41.000Z,3,0,0,2,210,"생태학습의 장, 연의근린공원 [tbs현장렉]",
전여농,전여농,false,hd,2d,PT14M42S,false,rectangular,,전국여성농민회총연합 2017 농생태학학교 1차시에서 한 강연. 후원계좌// 농협 078-01-154633 전국여성농민회총연합.,Gt_T4sAkUCs,2017-04-18T05:23:26.000Z,0,0,0,0,18,20170412 조영지 농생태학 현장의 사례 중남미사례 2,
시흥아카데미,시흥아카데미,false,hd,2d,PT1H38M13S,false,rectangular,,강의명 : 허준약초학교 1강 내 용 : 국내외 약초 재배유통 현황 강 사 : 송수근 / 잠실경희수 한약국 대표 촬영일시 : 2015. 3. 18 (수) 영상길이...,K4V_-zxFTMg,2015-03-24T05:54:47.000Z,0,22,0,116,39630,[시흥아카데미] 허준약초학교1기 1강 「국내외 약초 재배유통 현황」 - 송수근(잠실경희수한약국),
연합뉴스TV,연합뉴스TV,false,hd,2d,PT1M30S,true,rectangular,KR,"우리 민물고기를 돈 되는 산업으로 [경북] [지방시대] [앵커] 경북 의성에 민물고기, 즉 토속어류 산업화센터가 문을 열었습니다. 토속어류...",w-mFYSRFgho,2015-05-10T04:13:00.000Z,9,8,0,78,92013,우리 민물고기를 돈 되는 산업으로 [경북],
시흥아카데미,시흥아카데미,false,hd,2d,PT2H11M57S,false,rectangular,,강의명 : 허준약초학교 2강 내 용 : 한방과 건강(1) 강 사 : 안덕균 / 경희대학교수 촬영일시 : 2015. 3. 25 (수) 영상길이 : 135분 ------------------------------...,9KAvbIiNLpc,2015-04-01T14:38:55.000Z,12,34,0,276,64107,[시흥아카데미] 허준약초학교1기 2강 「한방과 건강 1」 - 안덕균(경희대학교수),
대한민국 산림청,대한민국 산림청,false,sd,2d,PT2M56S,false,rectangular,,"2013년 e-브리핑 일시 및 장소 : 2013년 7월 23일 15:00, 산림청 발 표 자 : 숲길정책팀 김영기 사무관.",8kOPZtTyCpI,2013-07-25T09:55:04.000Z,0,0,0,0,30,´청소년 백두대간 산림생태 탐방´ 소개,
KBS창원,KBS창원,false,hd,2d,PT4M20S,true,rectangular,KR,"징그럽게만 보였던 곤충이 우리의 친구가 될 수 있다는 사실, 알고 계셨나요? 반려동물보다 더 사랑스럽게~ 군것질보다 더 맛있게 다가올, ...",bdAK-z9yOYc,2018-06-07T01:04:35.000Z,0,1,0,7,1007,"[생생투데이-창원] 경남에서 꿈꾸는 벅스라이프! ③  곤충빵과 비누로 창업에 성공한 정재근 대표이야기   (2018.06.05,화)",
YTN SCIENCE,YTN SCIENCE,false,hd,2d,PT16M3S,true,rectangular,,[YTN 사이언스 기사원문] http://www.ytnscience.co.kr/program/program_view.php?s_mcd=0083&s_hcd=&key=201308301220153003 동쪽으로는 푸르른 동해 ...,E6iEXX6hDO8,2013-09-05T07:21:32.000Z,0,1,0,0,192,[숨은과학찾기] 자연에서 배워요! 생태체험학습 / YTN 사이언스,
산골짜기,산골짜기,false,hd,2d,PT1M17S,false,rectangular,,"앞뒤, 위아래로 깜깜하던 차에 미래농업교육원에서 약용식물 관련 교육이 있다고 한다. 칭구들이랑 부지런히 뛰어와 열공하며 새세상에 발 딛어보...",dtxWV_kUAbY,2018-10-16T08:45:14.000Z,0,0,0,1,47,약용식물 교육에서,
시흥아카데미,시흥아카데미,false,hd,2d,PT2H37M15S,false,rectangular,,강의명 : 허준약초학교 7강 내 용 : 약용작물 산업현황 및 재배기초 강 사 : 성낙술 / 前 농촌진흥청 인삼약초 연구소장 촬영일시 : 2015. 4. 29(수)...,HD6Y4ZhQ0Wc,2015-05-12T14:55:44.000Z,0,2,0,27,8009,[시흥아카데미] 허준약초학교1기 7강 「약용작물 산업현황 및 재배기초」 - 성낙술(前 농촌진흥척 약용작물과장),
도윤호,도윤호,false,sd,2d,PT5M54S,false,rectangular,,부산대학교 생명과학과 담수생태연구실.,yJOl0FPrNWY,2013-02-04T06:09:08.000Z,0,0,0,7,547,부산대학교 생명과학과 담수생태연구실.avi,
JTBC Content Hub,JTBC Content Hub,false,sd,2d,PT25M17S,true,rectangular,,[다큐 클래식] 산야초 동의 보감 9회 -정신을 다스리는 약초 Wild grass Donguibogam: Principles and Practice of Eastern Medicine #9 -Good medicinal herbs for ...,dCZE6LBHAuw,2014-07-04T05:35:07.000Z,0,9,0,99,33826,[다큐클래식] 산야초 동의 보감 9회-정신질환 치료 약초 / Wild grass Donguibogam #9-Good medicinal herbs for mental illness,
KBS창원,KBS창원,false,hd,2d,PT4M41S,true,rectangular,KR,"다양한 작물과 초록으로 가득한 농촌! 이 농촌이, 아이들이 놀이터가 됐습니다. 모내기체험을 통해 일일농부도 되어보고 농장에서 토마토를...",jOL6bvFBGk4,2018-06-25T01:12:13.000Z,1,0,0,6,274,"[생생투데이-창원] 즐거움이 쑥쑥! 농촌에서 놀자~ ③ hello~ 영어도 배우고 토마토도 따고~ 외국농장콘셉트의 농촌체험!   (2018.06.22,금)",
황진아,황진아,false,hd,2d,PT1M16S,false,rectangular,,농업회사법인_귀농 2017년 수마의 피해를 딛고 복구와 함께 철갑상어 입고를 하고 있습니다.,aaO4ML6-hlk,2017-08-17T07:46:57.000Z,0,0,0,0,24,농업회사법인_귀농 : 철갑상어 입고,
EBSDocumentary (EBS 다큐),EBSDocumentary (EBS 다큐),false,sd,2d,PT12M42S,true,rectangular,,"공식홈페이지 : http://home.ebs.co.kr/hana 겨울, 생명의 시간 가을과 겨울 사람들은 자연에서 치유를 받는다. 지구는 지금 어떤 모습인가요? 우리가...",Tnox4KmJkLU,2014-04-03T10:11:02.000Z,0,1,0,7,5989,"하나뿐인 지구 - Our sole earth_겨울, 생명의 시간_#001",
KBSLife,KBSLife,false,hd,2d,PT3M9S,true,rectangular,,[HIT]아침마당 - [목요특강] 약초가 말을 하네~ - 김만배 농업연구관 -5.,alhf2WPE4RI,2015-10-22T12:00:01.000Z,0,0,0,1,290,[HIT]아침마당 - [목요특강] 약초가 말을 하네~ - 김만배 농업연구관 -5,KR
안동MBC NEWS,안동MBC NEWS,false,hd,2d,PT41S,true,rectangular,KR,2017/03/28 09:51:43 작성자 : 김건엽 안동 농업의 6차산업화가 추진되는 가운데 자색 고구마와 안동마를 결합한 가공제품이 개발돼 출시를 앞두고...,LGUC5UjU3N0,2017-03-29T01:01:46.000Z,0,0,0,0,37,[안동MBC뉴스]안동농업 6차산업화 신제품 개발,
난장은평,난장은평,false,hd,2d,PT17M23S,false,rectangular,,,sZ1OJnfdKbw,2013-07-23T07:27:20.000Z,1,0,0,5,461,[은평난장 제3탄] 유희정(퍼머컬쳐디자이너) &quot;농사짓는 도시마을을 꿈꾸는 오지라퍼&quot;,
시흥아카데미,시흥아카데미,false,hd,2d,PT1H36M48S,false,rectangular,,"강의명 : 허준약초학교2기16강 내 용 : 심혈관과 뇌질환 개선작용II 강 사 : 안덕균 / 경희대한의학교수,한의학박사 촬영일시 : 2016. 1. 20 (수)...",-IMAVYSOyIQ,2016-01-25T08:31:02.000Z,2,12,0,56,13673,[시흥아카데미] 허준약초학교2기 16강  「심혈관과 뇌질환 개선작용II」  -  안덕균(경희대한의학교수/한의학박사),
부산일보TheBusanilbo,부산일보TheBusanilbo,false,hd,2d,PT1M46S,true,rectangular,KR,부산일보 동영상 Btube 채널1 구독하기 ☞ http://goo.gl/Nu46ky 디지털콘텐츠팀 박민순 대학생 multi@ 사자바위엔 고대인들이 제의를 지낸 '감실' 흔적이...,32umIOfRgRg,2017-09-07T00:37:32.000Z,0,0,0,1,187,[산&amp;길611회] 김해 화포천 아우름길,
ds2rjm,ds2rjm,false,sd,2d,PT2M12S,false,rectangular,,【경기인터넷신문】이재준 수원시 제2부시장은 5일 시청 중회의실에서 '생태교통수원 2013' 기본계획에 대한 기자설명회를 가졌습니다. 생태교통시...,npxa6zl0IGY,2013-03-05T07:46:56.000Z,0,0,0,0,56,생태교통 수원 2013 시정 브리핑,
시흥아카데미,시흥아카데미,false,hd,2d,PT1H29M52S,false,rectangular,,"강의명 : 허준약초학교2기13강 내 용 : 도시농업 강 사 : 성낙술 / 전농진청약초특작과장,충북대농학박사 촬영일시 : 2015. 12. 30 (수) 영상길이...",W0-EP9vJ-xY,2016-01-02T12:54:23.000Z,0,0,0,2,955,"[시흥아카데미] 허준약초학교2기 13강 「약용작물 산업현황 및 재배기초」 - 성낙술(전농진청약초특작과장, 충북대농학박사)",
황진아,황진아,false,hd,2d,PT1M16S,false,rectangular,,농업회사법인_귀농 2017년 수마의 피해를 딛고 복구와 함께 철갑상어 입고를 하고 있습니다.,aaO4ML6-hlk,2017-08-17T07:46:57.000Z,0,0,0,0,24,농업회사법인_귀농 : 철갑상어 입고,
시흥아카데미,시흥아카데미,false,hd,2d,PT1H47M16S,false,rectangular,,"강의명 : 허준약초학교2기11강 내 용 :고소득,다수확 약용작물 강 사 :김용한 / 한림농원대표, 성균관대석사 촬영일시 : 2015. 12. 16 (수) 영상길이...",kTsURMkWenw,2015-12-23T01:27:49.000Z,0,1,0,12,4474,"[시흥아카데미] 허준약초학교2기 11강 「고소득,다수확 약용작물」 - 김용한(한림농원대표/성균관대석사)",
EBSCulture (EBS 교양),EBSCulture (EBS 교양),false,sd,2d,PT15M15S,true,rectangular,,공식 홈페이지 : 인간의 에측 가능성 - 사회의 통계적인 예측 자연과 우주 그리고 인간의 예측 가능성 양자역학 강의 김상욱 부산대학교 물리학과...,Qx0QL1emTHo,2016-11-28T11:41:16.000Z,4,5,0,74,10880,EBS 특별기획 통찰(洞察) - 인간의 예측 가능성 - 사회의 통계적인 예측_#003,
전여농,전여농,false,sd,2d,PT3M50S,false,rectangular,,여성농민이 대통령 더 잘 할 수 있다. 박근혜 탄핵시켰으니 우리 대통령은 우리가 뽑자! 2017 여성농민 대통령 뽑기!!,_ggURZO77Qo,2017-03-29T05:50:15.000Z,0,0,0,1,50,20170315 회장단교육 대통령을뽑아라,
한국방송통신대학교,한국방송통신대학교,false,sd,2d,PT28M31S,true,rectangular,KR,"생태적 삶을 이야기하다 7회 - 생태적 삶, 숲에서 그 길을 찾다.",lFIWlBtNkcA,2014-06-23T02:11:02.000Z,0,0,0,16,3072,생태적 삶을 이야기하다 7회,
JTBC Culture,JTBC Culture,false,hd,2d,PT2M40S,true,rectangular,KR,숲에서만 누릴 수 있는 자연이 주는 특권 숲이 주는 혜택 ′공익적 기능′ (무한 감사) 소음 감소， 산사태 방지 등으로 국민 1인당 받는 산림...,gZhhJxiro5g,2019-06-19T01:40:33.000Z,2,0,0,13,781,[선공개] ′잣나무-호랑이′의 연결고리는? 숲이 살아야 생태계도 산다! 차이나는 클라스(jtbclecture) 113회,
SU ABN,SU ABN,false,hd,2d,PT46M46S,false,rectangular,KR,한국약식동원연구소에서 준비한 강의로 여러분들의 건강한 삶에 큰 도움이 되실 것입니다. 이숙연 박사님은 삼육대학교 약학대학 교수로 재직하시...,vRYCl_HU204,2013-11-28T04:03:25.000Z,0,1,0,14,4320,[이숙연] 약용식물이야기 2. 약용식물 총론 1,
시흥아카데미,시흥아카데미,false,hd,2d,PT1H35M4S,false,rectangular,,강의명 : 허준약초학교2기 7강 내 용 :심혈관과 뇌질환 개선작용 I 강 사 : 안덕균 / 경희대한의학교수&한의학박사 촬영일시 : 2015. 11. 18 (수)...,aV9rK2bCGCc,2015-11-25T04:31:54.000Z,7,17,0,131,28631,[시흥아카데미] 허준약초학교2기 7강 「심혈관과 뇌질환 개선작용 I」 - 안덕균(경희대한의학교수/한의학박사),
SU ABN,SU ABN,false,hd,2d,PT52M46S,false,rectangular,KR,한국약식동원연구소에서 준비한 강의로 여러분들의 건강한 삶에 큰 도움이 되실 것입니다. 이숙연 박사님은 삼육대학교 약학대학 교수로 재직하시...,HGFWRgy1mWE,2013-11-28T06:21:55.000Z,0,1,0,6,1815,[이숙연] 약용식물이야기 3. 약용식물 총론 2,
iamjsh2000,iamjsh2000,false,sd,2d,PT1H44M53S,false,rectangular,,,eHPacf2CsN4,2011-10-14T06:54:48.000Z,0,0,0,14,4071,비오톱생태문화해설가 변성배  우리식물이름의 유래,
jiabetterme,jiabetterme,false,sd,2d,PT7M25S,false,rectangular,,생태학적인 삶과 지혜 사막화편 7조.,SXlLSiNF6Hg,2012-05-29T17:25:51.000Z,0,0,0,0,65,생태적인 삶과 지혜 사막화 7조(2).wmv,
시흥아카데미,시흥아카데미,false,hd,2d,PT2H1M34S,false,rectangular,,강의명 : 효소학교 2강 내 용 : 자생식물 이용 방법 강 사 : 김종남 / 한국우리식물효소연구소장 촬영일시 : 2016. 4. 8 (금) 영상길이 : 2시간 1분...,Qhb-gWXLgEQ,2016-04-09T14:53:58.000Z,0,1,0,14,2949,[시흥아카데미] 효소학교 2강 「자생식물 이용 방법」 - 김종남(한국우리식물효소연구소장),
시흥아카데미,시흥아카데미,false,hd,2d,PT55M59S,false,rectangular,,강의명 : 허준약초학교2기 4강1교시 내 용 : '약초란 무엇인가?' 강 사 : 고형곤 / 하나로기경희한의원장 촬영일시 : 2015. 10. 28 (수) 영상길이...,9wd3Aj4JApM,2015-11-18T02:15:55.000Z,0,1,0,15,3996,[시흥아카데미] 허준약초학교2기 4강1교시 「‘약초란 무엇인가?’」 - 고형곤(하나로기경희한의원장),
KBS창원,KBS창원,false,hd,2d,PT12M57S,true,rectangular,KR,[기획의도] 추운 겨울이 지나고 따뜻한 봄을 즐기러 농촌으로 향한 사람들! 도시에서는 느낄 수 없었던 자연의 아름다움을 시골에서 느껴보는데~...,krGSkXEqv24,2019-04-22T04:59:50.000Z,0,1,0,8,274,"[생생투데이-창원] 오감만족, 농촌에서 즐기는 봄! (2019.04.19,금)",
시흥아카데미,시흥아카데미,false,hd,2d,PT1H13M58S,false,rectangular,,강의명 : 허준약초학교 6강 2교시 내 용 : 만년초 재배방법 강 사 : 이성준 / 에바다식물원장 촬영일시 : 2015. 4. 22 (수) 영상길이 : 94분 —————...,_OnLTblbrO8,2015-04-30T13:40:34.000Z,0,5,0,14,4403,[시흥아카데미] 허준약초학교1기 6강2교시 「만년초 재배방법」 - 이성준(에바다식물원장),
원미디어,원미디어,false,hd,2d,PT8M48S,false,rectangular,,화포천습지생태공원 홍보영상 (일반 관람자용) 입니다.,ds9E7ausmiM,2014-01-03T07:50:27.000Z,0,0,0,0,250,화포천습지생태공원 홍보영상 (일반 관람자용),
iamjsh2000,iamjsh2000,false,sd,2d,PT1H32M47S,false,rectangular,,,86RNB4DznvQ,2011-10-14T02:40:05.000Z,0,0,0,0,39,비오톱생태문화해설가 김용록  외부공간 조성의 전통적 사상과 이론,
시흥아카데미,시흥아카데미,false,hd,2d,PT54M56S,false,rectangular,,강의명 : 허준약교학교3기 6강 1교시 내 용 : 약초로 보는 면역 강 사 : 송수근 / 경희대 한약학과 촬영일시 : 2016. 05. 18 (수) 영상길이 : 1시간 53분...,oC_CsJpIrek,2016-05-20T09:30:59.000Z,0,0,0,6,2010,[시흥아카데미] 허준약초학교3기 6강1교시 「약초로 보는 면역」 - 송수근(경희대 한약학과),
TZMKorea,TZMKorea,false,sd,2d,PT3M3S,false,rectangular,,[홍보영상] 생태공학(ECO-TECHNOLOGY) 편 지구2.0 네이버까페 http://cafe.naver.com/earth2channel.,DP0depa0YI0,2011-06-25T12:40:20.000Z,0,0,0,2,261,지구2.0 개선의시대 -생태공학(ECO-TECHNOLOGY),
시흥아카데미,시흥아카데미,false,hd,2d,PT1H31M57S,false,rectangular,,제목 [시흥아카데미] 허준약초학교2기 2강2교시 「'체질의 구별'」 - 안규석(경희대학교 한의과대학 교수) 강의명 : 허준약초학교2기 2강2교시...,CHxpbg72Reo,2015-10-30T04:51:58.000Z,1,4,0,22,6034,[시흥아카데미] 허준약초학교2기 2강2교시 「‘체질의 구별’」 - 안규석(경희대학교 한의과대학 교수),
성남TV,성남TV,false,hd,2d,PT1M23S,false,rectangular,KR,학교 운동장을 생각하면 모래만 있는 황량한 공간이 떠오르죠. 앞으로 꽃과 나무가 가득한 녹지 공간으로 바뀝니다. 성남시는 다양한 녹화기법을...,PlrheTGU5-Q,2019-05-13T08:23:37.000Z,0,0,0,3,43,에코 스쿨 조성 협약식,
Namhyeon Cho,Namhyeon Cho,false,hd,2d,PT20S,false,360,,의령 강소농 화이팅 !!!,kwlv1J0vPts,2017-05-15T10:26:40.000Z,0,0,0,0,85,의령 강소농 화이팅 !!!,
시흥아카데미,시흥아카데미,false,hd,2d,PT2H39M16S,false,rectangular,,[시흥아카데미] 시민조경학교 2기 14강 「식물번식」 강의명 : 시민조경학교 2기 14강 내 용 : 식물번식 강 사 : 김경태(경수원 대표) 촬영일시...,W4bMTpGjF4c,2017-01-10T02:21:18.000Z,2,1,0,14,4357,[시흥아카데미] 시민조경학교2기 14강 「식물번식」 - 김경태(경수원 대표),
iamjsh2000,iamjsh2000,false,sd,2d,PT2H39M24S,false,rectangular,,,fadpwm-qwlc,2011-10-14T04:23:05.000Z,0,0,0,0,133,비오톱생태문화해설가 유칠선  전주하천의 조류이야기,
시흥아카데미자치보감,시흥아카데미자치보감,false,hd,2d,PT1M42S,false,rectangular,,학교명 : 허준약초학교 1기 강의명 : 약용식물의 다양성 핵심주제 : 단풍나무의 종류 강사 : 장근정 / 식물분류생태학박사 내용 : 잎이 갈라진 숫자가...,MpaAZTi-9Ko,2015-12-31T02:02:14.000Z,0,0,0,0,234,[시흥아카데미 자치보감] 허준약초학교 1기 - 단풍나무의 종류,
KBS광주,KBS광주,false,hd,2d,PT1H3M27S,false,rectangular,KR,광주 KBS 1TV 열린마당 *매주 금요일 오전 8시 25~9시 30분*,cIwLWJDBBRQ,2017-03-31T07:36:54.000Z,0,1,0,5,1251,[열린마당] 약용식물 ! 제대로 알고 드십니까? (17.03.31),
최용조,최용조,false,hd,2d,PT5M26S,false,rectangular,,2017년 4월28일 경남 서경방송 뉴스인타임 경남농업기술원 작물연구과장 인터뷰 영상.,KIZmFb9p5h0,2017-04-28T05:18:41.000Z,0,1,0,2,133,경남 곤충산업  전망과 연구정책방향,
세모바퀴,세모바퀴,false,hd,2d,PT2M21S,false,rectangular,KR,제목 : 약용작물이란! ▷ 줄거리 : 약용작물에 대해 간단하게 설명한 영상입니다. http://new-book.tistory.com/2 으로 확인부탁드립니다. ▷ 인용자료...,Ix4XEgwfxtg,2018-10-22T02:48:10.000Z,0,0,0,1,86,(돈이 되는 환금작물) 약료작물이란 [새책 &amp; 세모바퀴],
maha5jqu,maha5jqu,false,sd,2d,PT44S,false,rectangular,,경남창원농업기술센타귀농연수 의령한과방문.,Cmg_eJivwdo,2011-12-25T08:57:21.000Z,0,0,0,0,190,경남창원농업기술센타귀농연수생,
탑그레이드,탑그레이드,false,hd,2d,PT10M5S,false,rectangular,KR,일반생물학 자세하고 꼼꼼하게! 개념+실력 완성 18장 유전자 발현 조절 1) 캠벨 생명과학 10판 최신판 완벽 해부 ㆍ개념과 용어를 쉽게 설명 ...,Z-9EVx5yEHQ,2019-04-05T09:49:37.000Z,0,0,0,2,151,탑그레이드 캠벨생명과학10판 유전학 18장 유전자 발현 조절,
KTV 대한늬우스,KTV 대한늬우스,false,hd,2d,PT45S,true,rectangular,KR,"제작일: 1965-01-23 농업 근대화를 위한 농경지 정리 사업. -경상북도 경산군 안심면의 농업 근대화를 위한 농경지 정리 사업. -쟁기질, 농경지 공사작...",h4EoDS1TGGA,2016-11-14T09:05:59.000Z,0,0,0,0,25,대한뉴스 제 503호-농경지 정리,
YTN NEWS,YTN NEWS,false,hd,2d,PT2M2S,true,rectangular,KR,[앵커] 요즘은 가정집에서 키우는 식물을 반려식물이라고 할 정도로 정성을 들이는 분들 많으시죠. 그런데 이런 식물이 병들면 어떻게 할까요?...,ZdezITQd9zQ,2017-01-01T01:02:06.000Z,0,0,0,3,247,식물도 아프면 사이버병원으로 / YTN (Yes! Top News),
YTN NEWS,YTN NEWS,false,hd,2d,PT1M49S,true,rectangular,KR,[앵커] 엉겅퀴와 흰민들레가 알코올성 간 질환과 위염 완화에 효과가 있는 것으로 밝혀졌습니다. 농촌진흥청이 밝혀낸 결과로 수입대체 효과는...,3rqnKkfYjkM,2017-03-01T17:37:18.000Z,0,2,0,2,1584,"들녘 엉겅퀴-흰민들레, 약초 효과 입증 / YTN (Yes! Top News)",
KBS창원,KBS창원,false,hd,2d,PT4M48S,true,rectangular,KR,"다양한 작물과 초록으로 가득한 농촌! 이 농촌이, 아이들이 놀이터가 됐습니다. 모내기체험을 통해 일일농부도 되어보고 농장에서 토마토를...",x4Nj7jhi55E,2018-06-25T01:11:43.000Z,0,0,0,1,464,"[생생투데이-창원] 즐거움이 쑥쑥! 농촌에서 놀자~ ① 감자 캐기/모내기 체험을 통해 즐기는 여름농촌풍경   (2018.06.22,금)",
시흥아카데미,시흥아카데미,false,hd,2d,PT1H48M6S,false,rectangular,,강의명 : 허준약초학교 10강 내 용 : 약초와 생활건강 강 사 : 박기현 /한국본초의학연구소 촬영일시 : 2015. 5. 20 (수) 영상길이 : 94분 ——————...,BQpE2Yh9MoA,2015-06-01T08:46:10.000Z,0,10,0,33,10584,[시흥아카데미] 허준약초학교1기 10강 「약초와 생활건강」 - 박기현(한국본초의학연구소),
미후김,미후김,false,hd,2d,PT3M48S,false,rectangular,,"방치된 묵논을 활용하여 참개구리, 한국산개구리 서식처를 복원한 2016 생태계보전협력금 반환사업지입니다.",PTGEnqTohn4,2018-04-16T08:35:18.000Z,0,1,0,1,312,이천 마장택지지구 일원 양서류서식처 복원 및 생태네트워크 구축사업,
WBS 원음방송,WBS 원음방송,false,hd,2d,PT28M2S,false,rectangular,KR,만행 퍼머컬쳐디자이너 유희정.,ngRI9mARkeA,2019-03-20T07:32:10.000Z,0,0,0,2,81,만행 퍼머컬쳐디자이너 유희정,
SU ABN,SU ABN,false,hd,2d,PT1H2M31S,false,rectangular,KR,한국약식동원연구소에서 준비한 강의로 여러분들의 건강한 삶에 큰 도움이 되실 것입니다. 이숙연 박사님은 삼육대학교 약학대학 교수로 재직하시...,NUMOS-ryF50,2013-11-28T02:29:13.000Z,3,2,0,26,7022,[이숙연] 약용식물이야기 1. 너의 식물이 되리라(창 1:29),
시흥아카데미,시흥아카데미,false,hd,2d,PT1H48M6S,false,rectangular,,강의명 : 허준약초학교 10강 내 용 : 약초와 생활건강 강 사 : 박기현 /한국본초의학연구소 촬영일시 : 2015. 5. 20 (수) 영상길이 : 94분 ——————...,BQpE2Yh9MoA,2015-06-01T08:46:10.000Z,0,10,0,33,10584,[시흥아카데미] 허준약초학교1기 10강 「약초와 생활건강」 - 박기현(한국본초의학연구소),
미후김,미후김,false,hd,2d,PT3M48S,false,rectangular,,"방치된 묵논을 활용하여 참개구리, 한국산개구리 서식처를 복원한 2016 생태계보전협력금 반환사업지입니다.",PTGEnqTohn4,2018-04-16T08:35:18.000Z,0,1,0,1,312,이천 마장택지지구 일원 양서류서식처 복원 및 생태네트워크 구축사업,
WBS 원음방송,WBS 원음방송,false,hd,2d,PT28M2S,false,rectangular,KR,만행 퍼머컬쳐디자이너 유희정.,ngRI9mARkeA,2019-03-20T07:32:10.000Z,0,0,0,2,81,만행 퍼머컬쳐디자이너 유희정,
SU ABN,SU ABN,false,hd,2d,PT1H2M31S,false,rectangular,KR,한국약식동원연구소에서 준비한 강의로 여러분들의 건강한 삶에 큰 도움이 되실 것입니다. 이숙연 박사님은 삼육대학교 약학대학 교수로 재직하시...,NUMOS-ryF50,2013-11-28T02:29:13.000Z,3,2,0,26,7022,[이숙연] 약용식물이야기 1. 너의 식물이 되리라(창 1:29),
Junseok Jang,Junseok Jang,false,sd,2d,PT13M14S,false,rectangular,,"화창한 봄날 안산 바람들이농장을 찾았다. 고추.오이, 토마토모종을 심고, 밭을 가는 등 분주하다. 거름만들기에 분주한 안철환선생과 막걸리...",UsSqk4Of1DM,2012-03-07T18:13:43.000Z,0,2,0,12,3720,우리는도시농사꾼 we are town farmer,
KTV PLAY,KTV PLAY,false,hd,2d,PT3M,false,rectangular,KR,원예치료사는 식물을 통해 몸과 마음의 질병을 치유하는 원예치료를 돕는 이들을 말합니다. 힐링전도사로 불리는 7년차 원예치료사 '김윤옥'님이...,uXoZMtVXJFc,2017-11-14T06:40:31.000Z,3,0,0,16,3176,식물로 마음을 치유하는 원예치료사,
시흥아카데미,시흥아카데미,false,hd,2d,PT2H20M24S,false,rectangular,,강의명 : 허준약교학교4기 13강 내 용 : 혈액순환에 좋은 약초 강 사 : 박종선 (한약사) 촬영일시 : 2016. 12. 23 (금) 영상길이 :2시간 20분 —————...,GuDDiAVxTb4,2016-12-27T03:40:05.000Z,0,7,0,6,3614,[시흥아카데미] 허준약초학교4기 13강 「혈액순환에 좋은 약초」 - 박종선(한약사),
시흥아카데미,시흥아카데미,false,hd,2d,PT1H2M51S,false,rectangular,,[시흥아카데미] 곤충학교2기 1강 1부 「미래산업의 곤충」 이석철(아이벅스캠프 대표) 강의명 : 곤충학교 2기 1강...,TBoiaGNUMv4,2017-09-14T09:27:22.000Z,0,4,0,7,1253,[시흥아카데미] 곤충학교2기 1강1교시 「미래산업의 곤충」 - 이석철(아이벅스캠프 대표),
자격증 인터넷강의 소개,자격증 인터넷강의 소개,false,hd,2d,PT15M1S,false,rectangular,,토양환경기사 필기대비 서영민교수 주경야독에서 토양환경기사 저자직강으로 필기 합격하기~ 서영민 교수님의 알찬 명품강의로 토양환경기사...,geSZAtyq3S0,2016-07-28T03:02:37.000Z,1,0,0,3,859,토양환경기사 필기 서영민 주경야독,
천안시청,천안시청,false,sd,2d,PT3M19S,false,rectangular,KR,"꽃을 피우는 가족, 꽃을 만드는 가족! 여기 흐뭇하고 행복 넘치는 프로그램이 있습니다. 가족의 웃음이 넘쳐나는 배움의 현장! 가족 생활 원예...",sGsXFH8uMT8,2017-05-31T08:00:06.000Z,0,0,0,0,40,"생활원예, 가족과 함께 해요!",
hummeropt,hummeropt,false,hd,2d,PT5M16S,false,rectangular,,,0iJKzeESR48,2011-11-21T15:49:18.000Z,0,0,0,0,78,생태공학동아리,
wjᄋᄋka,tks cjs,false,hd,2d,PT5M1S,false,rectangular,,의령군 용덕면 미곡마을 주민 20여명이 오영호 현)의령군수가 경영하는 돼지돈사에 대해 불법의혹을 제기하며 집회시위를 하고 있다.,9-V6YYf7BI4,2016-09-12T18:28:31.000Z,1,0,0,2,363,오영호 의령군수 불법돈사의혹 집회,
시흥아카데미,시흥아카데미,false,hd,2d,PT1H36M34S,false,rectangular,,"강의명 : 허준약초학교2기14강 내 용 : 약초의 선발과 활용 강 사 : 박기현 / 이화여대교수,서울대 생물학박사 촬영일시 : 2016. 1. 6 (수) 영상길이...",VpVp0mTn9yA,2016-01-10T09:23:59.000Z,0,1,0,7,2916,[시흥아카데미] 허준약초학교2기 14강  「약초의 선발과 활용」  -  박기현(이화여대교수/서울대 생물학박사),
문화유산채널[K-HERITAGE.TV],문화유산채널[K-HERITAGE.TV],false,hd,2d,PT9M22S,false,rectangular,KR,대전천연기념물센터의 식물 보전전문가 손지원 학예사. 미선나무 대상지인 충청북도 괴산에서 한창 연구를 진행 중이다. 식물분야 문화재 보존전...,c9EWvcC8LuI,2017-11-23T08:11:02.000Z,0,1,0,8,269,"[문화재 속 직업이야기] 문화재 보존전문가(동,식물) 손지원, 강정훈 편",
[captain kang TV] 강단장TV,[captain kang TV] 강단장TV,false,hd,2d,PT17M,false,rectangular,KR,"이차범교수(전남대, 남부대평생교육원 교수. 대체의학 박사) / 약용식물의 채취시기 / 식품과 약재구분/부분별 이용법 / 잎과 줄기, 껍질, 줄기, 열매 등.",nYgcC2OS-l0,2019-04-28T10:32:55.000Z,0,0,0,2,156,"[강단장tv] 건강/이차범교수 약용식물강의2 /약용식물, 약초 채취시기와 약성/ 식품과 약재구분 /",
시흥아카데미,시흥아카데미,false,hd,2d,PT1H27M28S,false,rectangular,,강의명 : 허준약초학교 6강 1교시 내 용 : 도시인이 꿈꾸는 허준약초학교 강 사 : 조우현 / 민속식물원장 촬영일시 : 2015. 4. 22 (수) 영상길이 :...,5AlRZ9wFM7k,2015-04-28T23:06:42.000Z,0,3,0,14,4213,[시흥아카데미] 허준약초학교1기 6강1교시 「도시인이 꿈꾸는 허준약초학교 1」 - 조우현(민속식물원장),
시흥아카데미,시흥아카데미,false,hd,2d,PT1H52M59S,false,rectangular,,강의명 : 허준약교학교3기 6강2교시 내 용 : 약초로 보는 면역 강 사 : 송수근 / 경희대 한약학과 촬영일시 : 2016. 05. 18 (수) 영상길이 : 55분 ———...,xw7WhIIT40o,2016-05-20T10:06:42.000Z,2,3,0,15,2998,[시흥아카데미] 허준약초학교3기 6강2교시 「약초로 보는 면역」 - 송수근(경희대 한약학과),
시흥아카데미,시흥아카데미,false,hd,2d,PT1H5M58S,false,rectangular,,강의명 : 허준약교학교3기 8강 내 용 : 약초의 선발과 활용 강 사 : 박기현 / 한국 본초의학연수소 / 서울대 생물학박사 촬영일시 : 2016. 06. 01 (수)...,nco4IrW7Nw8,2016-06-03T00:08:10.000Z,0,1,0,6,1388,[시흥아카데미] 허준약초학교3기 8강 「약초의 선발과 활용」 - 박기현(서울대 생물학박사),
스마트팜TV,스마트팜TV,false,hd,2d,PT31M44S,false,rectangular,,"귀농귀촌 선배 및 관련 전문가가 들려주는 귀농귀촌 정착노하우, 주거, 농지, 창업비즈니스 등 다양한 분야 주제별 멘토링 강의 2편 - 구분 :...",Ik2VXvQLIxY,2014-10-08T08:30:18.000Z,2,1,0,20,6120,행복한 귀농 노하우(농촌생활_임경수2) 23편,
정대영,정대영,false,sd,2d,PT29M55S,false,rectangular,,약용식물관리사교육과정시리즈1-1개론입니다.,ZSdCsRZLFns,2018-07-12T02:54:40.000Z,0,0,0,3,613,약용식물관리사-1개론,
시흥아카데미,시흥아카데미,false,hd,2d,PT1H56M22S,false,rectangular,,강의명 : 허준약교학교 제3기 14강 내 용 : 약용작물 산업현황 및 재배기초 강 사 : 성낙술 / 충북대 농학박사 촬영일시 : 2016. 07. 13 (수) 영상길이...,7Om9ZDtgTpU,2016-07-13T23:20:36.000Z,0,0,0,1,856,[시흥아카데미] 허준약초학교3기 14강 「약용작물 산업현황 및 재배기초」 - 성낙술(충북대 농학박사),
SU ABN,SU ABN,false,hd,2d,PT1H49M54S,false,rectangular,KR,한국약식동원연구소에서 준비한 강의로 여러분들의 건강한 삶에 큰 도움이 되실 것입니다. 이숙연 박사님은 삼육대학교 약학대학 교수로 재직하시...,BArLzmrod6Q,2013-11-28T13:17:23.000Z,0,0,0,14,3880,[이숙연] 약용식물이야기 10. 약용식물 총론 6,
시흥아카데미자치보감,시흥아카데미자치보감,false,hd,2d,PT1M40S,false,rectangular,,학교명 : 우리물고기학교 2기 강의명 : 물고기세계 핵심주제 : 생태계의 생산자 소비자 강사 : 김익수 내용 : 생태학에...,1sRH7lVRJwE,2017-11-15T02:42:31.000Z,0,0,0,0,8,[시흥아카데미 자치보감] 생태계의 생산자 소비자,
스마트팜TV,스마트팜TV,false,hd,2d,PT17M52S,false,rectangular,,""" 농식품 희망 릴레이, 남희석의 52+ "" SNS리얼 다큐멘터리. 농업, 농촌 가치 홍보 및 관련이슈에 대한 대국민 이해증진 및 소통 확대를 위해 농업인을...",jQ0WIxZGj-E,2013-04-18T03:08:54.000Z,1,1,0,16,9665,"[남희석의 52+] 숲, 치유의 힘",
시흥아카데미,시흥아카데미,false,hd,2d,PT1H56M40S,false,rectangular,,"강의명 : 허준약초학교2기15강 내 용 : 질병에 필요한 한약재 강 사 : 이영종 / 가천대교수,경희대한의학박사 촬영일시 : 2016. 1. 13 (수) 영상길이...",VdZo3fpC6E4,2016-01-17T06:56:28.000Z,0,2,0,7,3335,[시흥아카데미] 허준약초학교2기 15강  「질병에 필요한 한약재」  -  이영종(가천대교수/경희대한의학박사),
KBS News,KBS News,false,hd,2d,PT1M38S,true,rectangular,KR,앵커 멘트 구한말에 해외로 반출됐던 우리 식물 표본들이 120년 만에 한국으로 돌아왔습니다. 식물 연구뿐 아니라 역사적으로도 중요한 가치를...,pxpKKI87Fxs,2015-12-08T13:11:10.000Z,0,0,0,2,1068,120년 만에 되찾은 구한말 우리 식물 ‘싱아’,
종합교육기업에듀피디,종합교육기업에듀피디,false,hd,2d,PT7M30S,false,rectangular,KR,식물보호(산업)기사 농촌지도사 작물보호학 시험대비 농약학 이론 1강 강사명: 손송운 교수님 제공: 에듀피디 http://www.edupd.com/,C-G0ggfhxKU,2017-06-22T08:55:58.000Z,0,2,0,2,1721,식물보호(산업)기사 농약학 이론 1강,
시흥아카데미,시흥아카데미,false,hd,2d,PT2H18M3S,false,rectangular,,강의명 : 허준약초학교2기 8강 내 용 :도심속 우리의 건강과 약초 강 사 :엄경섭 / 한국생약협회명예회장&원광대석사 촬영일시 : 2015. 11. 25 (수)...,o8TAxH5UEDU,2015-12-01T06:21:23.000Z,0,2,0,10,2445,[시흥아카데미] 허준약초학교2기 8강 「도심속 우리의 건강과 약초」 - 엄경섭(한국생약협회명예회장/원광대석사),
junyeonong,junyeonong,false,sd,2d,PT3M,false,rectangular,,"통합진보당 비례대표5번 윤금순후보의 출마인사입니다. 꼭 필요한 농민국회의원, 굳세어라 금순아! 통합진보당 비례후보 기호5번 윤금순! 30년...",5uHtUcjaiu4,2012-03-06T04:42:03.000Z,0,0,0,8,634,통합진보당 비례대표5번 윤금순후보 동영상.wmv,
DP associates,DP associates,false,hd,2d,PT4M9S,false,rectangular,,반석산에코스쿨 반석산 에코스쿨-생태학자의 이야기 (주)디피어소시에이츠 제작(2017) DP associates +82-2-6495-2167 http://dpground.com/ko/,F6MIqOYt1FM,2019-01-07T00:54:02.000Z,0,0,0,0,5,반석산에코스쿨 - 생태학자의 이야기,
서울경제TV 쎈 이코노미,서울경제TV 쎈 이코노미,false,hd,2d,PT2M25S,true,rectangular,KR,[앵커] 전세계적인 베스트셀러 '사이피엔스'의 저자 유발 노아 하라리 교수가 방한했습니다. 역사학자인 하라리 교수는 인공지능 등 첨단과학의...,zDSqtVYvrsY,2016-05-09T10:20:04.000Z,0,0,0,0,279,[서울경제TV] ‘사피엔스’저자 하라리 “인간노동 거의 사라져”,
시흥아카데미,시흥아카데미,false,hd,2d,PT2H29M27S,false,rectangular,,강의명 : 허준약초학교 15강 내 용 : 도시인이 꿈꾸는 허준약초학교 Ⅱ 강 사 : 조우현 / 민속식물원장 촬영일시 : 2015. 7. 08 (수) 영상길이...,cJ-IvQcOTpQ,2015-07-15T23:54:19.000Z,0,2,0,6,2717,[시흥아카데미] 허준약초학교1기 15강 「도시인이 꿈꾸는 허준약초학교 2」 - 조우현(민속식물원장),
한국방송통신대학교,한국방송통신대학교,false,sd,2d,PT28M37S,true,rectangular,KR,"생태적 삶을 이야기하다 4회 - 생태적 삶, 전통마을에 그 답이 있다.",nUr3ZgJEvjY,2014-06-13T05:13:06.000Z,0,0,0,3,403,생태적 삶을 이야기하다 4회,
시흥아카데미,시흥아카데미,false,hd,2d,PT1H6M47S,false,rectangular,,강의명 : 허준약교학교3기 7강 내 용 : 건강하게 사는 방법 강 사 : 신용호 / 미국 사우스배일로 대학교 촬영일시 : 2016. 05. 25 (수) 영상길이 : 1시간...,zZtebUlQj-U,2016-05-27T01:31:22.000Z,0,1,0,3,1105,[시흥아카데미] 허준약초학교3기 7강 「건강하게 사는 방법」 - 신용호(미국 사우스배일로 대학교),
김은지,김은지,false,sd,2d,PT4S,false,rectangular,,"http://www.licensemain.com ←자격증취득 무료정보,공무원취업 자격증시험정보 국가자격증취득 민간자격증추천 국가공인자격증 정보 위생사 영양사...",ifgOa1vsAoY,2015-07-23T08:20:43.000Z,0,2,0,3,1866,약용식물관리사 자격증취득방법 무료정보 동영상강의,
[전북생생TV] 전라북도 인터넷방송국,[전북생생TV] 전라북도 인터넷방송국,false,hd,2d,PT1M55S,false,rectangular,,전라북도 인터넷 방송국.,IJ_3fX0FKkQ,2019-06-07T04:26:27.000Z,0,0,0,3,55,[기획뉴스] 김제 벽골제농경문화박물관,
소비자TV,소비자TV,false,hd,2d,PT55M1S,false,rectangular,KR,"의학적, 윤리적, 생태학적 관점에서 현대의 식생활을 조망해볼 필요가 있다. 식품 섭취가 의학적으로 우리 몸에 어떠한 영향을 미치는지에 대해...",yHUqrLi7yPE,2015-01-14T04:16:07.000Z,0,0,0,2,470,다양한 관점으로 본 현대인의 식생활,
김은지,김은지,false,sd,2d,PT4S,false,rectangular,,"http://www.licensemain.com ←자격증취득 무료정보,공무원취업 자격증시험정보 국가자격증취득 민간자격증추천 국가공인자격증 정보 위생사 영양사...",QEmVaDIZg9Q,2015-07-23T12:27:53.000Z,0,0,0,0,287,자연생태복원기사 자격증취득 무료정보제공 동영상강의,
시흥아카데미,시흥아카데미,false,hd,2d,PT54M41S,false,rectangular,,"강의명 : 허준약교학교3기 4강 내 용 : 약초, 삶 그리고 시대정신 강 사 : 김원웅 / 허준약초학교 이사장 촬영일시 : 2016. 05. 04 (수) 영상길이 :...",TwFQ6dXm8SA,2016-05-06T14:36:47.000Z,0,0,0,1,1113,"[시흥아카데미] 허준약초학교3기 4강 「약초, 삶 그리고 시대정신」 - 김원웅(허준약초학교 이사장)",
시흥아카데미,시흥아카데미,false,hd,2d,PT1H14M32S,false,rectangular,,강의명 : 허준약초학교2기 1강1교시 내 용 : '국내ㆍ외 약초재배 유통현황' 강 사 : 송수근 / 잠실경희수한약국 교육원장 촬영일시 : 2015. 10....,SiROZdyurns,2015-10-30T01:04:50.000Z,0,0,0,3,2189,[시흥아카데미] 허준약초학교2기 1강1교시 「‘국내ㆍ외 약초재배 유통현황’」 - 송수근(잠실경희수한약국 교육원장),
NDC,NDC,false,hd,2d,PT47M10S,false,rectangular,KR,"NDC 2018 [낯선 게임인데 익숙해야 하고, 알려줄 게 많은데 재미있어야 한다고요? - '야생의 땅: 듀랑고' 초반 플레이 변천사] 세션 공유드립니다....",lEsLIMVVYwk,2018-07-04T03:12:37.000Z,1,0,0,2,215,"[NDC] 낯선 게임인데 익숙해야 하고, 알려줄 게 많은데 재미있어야 한다고요? - &#39;야생의 땅: 듀랑고&#39; 초반 플레이 변천사",
시흥아카데미,시흥아카데미,false,hd,2d,PT2H30M9S,false,rectangular,,"강의명 : 허준약초학교2기10강 내 용 :약초,자생식물을 활용한 정원만들기 강 사 :김애경 / 경희대학본초학연구원&경희대한방재료가공학박사...",eksyFLZqmFo,2015-12-15T02:53:36.000Z,0,4,0,11,3485,"[시흥아카데미] 허준약초학교2기 10강 「약초, 자생식물을 활용한 정원만들기」 - 김애경(경희대학본초학연구원/경희대한방재료가공학박사)",
dgmbcnews,dgmbcnews,false,sd,2d,PT1M57S,false,rectangular,,방송: 2016.06.03 (금) 대구MBC 뉴스투데이 내용: 약용작물 6차산업화 활발 - 조동진 기자 (안동M),gloDq26Ik5s,2016-06-02T23:16:51.000Z,0,0,0,0,580,[대구MBC뉴스] 약용작물 6차산업화 활발,
시흥아카데미,시흥아카데미,false,hd,2d,PT35M16S,false,rectangular,,강의명 : 허준약초학교2기 4강3교시 내 용 : '한의학에 대한 개론' 강 사 : 고형곤 / 하나로기경희한의원장 촬영일시 : 2015. 10. 28 (수) 영상길이...,CgGad8uJC60,2015-11-18T02:39:37.000Z,0,1,0,3,1432,[시흥아카데미] 허준약초학교2기 4강3교시 「‘한의학에 대한 개론’」 - 고형곤(하나로기경희한의원장),
사람사는세상노무현재단,사람사는세상노무현재단,false,sd,2d,PT1M22S,false,rectangular,KR,설명.,tlB-Ag08DvM,2014-08-26T04:20:51.000Z,0,0,0,8,331,04 화포천,
YTN SCIENCE,YTN SCIENCE,false,sd,2d,PT1M27S,true,rectangular,,[YTN 사이언스 기사원문] http://www.ytnscience.co.kr/program/program_view.php?s_mcd=0082&s_hcd=&key=201311131731008591 사회기반시설에 생태학적 ...,_dZXx8I2ltY,2013-11-13T10:02:27.000Z,0,0,0,0,28,제1회 응용생태공학 심포지움 개최 / YTN 사이언스,
박민서,박민서,false,sd,2d,PT1M13S,false,rectangular,,철갑상어.,7ZNnZVy911c,2017-10-30T23:05:18.000Z,2,0,0,1,438,철갑상어 영상,
블레이드위버BladeWeaver,블레이드위버BladeWeaver,false,hd,2d,PT16M34S,true,rectangular,KR,식물학자가 되어 여러가지 씨앗을 심어 관련업자들에게 이메일로 전송하는 게임 ▽ 유튜브 ㆍ힐링게임 영상 모두보기: https://goo.gl/mnu5MM ㆍ다른...,tYEVQ5HPIfs,2017-10-10T09:00:03.000Z,2,0,0,3,92,식물을 키워 식물학자로써 인지도를 쌓는 힐링게임 | 식물학자(더 보타니스트: The Botanist),
농협 공식 유튜브 채널,농협 공식 유튜브 채널,false,sd,2d,PT54S,false,rectangular,,농협경주교육원 개원 (20161019),wYtuIHcX0tA,2016-10-21T00:30:22.000Z,0,0,0,1,160,농협경주교육원 개원 (20161019),
시흥아카데미자치보감,시흥아카데미자치보감,false,hd,2d,PT1M56S,false,rectangular,,학교명 : 백년정원학교 강의명 : 정원가꾸고 관리하기 핵심주제 : 퍼머컬처 강사 : 백혜숙 / 에코십일 대표 내용 : 지속가능한 정원문화를 목표하는...,7s53oPtqmAU,2015-04-12T08:20:31.000Z,0,0,0,1,54,[시흥아카데미 자치보감] 백년정원학교 1기 - 퍼머컬처,
MediaVOP,MediaVOP,false,hd,2d,PT1M31S,true,rectangular,KR,여성농민들이 총선 승리를 위해 통합진보당에 지지를 선언했다. 전국여성농민회총연합과 통합진보당은 22일 오전 여의도 국회 정론관에서 '총선...,Z2ow7Ea6xcw,2012-02-22T03:15:01.000Z,0,0,0,0,150,"통합진보당-전여농, &#39;총선 승리&#39; 정책협약식",
KBS창원,KBS창원,false,hd,2d,PT16M58S,true,rectangular,KR,"[시사카페-후(WHO)톡] 전국여성농민회총연합 경남지부 소희주 정책위원장 30회. 2015.09.08,화 후WHO톡 : 전국여성농민회총연합 경남지부 소희주 정책위...",t7dxw_yiImY,2015-09-09T05:41:07.000Z,1,1,0,6,917,"[시사카페-후(WHO)톡] 전국여성농민회총연합 경남지부 소희주 정책위원장 30회. 2015.09.08,화",
시흥아카데미자치보감,시흥아카데미자치보감,false,hd,2d,PT1M7S,false,rectangular,,학교명 : 허준약초학교 2기 강의명 : 도시농업 핵심주제 : 귀농에 적합한 시기 강사 : 조우현 내용 : 귀농은 가을걷이가...,SJyDuLBWOAs,2016-09-21T18:43:36.000Z,0,0,0,0,27,[시흥아카데미 자치보감] 허준약초학교 2기 - 귀농에 적합한 시기,
시흥아카데미,시흥아카데미,false,hd,2d,PT46M54S,false,rectangular,,"강의명 : 산림경영학교 제9강 내 용 : 시장님 특강 강 사 : 김윤식 / 시흥시장 ,함번웅 / 산림경영학교장, 동아임장 대표 촬영일시 : 2014. 12. 15 (월)...",5nN09aRyB4Y,2014-12-29T11:13:49.000Z,0,1,0,1,1708,[시흥아카데미] 산림경영학교 9강 「우리 시 산림의 경제적 가치와 발전방향」 - 김윤식(시흥시장),
SU ABN,SU ABN,false,hd,2d,PT1H43S,false,rectangular,KR,한국약식동원연구소에서 준비한 강의로 여러분들의 건강한 삶에 큰 도움이 되실 것입니다. 이숙연 박사님은 삼육대학교 약학대학 교수로 재직하시...,27gZ9OCqd1E,2013-11-28T02:13:28.000Z,0,0,0,5,1155,[이숙연] 약용식물이야기 7. 약용식물 총론 4,
김세연,김세연,false,sd,2d,PT3M46S,false,rectangular,,즐감ㅋ.,25db9-UCCMg,2012-12-02T04:07:03.000Z,4,0,0,3,516,아름다운 생태계 UCC 과학송,
수평계,수평계,false,hd,2d,PT1M12S,false,rectangular,,먹이용금붕어코매트5일만에 백점병으로 전부폐사..후 3짜급 자연산향어2마리로 결정 산란기후라 상처가있었는데요 소금욕과 황토물치료로 눈에뛰...,uobRGyrPNcc,2016-05-02T12:05:37.000Z,6,1,0,2,2981,베란다아쿠아포닉스DIY어항,
김라임,김라임,false,hd,2d,PT4M41S,false,rectangular,,광주농업기술센터에 의뢰한 토양 분석 결과와 그에 대한 전남대학교 화훼원예학 한태호 교수님의 설명.,7FQxO7asSfM,2014-06-08T03:19:19.000Z,0,0,0,0,63,CNUAgriPix - UCC찍었조의 네 번째 UCC : 광주농업기술센터 토양분석결과,
CSTV MEDIA,CSTV MEDIA,false,sd,2d,PT44M24S,false,rectangular,,홍정길목사 - 통일 시대를 연 다윗의 리더쉽 ( 삼하 5 : 1 ~ 5 ) CSTV.,m-Fh0hB8oz4,2016-02-23T22:30:58.000Z,0,0,0,0,42,홍정길목사  -  통일 시대를 연 다윗의 리더쉽  ( 삼하 5 : 1 ~ 5 )   CSTV,
SU ABN,SU ABN,false,hd,2d,PT51M55S,false,rectangular,KR,한국약식동원연구소에서 준비한 강의로 여러분들의 건강한 삶에 큰 도움이 되실 것입니다. 이숙연 박사님은 삼육대학교 약학대학 교수로 재직하시...,XaCR9qKss5w,2013-11-28T09:14:59.000Z,0,3,0,4,2892,[이숙연] 약용식물이야기 6. 약용식물 - 나물편,
KBS창원,KBS창원,false,hd,2d,PT3M50S,true,rectangular,KR,"징그럽게만 보였던 곤충이 우리의 친구가 될 수 있다는 사실, 알고 계셨나요? 반려동물보다 더 사랑스럽게~ 군것질보다 더 맛있게 다가올, ...",5R3sF3TIC0E,2018-06-07T01:04:18.000Z,2,0,0,5,456,"[생생투데이-창원] 경남에서 꿈꾸는 벅스라이프! ②  곤충은 미래다! 미래식량, 곤충산업을 준비하는 수업현장   (2018.06.05,화)",
역사문화관광의 도시강북구,역사문화관광의 도시강북구,false,sd,2d,PT8M9S,false,rectangular,KR,여러분은 혹시 '곤충 컨설턴트'라는 직업에 대해 들어보신 적 있으신가요? 이름도 생소한 곤충 컨설턴트는 곤충산업이 미래산업으로 각광받으면...,3KVXdggjQ0o,2018-11-29T22:04:53.000Z,0,0,0,0,15,직업길라잡이 &#39;내일을 잡(job)아라&#39; - 곤충 컨설턴트,
한수빈,한수빈,false,hd,2d,PT31S,false,rectangular,,,D0hojB4o1as,2015-04-05T12:00:40.000Z,0,1,0,1,448,메기메기해,
티브로드 중부/세종,티브로드 중부/세종,false,hd,2d,PT2M23S,true,rectangular,KR,티브로드 #뉴스 #세종시 세종 지역의 한 기업이 초등학생을 대상으로 친환경 과학교실을 운영해 눈길을 끌고 있습니다. 평소 학교에서 배울 수...,gSL_ZNbz2Ew,2019-03-22T10:01:17.000Z,0,0,0,2,31,세종 &#39;친환경 에너지 배워요&#39; 에코스쿨 호응,
김은지,김은지,false,sd,2d,PT4S,false,rectangular,,"http://www.licensemain.com ←자격증취득 무료정보,공무원취업 자격증시험정보 국가자격증취득 민간자격증추천 국가공인자격증 정보 위생사 영양사...",EwEgmEx7i_c,2015-07-23T16:39:16.000Z,0,1,0,0,304,친환경관리사 자격증취득방법 동영상강의,
문화포털,문화포털,false,hd,2d,PT3M5S,false,rectangular,,더 많은 이야기가 궁금하다면 문화PD 페이스북▽ https://www.facebook.com/munhwapd 문화포털 문화PD 블로그▽ http://blog.naver.com/kcis_/220790350515 ...,CuNfFmMtTUY,2016-11-30T05:40:15.000Z,0,1,0,0,88,"일깨워줘서 고마워요, 녹색학습원",
tbs 시민의방송,tbs 시민의방송,false,hd,2d,PT4M6S,true,rectangular,KR,"이 에코스쿨에 다니고 있습니다. 에코스쿨 조성사업에 대해 더 자세히 알고 싶고, 해당 학교 학생은 어떤 참여를 하는지 알아봤습니다.",kUfZmUBLMDE,2015-06-02T02:49:54.000Z,0,0,0,0,160,[tbstv] 에코스쿨 조성사업이 궁금해요,
종합교육기업에듀피디,종합교육기업에듀피디,false,hd,2d,PT7M3S,false,rectangular,KR,식물보호기사/식물보호산업기사 자격증 시험대비 작물보호학 농림해충학 문제풀이 1강 강사명: 손송운 교수님 제공: 에듀피디 http://www.edupd.com/,_aC6oTeqXoA,2017-07-21T01:54:12.000Z,0,0,0,0,201,[에듀피디] 식물보호기사/산업기사 농림해충학 문제풀이 1강,
한태연 태양광 TV,한태연 태양광 TV,false,hd,2d,PT1M14S,true,rectangular,KR,한태연 한국태양광발전사업자연합회 김길용 업무 분양이사 - 010-4651-0363 박균수 분양 개발이사 - 010-9436-6823.,wf5OkFSDIUs,2018-10-18T08:44:28.000Z,0,0,0,0,111,경남 고성 3차 곤충사 현장소개 김길용이사,
박준우,박준우,false,hd,2d,PT21S,false,rectangular,,,zMJNrgLMaec,2018-12-16T11:00:27.000Z,0,0,0,0,57,식물학자가 하는일,
Inkyung Kim,Inkyung Kim,false,sd,2d,PT6M8S,false,rectangular,,,xO_AvCspg9M,2014-05-08T04:44:03.000Z,0,0,0,0,881,특용작물재배자,
오지메리트,오지메리트,false,hd,2d,PT10M12S,false,rectangular,,"우리 주위의 풀을 관찰하고, 먹고, 활용해보는 워크숍. 풀요리 전문가/퍼머컬처 디자이너 소란 선생님과 2박3일간 함께했습니다.",JgtXnyky_sI,2016-05-12T07:18:18.000Z,0,0,0,0,76,"청송, 산들산들풀캠프 (10min)",
SU ABN,SU ABN,false,hd,2d,PT1H23M33S,false,rectangular,KR,한국약식동원연구소에서 준비한 강의로 여러분들의 건강한 삶에 큰 도움이 되실 것입니다. 이숙연 박사님은 삼육대학교 약학대학 교수로 재직하시...,-2cmZmSAc_w,2013-11-28T07:31:28.000Z,0,5,0,2,1485,[이숙연] 약용식물이야기 5. 약용식물 총론 3,
프라임경북뉴스nTV,프라임경북뉴스nTV,false,hd,2d,PT1M42S,true,rectangular,KR,울진 엑스포공원서에 젖병을 빨아 우유를 먹는 잉어가 있어 화제가 되고 있습니다.,XZ81jxbYNXM,2013-09-04T00:25:30.000Z,0,0,0,1,666,"울진 엑스포공원서, 젖병을 빨아 우유를 먹는 잉어가 있어 화제",
대가들이 사는 마을,대가들이 사는 마을,false,hd,2d,PT2M3S,false,rectangular,KR,국제자격교육원 홍보영상 약용식물자원관리사 홍보대사: 배우 박윤배(전원일기 응삼이) 기획/촬영/편집: 대가들이사는마을 tel:1522-7947.,6y0Zt7_JEfA,2018-06-05T08:06:29.000Z,1,0,0,1,111,민간자격 교육기관 홍보영상_콘티1,
정홍철TV,정홍철TV,false,hd,2d,PT4M11S,true,rectangular,KR,"김호경 제천시의원, 고기능 LED약용연구소 1년 질타 2016. 2. 25. 제천시의회 산업건설위원회, 한방바이오과 업무보고.",QuC-M2ePTsA,2016-02-25T05:20:40.000Z,0,0,0,0,84,"[YTV] 김호경 제천시의원, LED약용작물 연구소 1년 질타",
KBS뉴스 경남,KBS뉴스 경남,false,hd,2d,PT1M44S,true,rectangular,KR,"[앵커멘트] 김해 화포천은 경남의 대표적인 철새 도래지 가운데 하나인데요, 최근 철새 보기가 쉽지 않다고 합니다. 화포천 일부 구간에 땅 소유주...",Vn_Pe4NWaYU,2016-11-21T01:32:41.000Z,0,0,0,2,65,"[주요 뉴스] KBS뉴스9 경남 - 화포천에 무허가 연꽃밭, 철새 `뚝`(2016.11.18.금)",
김은지,김은지,false,sd,2d,PT4S,false,rectangular,,"http://www.licensemain.com ←자격증취득 무료정보,공무원취업정보 7급 9급 공무원시험정보 국가자격증 정보는 네이버에 국가자격증 취업 무료지원센터...",ZfJo-pz1yrs,2015-08-06T13:33:26.000Z,0,4,0,1,1001,국가자격증 민간자격증추천 종류 시험정보,
KBS창원,KBS창원,false,hd,2d,PT5M29S,true,rectangular,KR,"선선한 바람 따라 어디론가 떠나고 싶은 가을! 하지만, 단풍 즐기기엔 이르고~ 무작정 떠나기엔 뭔가 아쉬운 이맘때, 체험으로 가득한 알찬 나들이...",3PgfQa2dXVY,2015-09-22T01:05:43.000Z,0,0,0,1,177,"[생생투데이-창원] - 체험으로 풍성한 가을 나들이! ③ 전통체험편 2015.09.21,월",
방송대학TV,방송대학TV,false,sd,2d,PT2M31S,false,rectangular,,다양한 칼라로 진화하고 있는 자원식물의 세계 (방송대 자원식물학 강의 중 일부),WdjzoQx1VKg,2012-06-22T04:43:21.000Z,0,0,0,1,164,방송대학TV_칼라로 진화하는 자원식물 (자원식물학),
KBS창원,KBS창원,false,hd,2d,PT2M48S,true,rectangular,KR,"물 맑고 공기 좋은 의령에 꽃미남 꽃미녀 부부가 떴다! 아담하지만 사랑이 넘치는 농장에서 정성으로 느타리버섯을 키우며, 토끼 같은 자식들도...",T5jVFP6B91A,2017-02-24T04:29:03.000Z,0,1,0,3,89,"[생생투데이-창원] 착한 가족의 알콩달콩 귀농일기 ③ 농사꾼끼리는 통하는 것이 있다! 지인 집에 놀러가다 (2017.02.21,화)",
정대영,정대영,false,sd,2d,PT4M58S,false,rectangular,,약용식물관리사과정 교육중 약용식물의 주요작용은 한약학개론중 각론에 해당되는 내용을 발췌한 것임을 아려드립니다.,uT7bKenZ378,2012-09-23T06:11:23.000Z,0,0,0,3,1179,2 2 각론1약용식물의주요작용,
홍인.이창호,홍인.이창호,false,sd,2d,PT1M21S,false,rectangular,,동국대학교 2009 가을학기 사회교육원 약용식물관리사 수료식 (2009.12.23) 동영상입니다.,qNXx2xd_O_g,2010-02-05T15:43:45.000Z,0,0,0,0,798,약용식물관리사-수료식.wmv,
동아사이언스,동아사이언스,false,hd,2d,PT2M11S,false,rectangular,,"""지사탐을 통해 생태학자의 꿈을 키워보세요!"" 논으로, 산으로, 숲으로! 봄엔 수원청개구리와 귀화식물을, 여름엔 매미를, 가을엔 노래곤충을,...",IKO4y8jSGo0,2016-01-05T08:41:41.000Z,1,0,0,4,1083,어린이과학동아 지구사랑탐사대,
대전MBC 뉴스/Daejeon MBC News,대전MBC 뉴스/Daejeon MBC News,false,hd,2d,PT2M5S,true,rectangular,KR,건강기능식품 등 약초가 다양하게 활용되면서 귀농을 준비하며 약초를 배우려는 사람들이 많습니다. 남녀노소를 가리지 않은 수강생들로 인기를...,K-9nkzVtJ_Y,2015-09-21T07:17:45.000Z,0,0,0,0,57,[대전MBC뉴스]충청권1-귀농 앞두고 약초 교실 인기,
IPTV뉴스,IPTV뉴스,false,hd,2d,PT55S,false,rectangular,KR,설명.,U435LZysXco,2014-07-31T09:03:18.000Z,0,0,0,0,129,아산생태곤충원 여름방학 맞은 학생 위한 &#39;곤충아 놀자&#39; 행사 개최,
푸드투데이,푸드투데이,false,hd,2d,PT13M14S,true,rectangular,KR,http://www.foodtoday.or.kr/news/article.html?no=136458 이근규 제천시장은 내년 한방바이오산업엑스포를 통해 세계 각국과 협력 네트워크를 강화해 한방바이오...,wKqa-aTEun0,2016-02-12T05:55:49.000Z,0,0,0,0,15,[창간14주년기념대담]이근규 제천시장 &quot;한방바이오엑스포 산업엑스포로 도약&quot; [푸드투데이],
JN최정웅,JN최정웅,false,hd,2d,PT17S,false,rectangular,,,wP7uvG3fyDA,2013-05-15T08:20:54.000Z,0,0,0,0,32,제이뉴스통신 제천 고기능 LED 약용식물연구소 측량시작 사업착수,
경주이야기,경주이야기,false,hd,2d,PT53S,false,rectangular,,경주 보문단지 '농협중앙회 경주교육원' 개원.,T1djqEqgqL4,2016-10-14T10:21:35.000Z,0,0,0,1,98,경주 보문단지 ‘농협중앙회 경주교육원’ 개원,
경상남도,경상남도,false,sd,2d,PT8M32S,false,rectangular,KR,"1. 경남도, 고성 조선해양산업특구 조성 탄력 받는다 2. 창원국가산단, 감성이 있는 문화공간으로 거듭난다 3. 경남도, 추석 대비 수산물 원산지표지...",7jhlayigrAc,2014-08-19T07:21:01.000Z,0,1,0,1,56,경남뉴스 2014-63호(8월 19일),
난장은평,난장은평,false,hd,2d,PT15M39S,false,rectangular,,,auldRC1qmlc,2013-07-23T04:04:19.000Z,0,0,0,1,105,[은평난장 제3탄] 최승국(태양과바람 에너지 협동조합) &quot;햇빛발전소로 에너지 자립 마을을 꿈꾼다&quot;,
기상청 인터넷기상방송 날씨ON,기상청 인터넷기상방송 날씨ON,false,sd,2d,PT31S,false,rectangular,KR,"해양오염의 심화, 해양생태계 파괴, 해수면 상승 등 해양에서 기인하는 재난은 어느 특정국가의 문제가 아닌 전 세계가 겪는 문제입니다. 이러한...",6lB7V83gCQo,2014-02-21T11:58:26.000Z,0,0,0,0,315,2012여수세계박람회 홍보동영상,
윤형돈,윤형돈,false,sd,2d,PT4M47S,false,rectangular,,"맑은 물, 맑은 산 도심에서 벗어난 여행을 하고 싶을 때 천천히 걷고, 천천히 음미하며 즐길 수 있는 여행지가 있다. 바로 경기도 양평, 보릿고개...",sw9iGy7B15I,2012-12-07T14:57:37.000Z,0,0,0,0,497,양평 보릿고개 마을,
TED,TED,true,sd,2d,PT16M40S,true,rectangular,,"http://www.ted.com 400 years after Hudson found New York harbor, Eric Sanderson shares how he made a 3D map of Mannahatta's fascinating pre-city ecology ...",3z1cCT2NP4k,2009-10-13T16:11:36.000Z,913,573,0,8038,848956,New York -- before the City | Eric Sanderson,
Mic the Vegan,Mic the Vegan,true,hd,2d,PT7M59S,true,rectangular,,"Farming without POOP! The myths, the farmers, and the magic. Links and Sources: https://www.patreon.com/micthevegan ...",DWDznkdUjb0,2016-05-06T05:51:05.000Z,370,31,0,2528,30974,What is Veganic Farming? Is it Viable?,
TEDx Talks,TEDx Talks,true,sd,2d,PT10M18S,true,rectangular,,"Aaron Makaruk is the Director of Development for Open Source Ecology, a social enterprise building the Global Village Construction Set: an open source ...",d-D8FGZi0qc,2012-10-09T16:19:20.000Z,9,3,0,160,10828,Open Source Ecology: Aaron Makaruk at TEDxMadrid,
해적왕 Pirate_King,해적왕 Pirate_King,true,hd,2d,PT13M45S,true,rectangular,KR,안녕하세요. 해적왕입니다. 어느덧 구독자 1000명을 달성했습니다. 이것은 여러분들의 사랑과 관심 덕분입니다. 그 사랑에 보답할 수 있는 해적왕...,jp0PoGO42-A,2018-12-17T11:00:07.000Z,202,2,0,95,3217,"듀랑고, 주간 해적왕#2 12월 셋째주. Durango : wild lands, Pirate king",
อินทรีทอง เกษตรอินทรีย์,อินทรีทอง เกษตรอินทรีย์,true,hd,2d,PT5M29S,true,rectangular,TH,"""น้ำ"" จำเป็นมากที่สุดและสำคัญมากในการทำเกษตร มาดูการขุดบ่อดินขนาดใหญ...",FkO_5i_CDTU,2017-06-30T00:49:28.000Z,7,5,0,45,13660,มหึมา! ขุดบ่อดินขนาดใหญ่เพื่อใช้เลี้ยงปลาและทำเกษตรทฤษฎีใหม่,
Khan Academy Partners,Khan Academy Partners,true,hd,2d,PT8M54S,true,rectangular,,Hank discusses different forms of pollution and their ecological effects. Created by Crash Course. Watch the next lesson: ...,xGBA1_VVvGI,2019-04-26T06:45:18.000Z,,,0,,31303,Pollution | Crash Course ecology | Khan Academy,
Khan Academy Partners,Khan Academy Partners,true,hd,2d,PT10M24S,true,rectangular,,"Hank explores human population growth, exponential growth of populations, and R- and K-strategists. Created by Crash Course. Watch the next lesson: ...",WIhR50ttMB4,2019-04-26T06:55:16.000Z,,,0,,46411,Human population growth | Crash Course ecology | Khan Academy,
The Film Archives,The Film Archives,true,sd,2d,PT1H26M18S,true,rectangular,,"John P. Milton is a meditation and Qigong instructor, author, and a pioneering environmentalist. He is the founder of Sacred Passage and the Way of Nature.",ZBssILcLHug,2012-07-02T20:59:20.000Z,22,76,0,117,196172,Environmental Disaster: Natural Disasters That Affect Ecosystems,
