[{
    "channelTitle": "Learning Lanka",
    "channelid": "Learning Lanka",
    "contentDetails": {
        "caption": "false",
        "definition": "sd",
        "dimension": "2d",
        "duration": "PT37M1S",
        "licensedContent": true,
        "projection": "rectangular"
    },
    "country": "LK",
    "description": "",
    "id": "vpOd0tlieY0",
    "publishedAt": "2013-08-25T13:25:32.000Z",
    "statistics": {
        "commentCount": "0",
        "dislikeCount": "2",
        "favoriteCount": "0",
        "likeCount": "19",
        "viewCount": "4775"
    },
    "title": "Jathika Pasala AL)   Agriculture 2013 Lesson (3)"
},{
    "channelTitle": "Watapita",
    "channelid": "Watapita",
    "contentDetails": {
        "caption": "false",
        "definition": "hd",
        "dimension": "2d",
        "duration": "PT3M36S",
        "licensedContent": true,
        "projection": "rectangular"
    },
    "country": "US",
    "description": "\u0d87\u0dbd\u0dca\u0db6\u0da7\u0dca \u0d85\u0dba\u0dd2\u0db1\u0dca\u0dc3\u0dca\u0da7\u0dba\u0dd2\u0db1\u0dca \u0d9c\u0dd0\u0db1 \u0dbb\u0dc3 \u0d9a\u0dad\u0dcf \u0db4\u0dc4\u0d9a\u0dca. #WatapitaVlog #AlbertEinstein.",
    "id": "TkR4wrrEKSs",
    "publishedAt": "2019-09-07T01:27:39.000Z",
    "statistics": {
        "commentCount": "7",
        "dislikeCount": "3",
        "favoriteCount": "0",
        "likeCount": "95",
        "viewCount": "1745"
    },
    "title": "\u0dbd\u0ddd\u0d9a\u0dd9\u0da7 \u0dc0\u0dd2\u0daf\u0dca\u200d\u0dba\u0dcf\u0dc0 \u0d8b\u0d9c\u0db1\u0dca\u0db1\u0db4\u0dd4 \u0d85\u0dba\u0dd2\u0db1\u0dca\u0dc3\u0dca\u0da7\u0dba\u0dd2\u0db1\u0dca \u0dad\u0dd2\u0db6\u0dd6 \u0d85\u0db8\u0dad\u0d9a \u0dc0\u0dd3\u0db8\u0dda \u0dbb\u0ddd\u0d9c\u0dba"
},{
    "channelTitle": "Doctor kithsiri",
    "channelid": "Doctor Kithsiri",
    "contentDetails": {
        "caption": "false",
        "definition": "hd",
        "dimension": "2d",
        "duration": "PT29M33S",
        "licensedContent": false,
        "projection": "rectangular"
    },
    "country": "GB",
    "description": "\u0da0\u0db8\u0dbd\u0dca \u0dbb\u0dcf\u0da2\u0db4\u0d9a\u0dca\u0dc1 \u0d9a\u0dd8\u0dc2\u0dd2 \u0d8b\u0daf\u0dca\u200d\u0dba\u0db1\u0dba - \u0db6\u0da7\u0d85\u0dad.",
    "id": "IKYDxKzp44o",
    "publishedAt": "2019-08-29T12:05:34.000Z",
    "statistics": {
        "commentCount": "5",
        "dislikeCount": "0",
        "favoriteCount": "0",
        "likeCount": "20",
        "viewCount": "170"
    },
    "title": "\u0d94\u0db6 \u0daf\u0dbb\u0dd4\u0dc0\u0dad\u0dca \u0dc3\u0db8\u0d9c \u0dba\u0dcf \u0dba\u0dd4\u0dad\u0dd4\u0db8 \u0dad\u0dd0\u0db1 .... Bataatha farm - ambalanthota // Travel with kithsiri - Episode 3"
},{
    "channelTitle": "Siyatha FM",
    "channelid": "Siyatha FM",
    "contentDetails": {
        "caption": "false",
        "definition": "hd",
        "dimension": "2d",
        "duration": "PT10M43S",
        "licensedContent": true,
        "projection": "rectangular"
    },
    "country": "LK",
    "description": "\u0dc3\u0dd2\u0dba\u0dad FM - 98.2 | 98.4 Island-wide - \u0daf\u0dd0\u0db1\u0dca \u0d89\u0dad\u0dd2\u0db1\u0dca \u0dc3\u0dd2\u0dba\u0dad \u0dad\u0db8\u0dba\u0dd2 - Listen Live on http://www.siyathafm.lk - Like our Official Facebook Page: ...",
    "id": "a1xhuA0buJI",
    "publishedAt": "2019-07-04T01:42:05.000Z",
    "statistics": {
        "commentCount": "5",
        "dislikeCount": "3",
        "favoriteCount": "0",
        "likeCount": "90",
        "viewCount": "6147"
    },
    "title": "NIKAMATA WAGE | SIYATHA FM - 03 07 2019 | \u0daf\u0dd4\u0dc0 \u0dba\u0db1 \u0d9a\u0dca\u0dbd\u0dcf\u0dc3\u0dca \u0d91\u0d9a"
},{
    "channelTitle": "nipun kavinda",
    "channelid": "nipun kavinda",
    "contentDetails": {
        "caption": "false",
        "definition": "hd",
        "dimension": "2d",
        "duration": "PT8M45S",
        "licensedContent": false,
        "projection": "rectangular"
    },
    "country": "LK",
    "description": "\u0dbb\u0dd4\u0dc0\u0db1\u0dca\u0db4\u0dd4\u0dbb \u0da2\u0dcf\u0dad\u0dd2\u0d9a \u0d85\u0db0\u0dca\u200d\u0dba\u0dcf\u0db4\u0db1 \u0dc0\u0dd2\u0daf\u0dca\u200d\u0dba\u0dcf\u0db4\u0dd3\u0da8\u0dba\u0dda \u0db1\u0dcf\u0db8\u0dba \u0daf\u0dd2\u0daf\u0dd4\u0dc5\u0dc0\u0db8\u0dd2\u0db1\u0dca \u0dbb/\u0db4\u0dd4\u0dc3\u0dca\u0dc3\u0dd0\u0dbd\u0dca\u0dbd \u0db8\u0dc4 \u0dc0\u0dd2\u0daf...",
    "id": "5-RGnVWY3O8",
    "publishedAt": "2019-01-12T13:53:38.000Z",
    "statistics": {
        "commentCount": "0",
        "dislikeCount": "0",
        "favoriteCount": "0",
        "likeCount": "3",
        "viewCount": "279"
    },
    "title": "\u0d9c\u0dd0\u0db8\u0dd2 \u0d9c\u0dd9\u0daf\u0dbb(gami gedara) - \u0dbb\u0dd4\u0dc0\u0db1\u0dca\u0db4\u0dd4\u0dbb \u0da2\u0dcf\u0dad\u0dd2\u0d9a \u0d85\u0db0\u0dca\u200d\u0dba\u0dcf\u0db4\u0db1 \u0dc0\u0dd2\u0daf\u0dca\u200d\u0dba\u0dcf\u0db4\u0dd3\u0da8\u0dba\u0dda \u0db4\u0dca\u200d\u0dbb\u0dcf\u0dae\u0db8\u0dd2\u0d9a \u0d85\u0d82\u0dc1\u0dba\u0dda \u0dc0\u0dca\u200d\u0dba\u0dcf\u0db4\u0dd8\u0dad\u0dd2\u0dba\u0d9a\u0dd2"
},{
    "channelTitle": "Siyatha FM",
    "channelid": "Siyatha FM",
    "contentDetails": {
        "caption": "false",
        "definition": "hd",
        "dimension": "2d",
        "duration": "PT10M6S",
        "licensedContent": true,
        "projection": "rectangular"
    },
    "country": "LK",
    "description": "\u0dc3\u0dd2\u0dba\u0dad FM - 98.2 | 98.4 Island-wide - \u0daf\u0dd0\u0db1\u0dca \u0d89\u0dad\u0dd2\u0db1\u0dca \u0dc3\u0dd2\u0dba\u0dad \u0dad\u0db8\u0dba\u0dd2 - Listen Live on http://www.siyathafm.lk - Like our Official Facebook Page: ...",
    "id": "W19kt9PyZO4",
    "publishedAt": "2018-07-20T05:12:18.000Z",
    "statistics": {
        "commentCount": "1",
        "dislikeCount": "1",
        "favoriteCount": "0",
        "likeCount": "24",
        "viewCount": "2660"
    },
    "title": "NIKAMATA WAGE | SIYATHA FM - 19 07 2018 | \u0d85\u0dbd\u0dd4\u0dad\u0dca \u0db6\u0ddd\u0da9\u0dd2\u0db8\u0dda \u0dc0\u0dcf\u0dc3\u0dd2..."
},{
    "channelTitle": "Siyatha FM",
    "channelid": "Siyatha FM",
    "contentDetails": {
        "caption": "false",
        "definition": "hd",
        "dimension": "2d",
        "duration": "PT12M20S",
        "licensedContent": true,
        "projection": "rectangular"
    },
    "country": "LK",
    "description": "\u0dc3\u0dd2\u0dba\u0dad FM - 98.2 | 98.4 Island-wide - Listen Live on www.siyathafm.lk - Like our Official Facebook Page: www.siyathafm.lk/facebook.",
    "id": "D0tMmpfnc1Y",
    "publishedAt": "2017-11-10T11:30:00.000Z",
    "statistics": {
        "commentCount": "4",
        "dislikeCount": "1",
        "favoriteCount": "0",
        "likeCount": "20",
        "viewCount": "3310"
    },
    "title": "NIKAMATA WAGE | SIYATHA FM | \u0dc3\u0da4\u0dca\u0da4\u0d9a \u0dbd\u0dc0\u0dca"
},{
    "channelTitle": "Siyatha FM",
    "channelid": "Siyatha FM",
    "contentDetails": {
        "caption": "false",
        "definition": "hd",
        "dimension": "2d",
        "duration": "PT8M41S",
        "licensedContent": true,
        "projection": "rectangular"
    },
    "country": "LK",
    "description": "\u0dc3\u0dd2\u0dba\u0dad FM - 98.2 | 98.4 Island-wide - \u0daf\u0dd0\u0db1\u0dca \u0d89\u0dad\u0dd2\u0db1\u0dca \u0dc3\u0dd2\u0dba\u0dad \u0dad\u0db8\u0dba\u0dd2 - Listen Live on http://www.siyathafm.lk - Like our Official Facebook Page: ...",
    "id": "H73QohrDDSU",
    "publishedAt": "2018-08-30T05:52:16.000Z",
    "statistics": {
        "commentCount": "0",
        "dislikeCount": "0",
        "favoriteCount": "0",
        "likeCount": "11",
        "viewCount": "2036"
    },
    "title": "NIKAMATA WAGE | SIYATHA FM - 29 08 2018 | \u0db8\u0dd2\u0dc3\u0dca\u0da7\u0dbb\u0dca \u0dc3\u0db8\u0dbb\u0daf\u0dd2\u0dc0\u0dcf\u0d9a\u0dbb\u0d9c\u0dd9\u0db1\u0dca \u0dab\u0dba\u0d9a\u0dca..."
},{
    "channelTitle": "Siyatha FM",
    "channelid": "Siyatha FM",
    "contentDetails": {
        "caption": "false",
        "definition": "hd",
        "dimension": "2d",
        "duration": "PT16M16S",
        "licensedContent": true,
        "projection": "rectangular"
    },
    "country": "LK",
    "description": "\u0dc3\u0dd2\u0dba\u0dad FM - 98.2 | 98.4 Island-wide - Listen Live on www.siyathafm.lk - Like our Official Facebook Page: www.siyathafm.lk/facebook.",
    "id": "a6UbQg6EOLo",
    "publishedAt": "2017-10-17T06:00:48.000Z",
    "statistics": {
        "commentCount": "2",
        "dislikeCount": "2",
        "favoriteCount": "0",
        "likeCount": "22",
        "viewCount": "2256"
    },
    "title": "NIKAMATA WAGE | SIYATHA FM - 01 09 2017 | \u0dbb\u0da7\u0dda \u0dad\u0dad\u0dca\u0dc0\u0dda"
},{
    "channelTitle": "Siyatha FM",
    "channelid": "Siyatha FM",
    "contentDetails": {
        "caption": "false",
        "definition": "hd",
        "dimension": "2d",
        "duration": "PT2M33S",
        "licensedContent": true,
        "projection": "rectangular"
    },
    "country": "LK",
    "description": "\u0dc3\u0dd2\u0dba\u0dad FM - 98.2 | 98.4 Island-wide - \u0daf\u0dd0\u0db1\u0dca \u0d89\u0dad\u0dd2\u0db1\u0dca \u0dc3\u0dd2\u0dba\u0dad \u0dad\u0db8\u0dba\u0dd2 - Listen Live on http://www.siyathafm.lk - Like our Official Facebook Page: ...",
    "id": "UIcV5my-tqI",
    "publishedAt": "2018-07-31T08:28:02.000Z",
    "statistics": {
        "commentCount": "0",
        "dislikeCount": "0",
        "favoriteCount": "0",
        "likeCount": "11",
        "viewCount": "1017"
    },
    "title": "NIKAMATA WAGE | SIYATHA FM - 30 07 2018 | \u0d87\u0dbd\u0dca\u0db4\u0db6\u0da7\u0dca \u0d85\u0db1\u0dca\u0d9a\u0dbd\u0dca..."
},{
    "channelTitle": "Siyatha FM",
    "channelid": "Siyatha FM",
    "contentDetails": {
        "caption": "false",
        "definition": "hd",
        "dimension": "2d",
        "duration": "PT11M32S",
        "licensedContent": true,
        "projection": "rectangular"
    },
    "country": "LK",
    "description": "\u0dc3\u0dd2\u0dba\u0dad FM - 98.2 | 98.4 Island-wide - Listen Live on www.siyathafm.lk - Like our Official Facebook Page: www.siyathafm.lk/facebook.",
    "id": "IuZIdpVyTEo",
    "publishedAt": "2017-08-26T04:41:36.000Z",
    "statistics": {
        "commentCount": "1",
        "dislikeCount": "2",
        "favoriteCount": "0",
        "likeCount": "21",
        "viewCount": "2823"
    },
    "title": "NIKAMATA WAGE | SIYATHA FM - 01 08 2017 | \u0d85\u0dbd\u0dca\u0dbd\u0db4\u0dd4 \u0d9c\u0dd9\u0daf\u0dbb"
},{
    "channelTitle": "\u041e\u0440\u0435\u0441\u0442 H",
    "channelid": "\u041e\u0440\u0435\u0441\u0442 H",
    "contentDetails": {
        "caption": "false",
        "definition": "hd",
        "dimension": "2d",
        "duration": "PT1M59S",
        "licensedContent": true,
        "projection": "rectangular"
    },
    "country": "RU",
    "description": "\u0420\u0435\u0441\u0442\u0430\u0432\u0440\u0430\u0446\u0438\u044f \u043f\u0440\u043e\u0434\u043e\u043b\u044c\u043d\u043e\u0439 \u0442\u044f\u0433\u0438 \u043d\u0430\u0432\u0435\u0441\u043a\u0438 ,\u0442\u0440\u0430\u043a\u0442\u043e\u0440\u0430 \u0422 40 ,\u0442 25 \u041f\u043e\u0434\u043f\u0438\u0441\u044b\u0432\u0430\u0439\u0442\u0435\u0441\u044c \u043d\u0430 \u043d\u0430\u0448 \u043a\u0430\u043d\u0430\u043b \u0438 \u0432\u043c\u0435\u0441\u0442\u0435 \u0441 \u043d\u0430\u043c\u0438 \u0432\u044b \u0441\u043c\u043e\u0436\u0435\u0442...",
    "id": "OM2i_WlKDHg",
    "publishedAt": "2017-11-19T14:30:00.000Z",
    "statistics": {
        "commentCount": "0",
        "dislikeCount": "2",
        "favoriteCount": "0",
        "likeCount": "10",
        "viewCount": "3846"
    },
    "title": "\u0420\u0435\u0441\u0442\u0430\u0432\u0440\u0430\u0446\u0438\u044f \u043f\u0440\u043e\u0434\u043e\u043b\u044c\u043d\u043e\u0439 \u0442\u044f\u0433\u0438 \u043d\u0430\u0432\u0435\u0441\u043a\u0438 ,\u0442\u0440\u0430\u043a\u0442\u043e\u0440\u0430  \u0422 40 ,\u0442 25"
},{
    "channelTitle": "Hiru News",
    "channelid": "Hiru News",
    "contentDetails": {
        "caption": "false",
        "definition": "sd",
        "dimension": "2d",
        "duration": "PT3M1S",
        "licensedContent": false,
        "projection": "rectangular"
    },
    "country": "RU",
    "description": "\u0d86\u0dbb\u0dca\u0dae\u0dd2\u0d9a \u0dc3\u0d82\u0dc0\u0dbb\u0dca\u0db0\u0db1 \u0dc3\u0dc4 \u0d86\u0dba\u0ddd\u0da2\u0db1 \u0db4\u200d\u0dca\u200d\u0dbb\u0dc0\u0dbb\u0dca\u0db0\u0db1 \u0d85\u0db8\u0dcf\u0dad\u0dca\u200d\u0dba\u0dcf\u0d82\u0dc1\u0dc0\u0dbd \u0dc0\u0dd0\u0dba \u0dc1\u0dd3\u0dbb\u0dca\u0dc2 \u0d85\u0daf \u0db4\u0dcf\u0dbb\u0dca\u0dbd\u0dd2\u0db8\u0dda\u0db1\u0dca...",
    "id": "5qBZeJeTCKA",
    "publishedAt": "2013-12-04T15:36:43.000Z",
    "statistics": {
        "commentCount": "0",
        "dislikeCount": "0",
        "favoriteCount": "0",
        "likeCount": "0",
        "viewCount": "43"
    },
    "title": "\u0d86\u0dbb\u0dca\u0dae\u0dd2\u0d9a, \u0d86\u0dba\u0ddd\u0da2\u0db1 \u0db4\u200d\u0dca\u200d\u0dbb\u0dc0\u0dbb\u0dca\u0db0\u0db1 \u0d85\u0db8\u0dcf\u0dad\u0dca\u200d\u0dba\u0dcf\u0d82\u0dc1\u0dc0\u0dbd \u0dc0\u0dd0\u0dba \u0dc1\u0dd3\u0dbb\u0dca\u0dc2 \u0dc3\u0db8\u0dca\u0db8\u0dad\u0dba\u0dd2."
},{
    "channelTitle": "SIPYAYA",
    "channelid": "SIPYAYA",
    "contentDetails": {
        "caption": "false",
        "definition": "hd",
        "dimension": "2d",
        "duration": "PT7M10S",
        "licensedContent": false,
        "projection": "rectangular"
    },
    "country": "LK",
    "description": "\u0d85\u0db4\u0d9c\u0dd9 YouTube channel \u0d91\u0d9a subscribe \u0d9a\u0dbb\u0db1\u0dca\u0db1 \u0d85\u0db8\u0dad\u0d9a \u0d9a\u0dbb\u0db1\u0dca\u0db1 \u0d91\u0db4\u0dcf Please subscribe us https://www.youtube.com/channel/UCBCIwmeqxmGxeIjnmpoCECw ...",
    "id": "dKjTKpbFy-A",
    "publishedAt": "2019-04-11T03:48:02.000Z",
    "statistics": {
        "commentCount": "2",
        "dislikeCount": "1",
        "favoriteCount": "0",
        "likeCount": "9",
        "viewCount": "338"
    },
    "title": "mee tree in sri lanka"
},{
    "channelTitle": "Information and Communication Technology Agency of Sri Lanka",
    "channelid": "Information and Communication Technology Agency of Sri Lanka",
    "contentDetails": {
        "caption": "false",
        "definition": "hd",
        "dimension": "2d",
        "duration": "PT1M49S",
        "licensedContent": false,
        "projection": "rectangular"
    },
    "country": "LK",
    "description": "",
    "id": "Mptwp2Qkm2I",
    "publishedAt": "2013-06-27T11:12:08.000Z",
    "statistics": {
        "commentCount": "1",
        "dislikeCount": "0",
        "favoriteCount": "0",
        "likeCount": "4",
        "viewCount": "2261"
    },
    "title": "GOV.LK Intro"
}]