{
    "type": "single-tier",
    "mode": "normal",
    "platform": "aws",

    /*
    "maintenance_image": [
        ["architecture", ["x86_64"]],
        ["state", ["available"]],
        ["virtualization-type", ["hvm"]],
        ["root-device-type", ["ebs"]],
        ["name", [""]],
    ],
    */

    "machine": [
        ["instance-state-name", ["running"]],
        ["tag:Name", ["COV19 Logistica back PRE"]],
    ],

    "db_downtime_checker": "db_checker.sh",
    "db_operations": "db_migrator.sh",
    "ok_ko_checker_local": "ok_ko_checker_local.sh",
    "ok_ko_checker_remote": "ok_ko_checker_remote.sh",

    "image": [
        ["owner-id", ["031595934392"]],
        ["architecture", ["x86_64"]],
        ["state", ["available"]],
        ["virtualization-type", ["hvm"]],
        ["root-device-type", ["ebs"]],
        ["name", ["Core COV19 Backend PRE"]],
    ],

    "database": [
        ["db-instance-id", ["cov19-back-pre"]],
    ],

    "deploy_options": {
        "InstanceType": "t2.micro",
        "Monitoring": false,
        "CpuCredits": "standard",
    }
}
