<?xml version="1.0" encoding="UTF-8"?>
<svg width="34px" height="42px" viewBox="0 0 34 42" version="1.1" xmlns="http://www.w3.org/2000/svg" xmlns:xlink="http://www.w3.org/1999/xlink">
    <!-- Generator: Sketch 60.1 (88133) - https://sketch.com -->
    <title>Atoms / Map / Marker Copy 4</title>
    <desc>Created with Sketch.</desc>
    <g id="Website" stroke="none" stroke-width="1" fill="none" fill-rule="evenodd" stroke-linecap="round" stroke-linejoin="round">
        <g id="Landing-Page-/-logged-out-user" transform="translate(-764.000000, -730.000000)" fill="#0A6A84" stroke="#0A6A84">
            <g id="Map" transform="translate(0.000000, 257.000000)">
                <g id="Atoms-/-Map-/-Marker" transform="translate(764.000000, 463.249492)">
                    <g transform="translate(0.045455, 11.000000)" id="Combined-Shape">
                        <path d="M16.9545455,0 C25.7911014,0 32.9545455,7.14309316 32.9545455,15.9545452 C32.9545455,28.3636361 16.9545455,39 16.9545455,39 C16.9545455,39 0.954545455,28.3636361 0.954545455,15.9545452 C0.954545455,7.14309316 8.11798955,0 16.9545455,0 Z M16.9545455,10.6363634 C14.0090268,10.6363634 11.6212121,13.0173945 11.6212121,15.9545452 C11.6212121,18.8916959 14.0090268,21.272727 16.9545455,21.272727 C19.9000641,21.272727 22.2878788,18.8916959 22.2878788,15.9545452 C22.2878788,13.0173945 19.9000641,10.6363634 16.9545455,10.6363634 Z" stroke-width="2"></path>
                    </g>
                </g>
            </g>
        </g>
    </g>
</svg>