{
  "applications": "*",
  "changelogDate": "20230409182807",
  "dto": "no",
  "embedded": false,
  "entityTableName": "utilisateur",
  "fields": [
    {
      "fieldName": "role",
      "fieldType": "Role",
      "fieldValues": "Client,Societaire,DirecteurGeneral,Commercant,Coursier"
    },
    {
      "fieldName": "id",
      "fieldType": "Long",
      "fieldValidateRules": ["unique", "required"]
    },
    {
      "fieldName": "name",
      "fieldType": "String",
      "fieldValidateRules": ["required"]
    },
    {
      "fieldName": "adresse",
      "fieldType": "String",
      "fieldValidateRules": ["required"]
    },
    {
      "fieldName": "telephone",
      "fieldType": "String",
      "fieldValidateRules": ["required"]
    },
    {
      "fieldName": "mail",
      "fieldType": "String",
      "fieldValidateRules": ["required"]
    }
  ],
  "fluentMethods": true,
  "jpaMetamodelFiltering": false,
  "name": "Utilisateur",
  "pagination": "no",
  "readOnly": false,
  "relationships": [
    {
      "otherEntityName": "panier",
      "otherEntityRelationshipName": "utilisateur",
      "relationshipName": "panier",
      "relationshipType": "one-to-many"
    },
    {
      "otherEntityName": "coursier",
      "otherEntityRelationshipName": "utilisateur",
      "relationshipName": "coursier",
      "relationshipType": "one-to-many"
    },
    {
      "otherEntityName": "boutique",
      "otherEntityRelationshipName": "utilisateur",
      "relationshipName": "boutique",
      "relationshipType": "one-to-many"
    },
    {
      "otherEntityName": "cooperative",
      "otherEntityRelationshipName": "utilisateur",
      "ownerSide": true,
      "relationshipName": "cooperative",
      "relationshipType": "many-to-many"
    }
  ],
  "service": "no"
}
