20 20 20 20 20 20 20 20 20 20 20 20 20 20 20 20 20 20 20 20 20 20 20 20 21 20 20 20 20 20 20 20 20 20 20 20 20 21 20 20 20 20 20 20 20 20 20 20 20 20 
21 20 20 20 23 23 23 23 23 23 23 23 20 20 20 20 20 20 21 20 20 20 20 20 20 20 20 23 23 23 23 23 23 23 23 23 20 20 20 20 20 20 20 20 20 20 21 20 20 20 
20 20 23 23 38 38 38 38 38 38 38 38 23 23 23 23 23 20 20 20 20 20 20 23 23 23 23 38 38 38 38 38 38 38 38 38 23 23 23 23 23 20 20 20 20 20 20 20 20 20 
20 35 38 38 38 38 38 38 38 38 38 38 38 38 38 38 38 23 23 23 23 23 23 38 38 38 38 38 38 38 38 38 38 38 38 38 38 38 38 38 38 23 23 23 23 20 20 20 21 20 
20 35 38 38 38 38 38 10 10 10 38 38 38 38 38 38 38 38 38 38 38 38 38 38 10 38 10 10 10 10 10 10 10 10 10 10 10 10 38 38 38 38 38 38 38 23 23 20 20 20 
20 35 38 38 38 38 10 10 10 10 10 10 10 10 10 10 10 10 10 10 10 10 10 10 10 38 10 10 10 10 10 10 10 10 10 10 10 10 10 10 10 10 10 10 38 38 38 23 20 20 
20 35 38 38 38 38 10 10 10 10 10 10 10 10 10 10 10 10 10 10 10 10 10 10 10 38 38 38 38 38 38 38 38 38 38 38 38 38 38 38 38 38 10 10 10 38 38 38 32 20 
20 35 38 38 38 38 10 10 10 10 10 10 10 10 10 10 10 10 10 10 10 10 10 10 10 10 10 10 10 10 10 10 10 10 10 10 10 10 10 10 10 38 10 10 10 38 38 38 32 20 
20 35 38 38 38 10 10 10 10 10 10 10 10 10 10 10 10 10 10 10 10 10 10 10 10 10 10 10 10 38 38 38 38 38 38 38 38 38 38 38 38 38 10 10 10 38 38 38 32 20 
20 20 35 38 38 10 10 10 10 10 10 10 10 10 10 10 10 10 10 10 10 10 10 10 10 10 10 10 10 10 10 10 10 10 10 10 10 10 10 10 10 10 10 10 10 38 38 38 32 20 
20 20 35 38 38 10 10 10 10 10 10 10 10 10 10 10 10 10 10 10 10 10 10 10 10 10 10 10 10 10 10 10 10 10 10 10 10 10 10 10 10 10 10 10 38 38 38 32 20 20 
20 20 35 38 38 10 10 10 10 10 10 10 10 10 10 10 10 10 10 10 10 10 10 10 10 10 10 10 10 10 10 10 10 10 10 10 10 10 10 10 10 10 10 10 38 38 38 32 20 20 
20 21 35 38 38 38 10 10 10 10 10 10 10 10 10 10 10 10 10 38 18 18 18 18 18 18 18 18 18 18 18 18 10 10 10 10 10 10 10 10 10 10 10 10 38 38 38 32 20 20 
20 20 35 38 38 38 10 10 10 10 10 10 10 10 10 10 10 10 10 13 11 15 12 12 12 12 12 12 12 12 12 12 38 10 10 10 10 10 10 10 10 10 10 10 38 38 38 32 20 20 
20 20 35 38 38 38 38 10 10 10 10 10 10 10 10 10 10 10 10 13 11 16 10 10 10 10 10 10 10 10 10 38 38 38 38 38 38 38 38 38 38 38 38 38 38 38 32 20 20 20 
20 20 35 38 38 38 38 10 10 10 10 10 10 10 10 10 10 10 10 13 11 16 10 10 10 10 10 10 10 10 10 10 38 38 38 38 38 38 38 38 38 10 10 10 38 38 32 20 20 21 
20 20 20 35 38 38 38 10 10 10 10 10 10 10 10 10 10 10 10 13 11 16 10 10 10 10 10 10 10 10 10 10 10 10 10 10 10 10 10 10 10 10 10 10 38 38 32 20 20 20 
20 20 20 35 38 38 38 10 10 10 10 10 10 10 10 10 10 10 38 13 11 16 10 10 10 10 10 10 10 10 10 10 10 10 10 10 10 10 10 10 10 10 10 38 38 38 32 20 20 20 
20 20 20 20 35 38 38 38 38 38 10 10 10 10 10 10 10 10 38 13 11 16 10 10 10 10 10 10 10 10 10 10 10 10 10 10 10 10 10 10 10 10 10 38 38 32 20 20 20 20 
21 20 20 20 35 38 38 38 38 38 10 10 10 10 10 10 38 38 38 13 11 16 10 10 10 10 10 10 10 10 10 10 10 10 10 10 10 10 10 10 10 10 38 38 38 32 20 20 20 20 
20 20 20 20 35 38 38 38 38 38 38 38 38 38 38 38 38 38 38 13 11 16 10 10 10 10 10 10 10 10 10 10 10 10 10 10 10 10 10 10 10 10 38 38 38 32 20 20 20 20 
20 20 20 21 35 38 38 10 38 38 38 38 38 38 38 38 10 38 38 13 11 16 10 10 10 10 10 10 10 10 10 10 10 10 10 10 10 10 10 10 10 38 38 38 38 32 20 20 20 20 
20 20 20 20 35 38 38 10 38 38 38 38 38 38 38 38 10 10 38 13 11 16 10 10 10 10 10 10 10 10 10 10 10 10 10 10 10 10 10 38 38 38 38 38 38 32 20 20 21 20 
20 20 20 35 38 38 38 38 38 34 31 31 31 31 37 38 38 10 38 13 11 16 10 10 10 10 10 10 10 10 10 10 10 10 10 10 10 38 38 38 38 38 38 38 38 32 20 20 20 20 
20 21 20 35 38 38 38 38 38 32 20 20 20 20 35 38 38 38 38 13 11 16 38 38 38 38 38 38 38 38 38 38 38 38 38 38 38 38 38 38 38 10 38 38 38 32 20 20 20 20 
20 20 20 35 38 38 10 10 38 32 20 20 20 20 35 38 38 38 10 13 11 16 10 10 10 10 10 10 10 10 10 10 10 10 10 10 10 10 10 10 10 10 38 38 38 38 32 21 20 20 
20 20 20 35 38 38 38 38 38 32 20 20 20 20 35 38 38 38 38 13 11 16 10 10 10 10 10 10 10 10 10 10 10 10 10 10 10 10 10 10 10 10 10 10 38 38 32 20 20 20 
20 20 20 35 38 38 38 38 38 32 20 20 20 20 35 38 38 38 38 13 11 16 10 10 10 10 10 10 10 10 10 10 10 10 10 10 10 10 10 10 10 10 10 10 38 38 32 20 20 20 
20 20 35 38 38 38 38 38 38 32 20 20 20 20 35 38 38 38 38 13 11 16 10 10 10 10 10 10 10 10 10 10 10 10 10 10 10 10 10 10 10 10 10 10 10 38 32 20 20 20 
20 20 35 38 38 38 10 38 38 33 23 23 23 23 36 38 38 38 38 13 11 16 10 10 10 10 10 10 10 10 10 10 10 10 10 10 10 10 10 10 10 10 10 10 10 38 32 20 20 20 
21 20 35 38 38 38 38 38 38 38 38 38 38 38 38 38 38 10 38 13 11 16 10 38 10 10 10 10 10 10 10 10 10 10 10 10 10 10 10 10 10 10 10 10 38 38 32 20 20 20 
20 20 35 38 38 38 38 38 38 38 38 10 10 10 38 38 38 38 38 13 11 16 10 38 38 38 38 38 38 38 38 38 38 38 38 38 38 38 38 10 10 10 10 10 38 38 32 20 20 20 
20 20 35 38 38 38 38 18 18 18 18 18 18 18 18 18 18 18 18 17 11 14 18 18 18 18 18 18 18 38 38 38 38 38 38 38 38 38 38 38 38 38 38 38 38 38 32 20 20 20 
20 20 35 38 38 10 13 11 11 11 11 11 11 11 11 11 11 11 11 11 11 11 11 11 11 11 11 11 11 16 38 38 38 38 38 38 10 38 38 38 38 38 38 38 38 38 32 20 21 20 
20 21 35 38 38 38 13 11 15 12 12 12 12 12 12 12 12 12 12 12 12 12 12 12 12 12 12 19 11 16 38 38 38 38 38 38 10 10 10 38 38 10 38 38 38 38 32 20 20 20 
20 35 38 38 38 38 13 11 16 38 38 38 38 38 38 38 38 38 38 38 38 38 38 38 38 38 38 13 11 16 38 38 38 10 38 38 38 38 38 38 38 38 38 38 38 38 32 20 20 20 
20 35 38 38 38 38 13 11 16 38 38 10 38 38 38 38 38 38 38 38 38 38 38 38 38 38 38 13 11 16 38 38 38 38 38 38 38 38 38 38 38 38 38 38 10 38 38 32 20 20 
20 35 38 38 38 10 38 38 38 38 38 38 38 38 38 38 10 38 38 38 10 38 38 38 38 38 38 10 38 38 38 38 38 18 18 18 18 18 38 38 38 38 38 38 38 38 38 32 20 20 
35 38 38 38 38 38 38 38 38 38 38 38 38 38 38 38 38 38 38 38 10 38 38 10 10 38 38 38 38 38 10 38 13 11 11 11 11 11 16 38 38 38 38 38 38 38 38 32 20 20 
35 38 38 38 38 38 38 38 38 38 38 38 38 38 38 38 38 38 38 38 38 38 38 38 38 38 38 38 38 38 10 38 13 11 11 11 11 11 16 38 38 10 38 38 38 38 38 32 21 20 
35 38 38 10 38 38 38 10 38 38 38 10 38 38 38 38 38 38 38 38 38 38 38 38 38 38 38 38 38 38 38 38 13 11 11 11 11 11 16 10 38 38 38 38 38 38 38 32 20 20 
35 38 38 38 38 38 38 38 38 38 38 38 38 38 10 38 38 38 38 38 38 38 38 38 38 38 38 38 38 38 38 38 13 11 11 11 15 12 38 10 38 38 38 10 38 38 38 32 20 20 
35 38 38 38 38 38 38 38 38 38 38 38 38 38 38 38 38 38 10 10 38 38 38 10 38 38 10 38 38 38 38 38 13 11 11 11 16 10 10 10 38 38 38 10 38 38 38 32 20 20 
35 38 38 38 10 38 38 38 38 38 38 38 38 38 38 38 38 38 10 38 38 38 38 10 38 38 38 38 38 38 10 38 38 12 12 12 38 10 10 10 10 38 38 38 38 38 32 20 20 20 
20 31 38 38 10 10 38 38 38 38 38 38 38 38 38 38 38 38 38 38 38 38 38 38 38 38 38 38 38 38 38 38 38 38 38 38 38 38 38 38 38 38 38 38 38 38 32 20 20 20 
20 20 31 38 38 38 38 38 38 38 38 38 10 38 38 38 38 38 38 38 31 31 31 31 31 31 31 38 38 38 38 38 38 38 38 38 38 10 38 38 38 38 10 38 38 38 32 20 20 20 
20 20 20 31 31 38 38 38 38 38 38 38 38 38 38 38 38 38 38 31 20 20 20 21 20 20 20 31 31 31 31 31 31 38 38 38 38 38 38 38 38 38 38 38 38 38 32 20 20 20 
21 20 20 20 20 31 31 31 38 38 38 38 38 38 38 38 38 38 31 20 20 20 20 20 20 20 20 20 20 20 20 20 20 31 31 31 31 31 31 38 38 38 38 38 38 32 20 20 20 20 
20 20 20 20 20 21 20 20 31 31 31 31 31 31 31 31 31 31 20 20 20 20 20 20 20 20 20 20 20 20 20 20 20 20 20 20 20 20 20 31 31 31 31 31 31 20 20 21 20 20 
20 20 20 20 20 20 20 20 20 20 20 20 20 20 20 20 20 20 20 20 20 20 20 20 20 20 20 21 20 20 20 20 20 20 20 20 20 20 20 20 20 20 20 20 20 20 20 20 20 20 
