{
  "http-basic": {},
  "github-oauth": {
    "github.com": "5efbddf1ee914e3743e03c9296123cc56da6b900"},
  "gitlab-oauth": {
    "gitlab.recatch.tv": "a08e60d6b086d6f238e63ee9eb16cbaa40d9564b82d52009a6c154d530528efb"}
}
