{
  "annotations": {
    "list": [
      {
        "builtIn": 1,
        "datasource": "-- Grafana --",
        "enable": true,
        "hide": true,
        "iconColor": "rgba(0, 211, 255, 1)",
        "name": "Annotations & Alerts",
        "type": "dashboard"
      },
      {
        "datasource": "-- Grafana --",
        "enable": true,
        "hide": false,
        "iconColor": "#33cc33",
        "limit": 10,
        "name": "Host created / destroyed",
        "showIn": 0,
        "tags": [
          "frontend",
          "host"
        ],
        "type": "tags"
      },
      {
        "datasource": "-- Grafana --",
        "enable": true,
        "hide": false,
        "iconColor": "#e6e600",
        "limit": 10,
        "name": "Monitoring added / removed",
        "showIn": 0,
        "tags": [
          "frontend",
          "monitoring"
        ],
        "type": "tags"
      },
      {
        "datasource": "-- Grafana --",
        "enable": true,
        "hide": false,
        "iconColor": "#ff9933",
        "limit": 10,
        "name": "Load Tests",
        "showIn": 0,
        "tags": [
          "frontend",
          "loadtest"
        ],
        "type": "tags"
      },
      {
        "datasource": "-- Grafana --",
        "enable": true,
        "hide": false,
        "iconColor": "#8080ff",
        "limit": 10,
        "name": "Deployments",
        "showIn": 0,
        "tags": [
          "frontend",
          "deployment"
        ],
        "type": "tags"
      },
      {
        "datasource": "-- Grafana --",
        "enable": true,
        "hide": false,
        "iconColor": "#0099ff",
        "limit": 10,
        "name": "Content Import",
        "showIn": 0,
        "tags": [
          "frontend",
          "contentimport"
        ],
        "type": "tags"
      },
      {
        "datasource": "-- Grafana --",
        "enable": true,
        "hide": false,
        "iconColor": "#FFF899",
        "limit": 100,
        "matchAny": true,
        "name": "OOM",
        "showIn": 0,
        "tags": [
          "frontend",
          "oom"
        ],
        "type": "tags"
      }
    ]
  },
  "editable": true,
  "gnetId": null,
  "graphTooltip": 1,
  "id": 5,
  "iteration": 1577945174568,
  "links": [],
  "panels": [
    {
      "content": "<div style=\"text-align:center; font-weight:500; font-size: 1.65em; margin-top:5px\">Solr Master</div>",
      "datasource": null,
      "gridPos": {
        "h": 3,
        "w": 10,
        "x": 0,
        "y": 0
      },
      "id": 10,
      "mode": "html",
      "options": {},
      "title": "",
      "transparent": true,
      "type": "text"
    },
    {
      "content": "<div style=\"text-align:center; font-size: 1.65em; margin-top:5px\">\n<a style=\"text-decoration:none\" href=\"/grafana/d/frontend-java/frontend-java?var-Application=SOLR\">Java</a> /\n<a style=\"text-decoration:none\" href=\"/grafana/d/frontend-memory_pool/frontend-memory-pools?var-Application=SOLR\">Memory Pools</a>\n</div>",
      "datasource": null,
      "gridPos": {
        "h": 3,
        "w": 14,
        "x": 10,
        "y": 0
      },
      "id": 13,
      "mode": "html",
      "options": {},
      "title": "",
      "transparent": true,
      "type": "text"
    },
    {
      "aliasColors": {},
      "bars": false,
      "dashLength": 10,
      "dashes": false,
      "datasource": null,
      "decimals": 1,
      "editable": true,
      "error": false,
      "fill": 3,
      "fillGradient": 0,
      "grid": {},
      "gridPos": {
        "h": 5,
        "w": 24,
        "x": 0,
        "y": 3
      },
      "hiddenSeries": false,
      "id": 16,
      "isNew": true,
      "legend": {
        "alignAsTable": true,
        "avg": false,
        "current": true,
        "max": false,
        "min": false,
        "rightSide": true,
        "show": true,
        "total": false,
        "values": true
      },
      "lines": true,
      "linewidth": 1,
      "links": [],
      "nullPointMode": "connected",
      "options": {
        "dataLinks": []
      },
      "percentage": false,
      "pointradius": 5,
      "points": false,
      "renderer": "flot",
      "seriesOverrides": [
        {
          "alias": "cache hits",
          "yaxis": 2
        },
        {
          "alias": "cache hit ratio",
          "yaxis": 2
        }
      ],
      "spaceLength": 10,
      "stack": false,
      "steppedLine": false,
      "targets": [
        {
          "refId": "A",
          "target": "alias(graphyte.$host.SOLR.core_$core.CACHE.searcher.queryResultCache.size, 'cache size')",
          "textEditor": false
        },
        {
          "refId": "B",
          "target": "alias(graphyte.$host.SOLR.core_$core.CACHE.searcher.queryResultCache.hits, 'cache hits')",
          "textEditor": false
        },
        {
          "refId": "C",
          "target": "alias(graphyte.$host.SOLR.core_$core.CACHE.searcher.queryResultCache.hitratio, 'cache hit ratio')",
          "textEditor": false
        }
      ],
      "thresholds": [],
      "timeFrom": null,
      "timeRegions": [],
      "timeShift": null,
      "title": "Query Result Cache",
      "tooltip": {
        "msResolution": false,
        "shared": true,
        "sort": 0,
        "value_type": "cumulative"
      },
      "type": "graph",
      "xaxis": {
        "buckets": null,
        "mode": "time",
        "name": null,
        "show": true,
        "values": []
      },
      "yaxes": [
        {
          "format": "bytes",
          "label": null,
          "logBase": 1,
          "max": null,
          "min": 0,
          "show": true
        },
        {
          "format": "short",
          "label": null,
          "logBase": 1,
          "max": null,
          "min": 0,
          "show": true
        }
      ],
      "yaxis": {
        "align": false,
        "alignLevel": null
      }
    },
    {
      "aliasColors": {},
      "bars": false,
      "dashLength": 10,
      "dashes": false,
      "datasource": null,
      "decimals": 1,
      "editable": true,
      "error": false,
      "fill": 3,
      "fillGradient": 0,
      "grid": {},
      "gridPos": {
        "h": 5,
        "w": 24,
        "x": 0,
        "y": 8
      },
      "hiddenSeries": false,
      "id": 19,
      "isNew": true,
      "legend": {
        "alignAsTable": true,
        "avg": false,
        "current": true,
        "max": false,
        "min": false,
        "rightSide": true,
        "show": true,
        "total": false,
        "values": true
      },
      "lines": true,
      "linewidth": 1,
      "links": [],
      "nullPointMode": "connected",
      "options": {
        "dataLinks": []
      },
      "percentage": false,
      "pointradius": 5,
      "points": false,
      "renderer": "flot",
      "seriesOverrides": [
        {
          "alias": "cache hits",
          "yaxis": 2
        },
        {
          "alias": "cache hit ratio",
          "yaxis": 2
        }
      ],
      "spaceLength": 10,
      "stack": false,
      "steppedLine": false,
      "targets": [
        {
          "refId": "A",
          "target": "alias(graphyte.$host.SOLR.core_$core.CACHE.searcher.documentCache.size, 'cache size')",
          "textEditor": false
        },
        {
          "refId": "B",
          "target": "alias(graphyte.$host.SOLR.core_$core.CACHE.searcher.documentCache.hits, 'cache hits')",
          "textEditor": false
        },
        {
          "refId": "C",
          "target": "alias(graphyte.$host.SOLR.core_$core.CACHE.searcher.documentCache.hitratio, 'cache hit ratio')",
          "textEditor": false
        }
      ],
      "thresholds": [],
      "timeFrom": null,
      "timeRegions": [],
      "timeShift": null,
      "title": "Document Cache",
      "tooltip": {
        "msResolution": false,
        "shared": true,
        "sort": 0,
        "value_type": "cumulative"
      },
      "type": "graph",
      "xaxis": {
        "buckets": null,
        "mode": "time",
        "name": null,
        "show": true,
        "values": []
      },
      "yaxes": [
        {
          "format": "bytes",
          "label": null,
          "logBase": 1,
          "max": null,
          "min": 0,
          "show": true
        },
        {
          "format": "short",
          "label": null,
          "logBase": 1,
          "max": null,
          "min": 0,
          "show": true
        }
      ],
      "yaxis": {
        "align": false,
        "alignLevel": null
      }
    },
    {
      "aliasColors": {},
      "bars": false,
      "dashLength": 10,
      "dashes": false,
      "datasource": null,
      "decimals": 1,
      "editable": true,
      "error": false,
      "fill": 3,
      "fillGradient": 0,
      "grid": {},
      "gridPos": {
        "h": 5,
        "w": 24,
        "x": 0,
        "y": 13
      },
      "hiddenSeries": false,
      "id": 22,
      "isNew": true,
      "legend": {
        "alignAsTable": true,
        "avg": false,
        "current": true,
        "max": false,
        "min": false,
        "rightSide": true,
        "show": true,
        "total": false,
        "values": true
      },
      "lines": true,
      "linewidth": 1,
      "links": [],
      "nullPointMode": "connected",
      "options": {
        "dataLinks": []
      },
      "percentage": false,
      "pointradius": 5,
      "points": false,
      "renderer": "flot",
      "seriesOverrides": [],
      "spaceLength": 10,
      "stack": false,
      "steppedLine": false,
      "targets": [
        {
          "refId": "A",
          "target": "alias(graphyte.$host.SOLR.core_$core.INDEX.sizeInBytes, 'index size')",
          "textEditor": false
        }
      ],
      "thresholds": [],
      "timeFrom": null,
      "timeRegions": [],
      "timeShift": null,
      "title": "Index size",
      "tooltip": {
        "msResolution": false,
        "shared": true,
        "sort": 0,
        "value_type": "cumulative"
      },
      "type": "graph",
      "xaxis": {
        "buckets": null,
        "mode": "time",
        "name": null,
        "show": true,
        "values": []
      },
      "yaxes": [
        {
          "format": "bytes",
          "label": null,
          "logBase": 1,
          "max": null,
          "min": 0,
          "show": true
        },
        {
          "format": "short",
          "label": null,
          "logBase": 1,
          "max": null,
          "min": 0,
          "show": true
        }
      ],
      "yaxis": {
        "align": false,
        "alignLevel": null
      }
    }
  ],
  "refresh": "1m",
  "schemaVersion": 22,
  "style": "dark",
  "tags": [
    "frontend"
  ],
  "templating": {
    "list": [
      {
        "current": {
          "selected": false,
          "text": "frontend",
          "value": "frontend"
        },
        "hide": 2,
        "label": null,
        "name": "host",
        "options": [
          {
            "selected": true,
            "text": "frontend",
            "value": "frontend"
          }
        ],
        "query": "frontend",
        "skipUrlSync": false,
        "type": "constant",
        "value": "frontend"
      },
      {
        "allValue": null,
        "current": {
          "selected": true,
          "text": "live",
          "value": "live"
        },
        "datasource": "graphite",
        "definition": "",
        "hide": 0,
        "includeAll": false,
        "label": null,
        "multi": false,
        "name": "core",
        "options": [],
        "query": "graphyte.$host.SOLR*.*",
        "refresh": 1,
        "regex": "/.*core_(.*).*$/",
        "skipUrlSync": false,
        "sort": 0,
        "tagValuesQuery": null,
        "tags": [],
        "tagsQuery": null,
        "type": "query",
        "useTags": false
      }
    ]
  },
  "time": {
    "from": "now-6h",
    "to": "now/d"
  },
  "timepicker": {
    "now": true,
    "refresh_intervals": [
      "30s",
      "1m",
      "2m",
      "4m",
      "10m"
    ],
    "time_options": [
      "5m",
      "15m",
      "1h",
      "6h",
      "12h",
      "24h",
      "2d",
      "7d",
      "30d"
    ]
  },
  "timezone": "browser",
  "title": "frontend - Solr Master",
  "uid": "frontend-solr_master",
  "version": 5
}