{
  "annotations": {
    "list": [
      {
        "builtIn": 1,
        "datasource": {
          "type": "datasource",
          "uid": "grafana"
        },
        "enable": false,
        "hide": false,
        "iconColor": "rgba(0, 211, 255, 1)",
        "limit": 100,
        "name": "Annotations & Alerts",
        "showIn": 0,
        "target": {
          "limit": 100,
          "matchAny": false,
          "tags": [],
          "type": "dashboard"
        },
        "type": "dashboard"
      },
      {
        "datasource": {
          "type": "prometheus",
          "uid": "P1809F7CD0C75ACF3"
        },
        "enable": false,
        "expr": "resets(process_start_time_seconds{environment=\"$environment\"}[1m]) > 0",
        "iconColor": "rgba(255, 96, 96, 1)",
        "name": "Restart Detection",
        "showIn": 0,
        "step": "1m",
        "tagKeys": "restart-tag",
        "textFormat": "uptime reset",
        "titleFormat": "Restart",
        "useValueForTime": false
      },
      {
        "datasource": {
          "type": "datasource",
          "uid": "grafana"
        },
        "enable": false,
        "iconColor": "red",
        "name": "deployment",
        "target": {
          "limit": 10,
          "matchAny": false,
          "tags": [
            "deployment",
            "PROD"
          ],
          "type": "tags"
        }
      }
    ]
  },
  "description": "Nginx access log analytics dashboard",
  "editable": true,
  "fiscalYearStartMonth": 0,
  "gnetId": 13865,
  "graphTooltip": 1,
  "id": 50,
  "links": [],
  "liveNow": true,
  "panels": [
    {
      "datasource": {
        "type": "loki",
        "uid": "P982945308D3682D1"
      },
      "description": "",
      "fieldConfig": {
        "defaults": {
          "color": {
            "mode": "thresholds"
          },
          "mappings": [],
          "thresholds": {
            "mode": "absolute",
            "steps": [
              {
                "color": "light-blue",
                "value": null
              }
            ]
          },
          "unit": "short"
        },
        "overrides": []
      },
      "gridPos": {
        "h": 5,
        "w": 24,
        "x": 0,
        "y": 0
      },
      "id": 26,
      "options": {
        "colorMode": "background",
        "graphMode": "area",
        "justifyMode": "center",
        "orientation": "auto",
        "reduceOptions": {
          "calcs": [
            "sum"
          ],
          "fields": "",
          "values": false
        },
        "textMode": "value_and_name"
      },
      "pluginVersion": "9.5.2",
      "targets": [
        {
          "datasource": {
            "type": "loki",
            "uid": "P982945308D3682D1"
          },
          "editorMode": "code",
          "expr": "sum (\n  count_over_time(\n    {environment=\"$environment\", filename=\"$filename\"} | \n      json |\n        status =~ \"$status\" |      \n      __error__=\"\" [$__interval]\n  )\n) by (status) ",
          "legendFormat": "HTTP {{ status }}",
          "queryType": "range",
          "refId": "A"
        }
      ],
      "title": "Requests per status code",
      "transparent": true,
      "type": "stat"
    },
    {
      "collapsed": true,
      "gridPos": {
        "h": 1,
        "w": 24,
        "x": 0,
        "y": 5
      },
      "id": 30,
      "panels": [
        {
          "datasource": {
            "type": "loki",
            "uid": "P982945308D3682D1"
          },
          "description": "",
          "fieldConfig": {
            "defaults": {
              "color": {
                "mode": "thresholds"
              },
              "custom": {
                "align": "auto",
                "cellOptions": {
                  "type": "auto"
                },
                "inspect": false
              },
              "mappings": [],
              "thresholds": {
                "mode": "absolute",
                "steps": [
                  {
                    "color": "green",
                    "value": null
                  },
                  {
                    "color": "red",
                    "value": 80
                  }
                ]
              }
            },
            "overrides": [
              {
                "matcher": {
                  "id": "byName",
                  "options": "Requests"
                },
                "properties": [
                  {
                    "id": "custom.width",
                    "value": 300
                  },
                  {
                    "id": "custom.cellOptions",
                    "value": {
                      "mode": "gradient",
                      "type": "gauge"
                    }
                  },
                  {
                    "id": "color",
                    "value": {
                      "mode": "continuous-BlPu"
                    }
                  }
                ]
              }
            ]
          },
          "gridPos": {
            "h": 15,
            "w": 12,
            "x": 0,
            "y": 6
          },
          "id": 27,
          "options": {
            "cellHeight": "sm",
            "footer": {
              "countRows": false,
              "enablePagination": false,
              "fields": "",
              "reducer": [
                "sum"
              ],
              "show": true
            },
            "frameIndex": 5,
            "showHeader": true,
            "sortBy": [
              {
                "desc": true,
                "displayName": "Requests"
              }
            ]
          },
          "pluginVersion": "9.5.2",
          "targets": [
            {
              "datasource": {
                "type": "loki",
                "uid": "P982945308D3682D1"
              },
              "expr": "{environment=\"$environment\", filename=\"$filename\"}",
              "queryType": "range",
              "refId": "B"
            },
            {
              "datasource": {
                "type": "loki",
                "uid": "P982945308D3682D1"
              },
              "editorMode": "code",
              "expr": "topk(\n  20, sum by (http_user_agent) (\n    count_over_time(\n      {environment=\"$environment\", filename=\"$filename\"} | \n        json | \n          http_user_agent !~ \"Blackbox Exporter.*\" |\n          http_user_agent !~ \"Amazon-Route53-Health-Check-Service.*\" |\n        __error__= \"\" |~ \"$user_agent\" [$__interval]\n    )\n  )\n)",
              "legendFormat": "{{ http_user_agent }}",
              "queryType": "range",
              "refId": "A"
            }
          ],
          "title": "User agents",
          "transformations": [
            {
              "id": "reduce",
              "options": {
                "labelsToFields": false,
                "reducers": [
                  "sum"
                ]
              }
            },
            {
              "id": "organize",
              "options": {
                "excludeByName": {
                  "Field": false,
                  "Max": false,
                  "Total": false
                },
                "indexByName": {},
                "renameByName": {
                  "Field": "User Agent",
                  "Max": "",
                  "Total": "Requests"
                }
              }
            }
          ],
          "transparent": true,
          "type": "table"
        },
        {
          "datasource": {
            "type": "loki",
            "uid": "P982945308D3682D1"
          },
          "description": "",
          "fieldConfig": {
            "defaults": {
              "color": {
                "mode": "thresholds"
              },
              "custom": {
                "align": "auto",
                "cellOptions": {
                  "type": "auto"
                },
                "inspect": false
              },
              "mappings": [],
              "thresholds": {
                "mode": "absolute",
                "steps": [
                  {
                    "color": "green",
                    "value": null
                  },
                  {
                    "color": "red",
                    "value": 80
                  }
                ]
              }
            },
            "overrides": [
              {
                "matcher": {
                  "id": "byName",
                  "options": "Field"
                },
                "properties": [
                  {
                    "id": "custom.width",
                    "value": 748
                  }
                ]
              }
            ]
          },
          "gridPos": {
            "h": 15,
            "w": 12,
            "x": 12,
            "y": 6
          },
          "id": 28,
          "options": {
            "cellHeight": "sm",
            "footer": {
              "countRows": false,
              "enablePagination": false,
              "fields": "",
              "reducer": [
                "sum"
              ],
              "show": true
            },
            "frameIndex": 5,
            "showHeader": true,
            "sortBy": [
              {
                "desc": true,
                "displayName": "Total"
              }
            ]
          },
          "pluginVersion": "9.5.2",
          "targets": [
            {
              "datasource": {
                "type": "loki",
                "uid": "P982945308D3682D1"
              },
              "expr": "{environment=\"$environment\", filename=\"$filename\"}",
              "queryType": "range",
              "refId": "B"
            },
            {
              "datasource": {
                "type": "loki",
                "uid": "P982945308D3682D1"
              },
              "expr": "{environment=\"$environment\", filename=\"$filename\"}",
              "queryType": "range",
              "refId": "C"
            },
            {
              "datasource": {
                "type": "loki",
                "uid": "P982945308D3682D1"
              },
              "editorMode": "code",
              "expr": "sum by (http_user_agent) (\n    count_over_time(\n        {environment=\"$environment\", filename=\"$filename\"} | \n            json | \n            status =~ `$status` | \n            http_user_agent !~ \"Blackbox Exporter.*\" |\n            http_user_agent !~ \"Amazon-Route53-Health-Check-Service.*\"\n            [1m]\n    )\n)",
              "legendFormat": "{{ http_user_agent }}",
              "queryType": "range",
              "refId": "A"
            }
          ],
          "title": "User agents total",
          "transformations": [
            {
              "id": "reduce",
              "options": {
                "labelsToFields": false,
                "reducers": [
                  "sum"
                ]
              }
            },
            {
              "id": "organize",
              "options": {
                "excludeByName": {
                  "Field": false,
                  "Max": false,
                  "Total": false
                },
                "indexByName": {},
                "renameByName": {
                  "Field": "",
                  "Max": ""
                }
              }
            }
          ],
          "transparent": true,
          "type": "table"
        }
      ],
      "title": "User Agents",
      "type": "row"
    },
    {
      "collapsed": false,
      "datasource": {
        "type": "loki",
        "uid": "P982945308D3682D1"
      },
      "gridPos": {
        "h": 1,
        "w": 24,
        "x": 0,
        "y": 6
      },
      "id": 24,
      "panels": [],
      "targets": [
        {
          "datasource": {
            "type": "loki",
            "uid": "P982945308D3682D1"
          },
          "refId": "A"
        }
      ],
      "title": "Requests & HTTP Status",
      "type": "row"
    },
    {
      "datasource": {
        "type": "loki",
        "uid": "P982945308D3682D1"
      },
      "description": "",
      "gridPos": {
        "h": 15,
        "w": 24,
        "x": 0,
        "y": 7
      },
      "id": 11,
      "options": {
        "dedupStrategy": "exact",
        "enableLogDetails": true,
        "prettifyLogMessage": false,
        "showCommonLabels": false,
        "showLabels": false,
        "showTime": true,
        "sortOrder": "Descending",
        "wrapLogMessage": false
      },
      "targets": [
        {
          "datasource": {
            "type": "loki",
            "uid": "P982945308D3682D1"
          },
          "editorMode": "code",
          "expr": "{environment=\"$environment\", filename=\"$filename\"} | \n  json | \n    status =~ \"$status\" |  \n    line_format \"HTTP status: {{.status}}, instance: {{ .host }}, request for: {{.request_uri}} from: {{.remote_addr}}\"",
          "queryType": "range",
          "refId": "A"
        }
      ],
      "title": "Recent requests",
      "transparent": true,
      "type": "logs"
    }
  ],
  "refresh": "1m",
  "schemaVersion": 38,
  "style": "dark",
  "tags": [
    "Nginx",
    "PROD",
    "loki",
    "analytics"
  ],
  "templating": {
    "list": [
      {
        "hide": 2,
        "name": "environment",
        "query": "prod",
        "skipUrlSync": false,
        "type": "constant"
      },
      {
        "current": {
          "selected": false,
          "text": "/var/log/nginx/igbce.de/access.log",
          "value": "/var/log/nginx/igbce.de/access.log"
        },
        "datasource": {
          "type": "loki",
          "uid": "P982945308D3682D1"
        },
        "definition": "label_values({agent=\"promtail\",source=\"nginx\", environment=\"$environment\"}, filename)",
        "hide": 0,
        "includeAll": false,
        "label": "filename",
        "multi": false,
        "name": "filename",
        "options": [],
        "query": {
          "label": "filename",
          "refId": "LokiVariableQueryEditor-VariableQuery",
          "stream": "{agent=\"promtail\"}",
          "type": 1
        },
        "refresh": 2,
        "regex": "/.*access.log/",
        "skipUrlSync": false,
        "sort": 1,
        "tagValuesQuery": "",
        "tagsQuery": "",
        "type": "query",
        "useTags": false
      },
      {
        "current": {
          "selected": true,
          "text": [
            "All"
          ],
          "value": [
            "$__all"
          ]
        },
        "hide": 0,
        "includeAll": true,
        "label": "HTTP Status",
        "multi": true,
        "name": "status",
        "options": [
          {
            "selected": true,
            "text": "All",
            "value": "$__all"
          },
          {
            "selected": false,
            "text": "200",
            "value": "200"
          },
          {
            "selected": false,
            "text": "201",
            "value": "201"
          },
          {
            "selected": false,
            "text": "202",
            "value": "202"
          },
          {
            "selected": false,
            "text": "203",
            "value": "203"
          },
          {
            "selected": false,
            "text": "204",
            "value": "204"
          },
          {
            "selected": false,
            "text": "205",
            "value": "205"
          },
          {
            "selected": false,
            "text": "206",
            "value": "206"
          },
          {
            "selected": false,
            "text": "300",
            "value": "300"
          },
          {
            "selected": false,
            "text": "301",
            "value": "301"
          },
          {
            "selected": false,
            "text": "302",
            "value": "302"
          },
          {
            "selected": false,
            "text": "303",
            "value": "303"
          },
          {
            "selected": false,
            "text": "304",
            "value": "304"
          },
          {
            "selected": false,
            "text": "400",
            "value": "400"
          },
          {
            "selected": false,
            "text": "403",
            "value": "403"
          },
          {
            "selected": false,
            "text": "404",
            "value": "404"
          },
          {
            "selected": false,
            "text": "499",
            "value": "499"
          },
          {
            "selected": false,
            "text": "500",
            "value": "500"
          },
          {
            "selected": false,
            "text": "501",
            "value": "501"
          },
          {
            "selected": false,
            "text": "502",
            "value": "502"
          },
          {
            "selected": false,
            "text": "503",
            "value": "503"
          },
          {
            "selected": false,
            "text": "505",
            "value": "505"
          }
        ],
        "query": "200,201,202,203,204,205,206,300,301,302,303,304,400,403,404,499,500,501,502,503,505",
        "queryValue": "",
        "skipUrlSync": false,
        "type": "custom"
      },
      {
        "current": {
          "selected": false,
          "text": "",
          "value": ""
        },
        "hide": 0,
        "label": "User Agent",
        "name": "user_agent",
        "options": [
          {
            "selected": true,
            "text": "",
            "value": ""
          }
        ],
        "query": "",
        "skipUrlSync": false,
        "type": "textbox"
      }
    ]
  },
  "time": {
    "from": "now-1h",
    "to": "now"
  },
  "timepicker": {
    "refresh_intervals": [
      "10s",
      "30s",
      "1m",
      "5m",
      "15m",
      "30m",
      "1h",
      "2h",
      "1d"
    ]
  },
  "timezone": "Europe/Berlin",
  "title": "PROD - NGINX - HTTP Status analytics",
  "uid": "prod-analytics",
  "version": 9,
  "weekStart": ""
}
