{
  "annotations": {
    "list": [
      {
        "builtIn": 1,
        "datasource": "-- Grafana --",
        "enable": true,
        "hide": true,
        "iconColor": "rgba(0, 211, 255, 1)",
        "name": "Annotations & Alerts",
        "type": "dashboard"
      },
      {
        "datasource": "-- Grafana --",
        "enable": true,
        "hide": false,
        "iconColor": "#33cc33",
        "limit": 10,
        "name": "Host created / destroyed",
        "showIn": 0,
        "tags": [
          "backend",
          "host"
        ],
        "type": "tags"
      },
      {
        "datasource": "-- Grafana --",
        "enable": true,
        "hide": false,
        "iconColor": "#e6e600",
        "limit": 10,
        "name": "Monitoring added / removed",
        "showIn": 0,
        "tags": [
          "backend",
          "monitoring"
        ],
        "type": "tags"
      },
      {
        "datasource": "-- Grafana --",
        "enable": true,
        "hide": false,
        "iconColor": "#ff9933",
        "limit": 10,
        "name": "Load Tests",
        "showIn": 0,
        "tags": [
          "backend",
          "loadtest"
        ],
        "type": "tags"
      },
      {
        "datasource": "-- Grafana --",
        "enable": true,
        "hide": false,
        "iconColor": "#8080ff",
        "limit": 10,
        "name": "Deployments",
        "showIn": 0,
        "tags": [
          "backend",
          "deployment"
        ],
        "type": "tags"
      },
      {
        "datasource": "-- Grafana --",
        "enable": true,
        "hide": false,
        "iconColor": "#0099ff",
        "limit": 10,
        "name": "Content Import",
        "showIn": 0,
        "tags": [
          "backend",
          "contentimport"
        ],
        "type": "tags"
      },
      {
        "datasource": "-- Grafana --",
        "enable": true,
        "hide": false,
        "iconColor": "#FFF899",
        "limit": 100,
        "matchAny": true,
        "name": "OOM",
        "showIn": 0,
        "tags": [
          "backend",
          "oom"
        ],
        "type": "tags"
      }
    ]
  },
  "editable": true,
  "gnetId": null,
  "graphTooltip": 1,
  "id": 9,
  "iteration": 1577945221504,
  "links": [],
  "panels": [
    {
      "content": "<div style=\"text-align:center; font-weight:500; font-size: 1.65em; margin-top:5px\">User Changes</br>",
      "datasource": null,
      "gridPos": {
        "h": 2,
        "w": 12,
        "x": 0,
        "y": 0
      },
      "id": 10,
      "mode": "html",
      "options": {},
      "title": "",
      "transparent": true,
      "type": "text"
    },
    {
      "content": "<div style=\"text-align:center; font-size: 1.65em; margin-top:5px\">\n<a style=\"text-decoration:none\" href=\"/grafana/d/backend-java/backend-java?var-Application=USER_CHANGES\">Java</a> / \n<a style=\"text-decoration:none\" href=\"/grafana/d/backend-memory_pool/backend-memory-pools?var-Application=USER_CHANGES\">Memory Pools</a>\n</div>",
      "datasource": null,
      "gridPos": {
        "h": 2,
        "w": 12,
        "x": 12,
        "y": 0
      },
      "id": 13,
      "mode": "html",
      "options": {},
      "title": "",
      "transparent": true,
      "type": "text"
    },
    {
      "aliasColors": {},
      "bars": false,
      "dashLength": 10,
      "dashes": false,
      "datasource": "graphite",
      "decimals": 1,
      "editable": true,
      "error": false,
      "fill": 3,
      "fillGradient": 0,
      "grid": {},
      "gridPos": {
        "h": 5,
        "w": 24,
        "x": 0,
        "y": 3
      },
      "hiddenSeries": false,
      "id": 16,
      "isNew": true,
      "legend": {
        "alignAsTable": true,
        "avg": false,
        "current": true,
        "max": false,
        "min": false,
        "rightSide": true,
        "show": true,
        "total": false,
        "values": true
      },
      "lines": true,
      "linewidth": 1,
      "links": [],
      "nullPointMode": "connected",
      "options": {
        "dataLinks": []
      },
      "percentage": false,
      "pointradius": 5,
      "points": false,
      "renderer": "flot",
      "seriesOverrides": [
        {
          "alias": "percent",
          "color": "#BF1B00",
          "yaxis": 2
        }
      ],
      "spaceLength": 10,
      "stack": false,
      "steppedLine": false,
      "targets": [
        {
          "refId": "A",
          "target": "alias(aliasSub(graphyte.$host.USER_CHANGES.CapConnection.heap.cache.size, '(.*)-', ''), 'max')",
          "textEditor": false
        },
        {
          "refId": "B",
          "target": "alias(aliasSub(graphyte.$host.USER_CHANGES.CapConnection.heap.cache.used, '(.*)-', ''), 'used')",
          "textEditor": false
        },
        {
          "refId": "C",
          "target": "alias(graphyte.$host.USER_CHANGES.CapConnection.heap.cache.used_percent, 'percent')",
          "textEditor": false
        }
      ],
      "thresholds": [],
      "timeFrom": null,
      "timeRegions": [],
      "timeShift": null,
      "title": "UAPI Cache",
      "tooltip": {
        "msResolution": false,
        "ordering": "alphabetical",
        "shared": true,
        "sort": 0,
        "value_type": "cumulative"
      },
      "type": "graph",
      "xaxis": {
        "buckets": null,
        "mode": "time",
        "name": null,
        "show": true,
        "values": []
      },
      "yaxes": [
        {
          "format": "bytes",
          "label": null,
          "logBase": 1,
          "max": null,
          "min": 0,
          "show": true
        },
        {
          "format": "none",
          "label": "percent",
          "logBase": 1,
          "max": "110",
          "min": null,
          "show": true
        }
      ],
      "yaxis": {
        "align": false,
        "alignLevel": null
      }
    },
    {
      "aliasColors": {},
      "bars": false,
      "dashLength": 10,
      "dashes": false,
      "datasource": "graphite",
      "decimals": 1,
      "editable": true,
      "error": false,
      "fill": 3,
      "fillGradient": 0,
      "grid": {},
      "gridPos": {
        "h": 5,
        "w": 24,
        "x": 0,
        "y": 7
      },
      "hiddenSeries": false,
      "id": 19,
      "isNew": true,
      "legend": {
        "alignAsTable": true,
        "avg": false,
        "current": true,
        "max": false,
        "min": false,
        "rightSide": true,
        "show": true,
        "total": false,
        "values": true
      },
      "lines": true,
      "linewidth": 1,
      "links": [],
      "nullPointMode": "connected",
      "options": {
        "dataLinks": []
      },
      "percentage": false,
      "pointradius": 5,
      "points": false,
      "renderer": "flot",
      "seriesOverrides": [
        {
          "alias": "percent",
          "color": "#BF1B00",
          "yaxis": 2
        }
      ],
      "spaceLength": 10,
      "stack": false,
      "steppedLine": false,
      "targets": [
        {
          "refId": "B",
          "target": "alias(graphyte.$host.USER_CHANGES.CapConnection.blob.cache.size, 'max')",
          "textEditor": false
        },
        {
          "refId": "A",
          "target": "alias(graphyte.$host.USER_CHANGES.CapConnection.blob.cache.used, 'used')",
          "textEditor": false
        },
        {
          "refId": "C",
          "target": "alias(graphyte.$host.USER_CHANGES.CapConnection.blob.cache.used_percent, 'percent')",
          "textEditor": false
        }
      ],
      "thresholds": [],
      "timeFrom": null,
      "timeRegions": [],
      "timeShift": null,
      "title": "BlobCache",
      "tooltip": {
        "msResolution": false,
        "ordering": "alphabetical",
        "shared": true,
        "sort": 0,
        "value_type": "cumulative"
      },
      "type": "graph",
      "xaxis": {
        "buckets": null,
        "mode": "time",
        "name": null,
        "show": true,
        "values": []
      },
      "yaxes": [
        {
          "format": "bytes",
          "logBase": 1,
          "max": null,
          "min": null,
          "show": true
        },
        {
          "format": "none",
          "label": "percent",
          "logBase": 1,
          "max": "110",
          "min": null,
          "show": true
        }
      ],
      "yaxis": {
        "align": false,
        "alignLevel": null
      }
    }
  ],
  "refresh": "1m",
  "schemaVersion": 22,
  "style": "dark",
  "tags": [
    "backend"
  ],
  "templating": {
    "list": [
      {
        "current": {
          "selected": false,
          "text": "backend",
          "value": "backend"
        },
        "hide": 2,
        "label": null,
        "name": "host",
        "options": [
          {
            "selected": true,
            "text": "backend",
            "value": "backend"
          }
        ],
        "query": "backend",
        "skipUrlSync": false,
        "type": "constant",
        "value": "backend"
      }
    ]
  },
  "time": {
    "from": "now-6h",
    "to": "now/d"
  },
  "timepicker": {
    "now": true,
    "refresh_intervals": [
      "30s",
      "1m",
      "2m",
      "4m",
      "10m"
    ],
    "time_options": [
      "5m",
      "15m",
      "1h",
      "6h",
      "12h",
      "24h",
      "2d",
      "7d",
      "30d"
    ]
  },
  "timezone": "browser",
  "title": "backend - User Changes",
  "uid": "backend-user_changes",
  "version": 1
}