{
  "annotations": {
    "list": [
      {
        "builtIn": 1,
        "datasource": "-- Grafana --",
        "enable": true,
        "hide": true,
        "iconColor": "rgba(0, 211, 255, 1)",
        "name": "Annotations & Alerts",
        "type": "dashboard"
      },
      {
        "datasource": "-- Grafana --",
        "enable": true,
        "hide": false,
        "iconColor": "#33cc33",
        "limit": 10,
        "name": "Host created / destroyed",
        "showIn": 0,
        "tags": [
          "backend",
          "host"
        ],
        "type": "tags"
      },
      {
        "datasource": "-- Grafana --",
        "enable": true,
        "hide": false,
        "iconColor": "#e6e600",
        "limit": 10,
        "name": "Monitoring added / removed",
        "showIn": 0,
        "tags": [
          "backend",
          "monitoring"
        ],
        "type": "tags"
      },
      {
        "datasource": "-- Grafana --",
        "enable": true,
        "hide": false,
        "iconColor": "#ff9933",
        "limit": 10,
        "name": "Load Tests",
        "showIn": 0,
        "tags": [
          "backend",
          "loadtest"
        ],
        "type": "tags"
      },
      {
        "datasource": "-- Grafana --",
        "enable": true,
        "hide": false,
        "iconColor": "#8080ff",
        "limit": 10,
        "name": "Deployments",
        "showIn": 0,
        "tags": [
          "backend",
          "deployment"
        ],
        "type": "tags"
      },
      {
        "datasource": "-- Grafana --",
        "enable": true,
        "hide": false,
        "iconColor": "#0099ff",
        "limit": 10,
        "name": "Content Import",
        "showIn": 0,
        "tags": [
          "backend",
          "contentimport"
        ],
        "type": "tags"
      },
      {
        "datasource": "-- Grafana --",
        "enable": true,
        "hide": false,
        "iconColor": "#FFF899",
        "limit": 100,
        "matchAny": true,
        "name": "OOM",
        "showIn": 0,
        "tags": [
          "backend",
          "oom"
        ],
        "type": "tags"
      }
    ]
  },
  "editable": true,
  "gnetId": null,
  "graphTooltip": 0,
  "id": 134,
  "iteration": 1580997682066,
  "links": [],
  "panels": [
    {
      "aliasColors": {},
      "bars": false,
      "dashLength": 10,
      "dashes": false,
      "datasource": null,
      "fill": 2,
      "fillGradient": 0,
      "gridPos": {
        "h": 6,
        "w": 24,
        "x": 0,
        "y": 0
      },
      "hiddenSeries": false,
      "id": 10,
      "legend": {
        "alignAsTable": true,
        "avg": false,
        "current": true,
        "max": false,
        "min": false,
        "rightSide": true,
        "show": true,
        "total": false,
        "values": true
      },
      "lines": true,
      "linewidth": 1,
      "nullPointMode": "connected",
      "options": {
        "dataLinks": []
      },
      "percentage": false,
      "pointradius": 2,
      "points": false,
      "renderer": "flot",
      "seriesOverrides": [],
      "spaceLength": 10,
      "stack": false,
      "steppedLine": false,
      "targets": [
        {
          "hide": false,
          "refCount": 0,
          "refId": "A",
          "target": "alias(perSecond(graphyte.$host.NGINX.server.requests), 'total')"
        },
        {
          "refCount": 0,
          "refId": "B",
          "target": "alias(perSecond(graphyte.$host.NGINX.server.requests_accepted), 'accepted')"
        },
        {
          "refCount": 0,
          "refId": "C",
          "target": "alias(perSecond(graphyte.$host.NGINX.server.requests_handled), 'handled')"
        }
      ],
      "thresholds": [],
      "timeFrom": null,
      "timeRegions": [],
      "timeShift": null,
      "title": "requests",
      "tooltip": {
        "shared": true,
        "sort": 0,
        "value_type": "individual"
      },
      "type": "graph",
      "xaxis": {
        "buckets": null,
        "mode": "time",
        "name": null,
        "show": true,
        "values": []
      },
      "yaxes": [
        {
          "decimals": 0,
          "format": "none",
          "label": null,
          "logBase": 1,
          "max": null,
          "min": null,
          "show": true
        },
        {
          "format": "short",
          "label": null,
          "logBase": 1,
          "max": null,
          "min": null,
          "show": true
        }
      ],
      "yaxis": {
        "align": false,
        "alignLevel": null
      }
    },
    {
      "aliasColors": {},
      "bars": false,
      "dashLength": 10,
      "dashes": false,
      "datasource": null,
      "decimals": 0,
      "fill": 3,
      "fillGradient": 0,
      "gridPos": {
        "h": 6,
        "w": 24,
        "x": 0,
        "y": 6
      },
      "hiddenSeries": false,
      "id": 13,
      "legend": {
        "alignAsTable": true,
        "avg": false,
        "current": true,
        "max": false,
        "min": false,
        "rightSide": true,
        "show": true,
        "total": false,
        "values": true
      },
      "lines": true,
      "linewidth": 1,
      "nullPointMode": "connected",
      "options": {
        "dataLinks": []
      },
      "percentage": false,
      "pointradius": 2,
      "points": false,
      "renderer": "flot",
      "seriesOverrides": [],
      "spaceLength": 10,
      "stack": false,
      "steppedLine": false,
      "targets": [
        {
          "refId": "A",
          "target": "aliasByMetric(graphyte.$host.NGINX.connections.*)"
        }
      ],
      "thresholds": [],
      "timeFrom": null,
      "timeRegions": [],
      "timeShift": null,
      "title": "connections",
      "tooltip": {
        "shared": true,
        "sort": 0,
        "value_type": "individual"
      },
      "type": "graph",
      "xaxis": {
        "buckets": null,
        "mode": "time",
        "name": null,
        "show": true,
        "values": []
      },
      "yaxes": [
        {
          "format": "short",
          "label": null,
          "logBase": 1,
          "max": null,
          "min": null,
          "show": true
        },
        {
          "format": "short",
          "label": null,
          "logBase": 1,
          "max": null,
          "min": null,
          "show": true
        }
      ],
      "yaxis": {
        "align": false,
        "alignLevel": null
      }
    }
  ],
  "refresh": "1m",
  "schemaVersion": 22,
  "style": "dark",
  "tags": [
    "backend",
    "nginx"
  ],
  "templating": {
    "list": [
      {
        "current": {
          "selected": false,
          "text": "backend",
          "value": "backend"
        },
        "hide": 2,
        "label": null,
        "name": "host",
        "options": [
          {
            "selected": true,
            "text": "backend",
            "value": "backend"
          }
        ],
        "query": "backend",
        "skipUrlSync": false,
        "type": "constant"
      }
    ]
  },
  "time": {
    "from": "now-6h",
    "to": "now/d"
  },
  "timepicker": {
    "refresh_intervals": [
      "5s",
      "10s",
      "30s",
      "1m",
      "5m",
      "15m",
      "30m",
      "1h",
      "2h",
      "1d"
    ]
  },
  "timezone": "browser",
  "title": "backend - Nginx",
  "uid": "backend-nginx",
  "version": 2
}