{
  "annotations": {
    "list": [
      {
        "builtIn": 1,
        "datasource": "-- Grafana --",
        "enable": true,
        "hide": true,
        "iconColor": "rgba(0, 211, 255, 1)",
        "name": "Annotations & Alerts",
        "type": "dashboard"
      },
      {
        "datasource": "-- Grafana --",
        "enable": true,
        "hide": false,
        "iconColor": "#33cc33",
        "limit": 10,
        "name": "Host created / destroyed",
        "showIn": 0,
        "tags": [
          "backend",
          "host"
        ],
        "type": "tags"
      },
      {
        "datasource": "-- Grafana --",
        "enable": true,
        "hide": false,
        "iconColor": "#e6e600",
        "limit": 10,
        "name": "Monitoring added / removed",
        "showIn": 0,
        "tags": [
          "backend",
          "monitoring"
        ],
        "type": "tags"
      },
      {
        "datasource": "-- Grafana --",
        "enable": true,
        "hide": false,
        "iconColor": "#ff9933",
        "limit": 10,
        "name": "Load Tests",
        "showIn": 0,
        "tags": [
          "backend",
          "loadtest"
        ],
        "type": "tags"
      },
      {
        "datasource": "-- Grafana --",
        "enable": true,
        "hide": false,
        "iconColor": "#8080ff",
        "limit": 10,
        "name": "Deployments",
        "showIn": 0,
        "tags": [
          "backend",
          "deployment"
        ],
        "type": "tags"
      },
      {
        "datasource": "-- Grafana --",
        "enable": true,
        "hide": false,
        "iconColor": "#0099ff",
        "limit": 10,
        "name": "Content Import",
        "showIn": 0,
        "tags": [
          "backend",
          "contentimport"
        ],
        "type": "tags"
      },
      {
        "datasource": "-- Grafana --",
        "enable": true,
        "hide": false,
        "iconColor": "#FFF899",
        "limit": 100,
        "matchAny": true,
        "name": "OOM",
        "showIn": 0,
        "tags": [
          "backend",
          "oom"
        ],
        "type": "tags"
      }
    ]
  },
  "editable": true,
  "gnetId": null,
  "graphTooltip": 0,
  "id": 140,
  "iteration": 1581417680703,
  "links": [],
  "panels": [
    {
      "aliasColors": {},
      "bars": false,
      "dashLength": 10,
      "dashes": false,
      "datasource": null,
      "fill": 1,
      "fillGradient": 0,
      "gridPos": {
        "h": 7,
        "w": 12,
        "x": 0,
        "y": 0
      },
      "hiddenSeries": false,
      "id": 10,
      "legend": {
        "alignAsTable": true,
        "avg": false,
        "current": true,
        "max": false,
        "min": false,
        "rightSide": true,
        "show": true,
        "total": false,
        "values": true
      },
      "lines": true,
      "linewidth": 1,
      "nullPointMode": "connected",
      "options": {
        "dataLinks": []
      },
      "percentage": false,
      "pointradius": 2,
      "points": false,
      "renderer": "flot",
      "seriesOverrides": [],
      "spaceLength": 10,
      "stack": false,
      "steppedLine": false,
      "targets": [
        {
          "refCount": 0,
          "refId": "B",
          "target": "alias(graphyte.$host.OPERATING_SYSTEM.load.1min, 'short term')",
          "textEditor": false
        },
        {
          "refCount": 0,
          "refId": "C",
          "target": "alias(graphyte.$host.OPERATING_SYSTEM.load.5min, 'mid term')",
          "textEditor": false
        },
        {
          "refCount": 0,
          "refId": "D",
          "target": "alias(graphyte.$host.OPERATING_SYSTEM.load.15min, 'long term')",
          "textEditor": false
        }
      ],
      "thresholds": [],
      "timeFrom": null,
      "timeRegions": [],
      "timeShift": null,
      "title": "CPU load",
      "tooltip": {
        "shared": true,
        "sort": 0,
        "value_type": "individual"
      },
      "type": "graph",
      "xaxis": {
        "buckets": null,
        "mode": "time",
        "name": null,
        "show": true,
        "values": []
      },
      "yaxes": [
        {
          "format": "none",
          "label": null,
          "logBase": 1,
          "max": null,
          "min": null,
          "show": true
        },
        {
          "format": "short",
          "label": null,
          "logBase": 1,
          "max": null,
          "min": null,
          "show": true
        }
      ],
      "yaxis": {
        "align": false,
        "alignLevel": null
      }
    },
    {
      "aliasColors": {},
      "bars": false,
      "dashLength": 10,
      "dashes": false,
      "datasource": null,
      "fill": 1,
      "fillGradient": 0,
      "gridPos": {
        "h": 7,
        "w": 12,
        "x": 12,
        "y": 0
      },
      "hiddenSeries": false,
      "id": 13,
      "legend": {
        "alignAsTable": true,
        "avg": false,
        "current": true,
        "max": false,
        "min": false,
        "rightSide": true,
        "show": true,
        "total": false,
        "values": true
      },
      "lines": true,
      "linewidth": 1,
      "nullPointMode": "connected",
      "options": {
        "dataLinks": []
      },
      "percentage": false,
      "pointradius": 2,
      "points": false,
      "renderer": "flot",
      "seriesOverrides": [],
      "spaceLength": 10,
      "stack": false,
      "steppedLine": false,
      "targets": [
        {
          "refCount": 0,
          "refId": "D",
          "target": "aliasByNode(summarize(graphyte.$host.OPERATING_SYSTEM.cpu_{0,1,2,3,4,5,6,7,8,9}.percent_usage, '2m', 'last', false), 3)",
          "textEditor": false
        }
      ],
      "thresholds": [],
      "timeFrom": null,
      "timeRegions": [],
      "timeShift": null,
      "title": "CPU  usage per Core",
      "tooltip": {
        "shared": true,
        "sort": 0,
        "value_type": "individual"
      },
      "type": "graph",
      "xaxis": {
        "buckets": null,
        "mode": "time",
        "name": null,
        "show": true,
        "values": []
      },
      "yaxes": [
        {
          "format": "percent",
          "label": null,
          "logBase": 1,
          "max": null,
          "min": null,
          "show": true
        },
        {
          "format": "short",
          "label": null,
          "logBase": 1,
          "max": null,
          "min": null,
          "show": true
        }
      ],
      "yaxis": {
        "align": false,
        "alignLevel": null
      }
    },
    {
      "aliasColors": {},
      "bars": false,
      "dashLength": 10,
      "dashes": false,
      "datasource": null,
      "fill": 1,
      "fillGradient": 0,
      "gridPos": {
        "h": 7,
        "w": 12,
        "x": 0,
        "y": 7
      },
      "hiddenSeries": false,
      "id": 16,
      "legend": {
        "alignAsTable": true,
        "avg": false,
        "current": true,
        "max": false,
        "min": false,
        "rightSide": true,
        "show": true,
        "total": false,
        "values": true
      },
      "lines": true,
      "linewidth": 1,
      "maxPerRow": 2,
      "nullPointMode": "connected",
      "options": {
        "dataLinks": []
      },
      "percentage": false,
      "pointradius": 2,
      "points": false,
      "renderer": "flot",
      "repeat": "cpu_times",
      "repeatDirection": "h",
      "scopedVars": {
        "cpu_times": {
          "selected": false,
          "text": "idle",
          "value": "idle"
        }
      },
      "seriesOverrides": [],
      "spaceLength": 10,
      "stack": false,
      "steppedLine": false,
      "targets": [
        {
          "refCount": 0,
          "refId": "D",
          "target": "aliasByNode(perSecond(graphyte.$host.OPERATING_SYSTEM.cpu_{0,1,2,3,4,5,6,7,8,9}.times.$cpu_times), 3)",
          "textEditor": false
        }
      ],
      "thresholds": [],
      "timeFrom": null,
      "timeRegions": [],
      "timeShift": null,
      "title": "CPU $cpu_times per Core",
      "tooltip": {
        "shared": true,
        "sort": 0,
        "value_type": "individual"
      },
      "type": "graph",
      "xaxis": {
        "buckets": null,
        "mode": "time",
        "name": null,
        "show": true,
        "values": []
      },
      "yaxes": [
        {
          "format": "percentunit",
          "label": null,
          "logBase": 1,
          "max": null,
          "min": null,
          "show": true
        },
        {
          "format": "short",
          "label": null,
          "logBase": 1,
          "max": null,
          "min": null,
          "show": true
        }
      ],
      "yaxis": {
        "align": false,
        "alignLevel": null
      }
    },
    {
      "aliasColors": {},
      "bars": false,
      "dashLength": 10,
      "dashes": false,
      "datasource": null,
      "fill": 1,
      "fillGradient": 0,
      "gridPos": {
        "h": 7,
        "w": 12,
        "x": 12,
        "y": 7
      },
      "hiddenSeries": false,
      "id": 19,
      "legend": {
        "alignAsTable": true,
        "avg": false,
        "current": true,
        "max": false,
        "min": false,
        "rightSide": true,
        "show": true,
        "total": false,
        "values": true
      },
      "lines": true,
      "linewidth": 1,
      "maxPerRow": 2,
      "nullPointMode": "connected",
      "options": {
        "dataLinks": []
      },
      "percentage": false,
      "pointradius": 2,
      "points": false,
      "renderer": "flot",
      "repeat": null,
      "repeatDirection": "h",
      "repeatIteration": 1581417680703,
      "repeatPanelId": 13,
      "scopedVars": {
        "cpu_times": {
          "selected": false,
          "text": "iowait",
          "value": "iowait"
        }
      },
      "seriesOverrides": [],
      "spaceLength": 10,
      "stack": false,
      "steppedLine": false,
      "targets": [
        {
          "refCount": 0,
          "refId": "D",
          "target": "aliasByNode(perSecond(graphyte.$host.OPERATING_SYSTEM.cpu_{0,1,2,3,4,5,6,7,8,9}.times.$cpu_times), 3)",
          "textEditor": false
        }
      ],
      "thresholds": [],
      "timeFrom": null,
      "timeRegions": [],
      "timeShift": null,
      "title": "CPU $cpu_times per Core",
      "tooltip": {
        "shared": true,
        "sort": 0,
        "value_type": "individual"
      },
      "type": "graph",
      "xaxis": {
        "buckets": null,
        "mode": "time",
        "name": null,
        "show": true,
        "values": []
      },
      "yaxes": [
        {
          "format": "percentunit",
          "label": null,
          "logBase": 1,
          "max": null,
          "min": null,
          "show": true
        },
        {
          "format": "short",
          "label": null,
          "logBase": 1,
          "max": null,
          "min": null,
          "show": true
        }
      ],
      "yaxis": {
        "align": false,
        "alignLevel": null
      }
    },
    {
      "aliasColors": {},
      "bars": false,
      "dashLength": 10,
      "dashes": false,
      "datasource": null,
      "fill": 1,
      "fillGradient": 0,
      "gridPos": {
        "h": 7,
        "w": 12,
        "x": 0,
        "y": 14
      },
      "hiddenSeries": false,
      "id": 22,
      "legend": {
        "alignAsTable": true,
        "avg": false,
        "current": true,
        "max": false,
        "min": false,
        "rightSide": true,
        "show": true,
        "total": false,
        "values": true
      },
      "lines": true,
      "linewidth": 1,
      "maxPerRow": 2,
      "nullPointMode": "connected",
      "options": {
        "dataLinks": []
      },
      "percentage": false,
      "pointradius": 2,
      "points": false,
      "renderer": "flot",
      "repeat": null,
      "repeatDirection": "h",
      "repeatIteration": 1581417680703,
      "repeatPanelId": 13,
      "scopedVars": {
        "cpu_times": {
          "selected": false,
          "text": "system",
          "value": "system"
        }
      },
      "seriesOverrides": [],
      "spaceLength": 10,
      "stack": false,
      "steppedLine": false,
      "targets": [
        {
          "refCount": 0,
          "refId": "D",
          "target": "aliasByNode(perSecond(graphyte.$host.OPERATING_SYSTEM.cpu_{0,1,2,3,4,5,6,7,8,9}.times.$cpu_times), 3)",
          "textEditor": false
        }
      ],
      "thresholds": [],
      "timeFrom": null,
      "timeRegions": [],
      "timeShift": null,
      "title": "CPU $cpu_times per Core",
      "tooltip": {
        "shared": true,
        "sort": 0,
        "value_type": "individual"
      },
      "type": "graph",
      "xaxis": {
        "buckets": null,
        "mode": "time",
        "name": null,
        "show": true,
        "values": []
      },
      "yaxes": [
        {
          "format": "percentunit",
          "label": null,
          "logBase": 1,
          "max": null,
          "min": null,
          "show": true
        },
        {
          "format": "short",
          "label": null,
          "logBase": 1,
          "max": null,
          "min": null,
          "show": true
        }
      ],
      "yaxis": {
        "align": false,
        "alignLevel": null
      }
    },
    {
      "aliasColors": {},
      "bars": false,
      "dashLength": 10,
      "dashes": false,
      "datasource": null,
      "fill": 1,
      "fillGradient": 0,
      "gridPos": {
        "h": 7,
        "w": 12,
        "x": 12,
        "y": 14
      },
      "hiddenSeries": false,
      "id": 25,
      "legend": {
        "alignAsTable": true,
        "avg": false,
        "current": true,
        "max": false,
        "min": false,
        "rightSide": true,
        "show": true,
        "total": false,
        "values": true
      },
      "lines": true,
      "linewidth": 1,
      "maxPerRow": 2,
      "nullPointMode": "connected",
      "options": {
        "dataLinks": []
      },
      "percentage": false,
      "pointradius": 2,
      "points": false,
      "renderer": "flot",
      "repeat": null,
      "repeatDirection": "h",
      "repeatIteration": 1581417680703,
      "repeatPanelId": 13,
      "scopedVars": {
        "cpu_times": {
          "selected": false,
          "text": "user",
          "value": "user"
        }
      },
      "seriesOverrides": [],
      "spaceLength": 10,
      "stack": false,
      "steppedLine": false,
      "targets": [
        {
          "refCount": 0,
          "refId": "D",
          "target": "aliasByNode(perSecond(graphyte.$host.OPERATING_SYSTEM.cpu_{0,1,2,3,4,5,6,7,8,9}.times.$cpu_times), 3)",
          "textEditor": false
        }
      ],
      "thresholds": [],
      "timeFrom": null,
      "timeRegions": [],
      "timeShift": null,
      "title": "CPU $cpu_times per Core",
      "tooltip": {
        "shared": true,
        "sort": 0,
        "value_type": "individual"
      },
      "type": "graph",
      "xaxis": {
        "buckets": null,
        "mode": "time",
        "name": null,
        "show": true,
        "values": []
      },
      "yaxes": [
        {
          "format": "percentunit",
          "label": null,
          "logBase": 1,
          "max": null,
          "min": null,
          "show": true
        },
        {
          "format": "short",
          "label": null,
          "logBase": 1,
          "max": null,
          "min": null,
          "show": true
        }
      ],
      "yaxis": {
        "align": false,
        "alignLevel": null
      }
    },
    {
      "aliasColors": {},
      "bars": false,
      "dashLength": 10,
      "dashes": false,
      "datasource": null,
      "fill": 1,
      "fillGradient": 0,
      "gridPos": {
        "h": 7,
        "w": 12,
        "x": 0,
        "y": 21
      },
      "hiddenSeries": false,
      "id": 28,
      "legend": {
        "alignAsTable": true,
        "avg": false,
        "current": true,
        "max": false,
        "min": false,
        "rightSide": true,
        "show": true,
        "total": false,
        "values": true
      },
      "lines": true,
      "linewidth": 1,
      "nullPointMode": "connected",
      "options": {
        "dataLinks": []
      },
      "percentage": false,
      "pluginVersion": "6.6.0",
      "pointradius": 2,
      "points": false,
      "renderer": "flot",
      "seriesOverrides": [
        {
          "alias": "percent",
          "color": "#C4162A",
          "fill": 5,
          "yaxis": 2
        }
      ],
      "spaceLength": 10,
      "stack": false,
      "steppedLine": false,
      "targets": [
        {
          "refCount": 0,
          "refId": "A",
          "target": "aliasByMetric(graphyte.$host.OPERATING_SYSTEM.memory.percent)"
        },
        {
          "refCount": 0,
          "refId": "B",
          "target": "aliasByMetric(graphyte.$host.OPERATING_SYSTEM.memory.total)"
        },
        {
          "refCount": 0,
          "refId": "C",
          "target": "aliasByMetric(graphyte.$host.OPERATING_SYSTEM.memory.free)"
        }
      ],
      "thresholds": [],
      "timeFrom": null,
      "timeRegions": [],
      "timeShift": null,
      "title": "Memory",
      "tooltip": {
        "shared": true,
        "sort": 0,
        "value_type": "individual"
      },
      "type": "graph",
      "xaxis": {
        "buckets": null,
        "mode": "time",
        "name": null,
        "show": true,
        "values": []
      },
      "yaxes": [
        {
          "format": "bytes",
          "label": null,
          "logBase": 1,
          "max": null,
          "min": null,
          "show": true
        },
        {
          "format": "percent",
          "label": "percent",
          "logBase": 1,
          "max": "110",
          "min": "0",
          "show": true
        }
      ],
      "yaxis": {
        "align": false,
        "alignLevel": null
      }
    },
    {
      "aliasColors": {},
      "bars": false,
      "dashLength": 10,
      "dashes": false,
      "datasource": null,
      "fill": 1,
      "fillGradient": 0,
      "gridPos": {
        "h": 7,
        "w": 12,
        "x": 12,
        "y": 21
      },
      "hiddenSeries": false,
      "id": 31,
      "legend": {
        "alignAsTable": true,
        "avg": false,
        "current": true,
        "max": false,
        "min": false,
        "rightSide": true,
        "show": true,
        "total": false,
        "values": true
      },
      "lines": true,
      "linewidth": 1,
      "nullPointMode": "connected",
      "options": {
        "dataLinks": []
      },
      "percentage": false,
      "pluginVersion": "6.6.0",
      "pointradius": 2,
      "points": false,
      "renderer": "flot",
      "seriesOverrides": [
        {
          "alias": "percent",
          "color": "#C4162A",
          "fill": 5,
          "yaxis": 2
        }
      ],
      "spaceLength": 10,
      "stack": false,
      "steppedLine": false,
      "targets": [
        {
          "refCount": 0,
          "refId": "A",
          "target": "aliasByMetric(graphyte.$host.OPERATING_SYSTEM.swap.percent)"
        },
        {
          "refCount": 0,
          "refId": "B",
          "target": "aliasByMetric(graphyte.$host.OPERATING_SYSTEM.swap.total)"
        },
        {
          "refCount": 0,
          "refId": "C",
          "target": "aliasByMetric(graphyte.$host.OPERATING_SYSTEM.swap.free)"
        }
      ],
      "thresholds": [],
      "timeFrom": null,
      "timeRegions": [],
      "timeShift": null,
      "title": "Swap",
      "tooltip": {
        "shared": true,
        "sort": 0,
        "value_type": "individual"
      },
      "type": "graph",
      "xaxis": {
        "buckets": null,
        "mode": "time",
        "name": null,
        "show": true,
        "values": []
      },
      "yaxes": [
        {
          "format": "bytes",
          "label": null,
          "logBase": 1,
          "max": null,
          "min": 0,
          "show": true
        },
        {
          "format": "percent",
          "label": "percent",
          "logBase": 1,
          "max": "110",
          "min": "0",
          "show": true
        }
      ],
      "yaxis": {
        "align": false,
        "alignLevel": null
      }
    },
    {
      "aliasColors": {},
      "bars": false,
      "dashLength": 10,
      "dashes": false,
      "datasource": null,
      "fill": 1,
      "fillGradient": 0,
      "gridPos": {
        "h": 7,
        "w": 12,
        "x": 0,
        "y": 28
      },
      "hiddenSeries": false,
      "id": 34,
      "legend": {
        "alignAsTable": true,
        "avg": false,
        "current": true,
        "max": false,
        "min": false,
        "rightSide": true,
        "show": true,
        "total": false,
        "values": true
      },
      "lines": true,
      "linewidth": 1,
      "maxPerRow": 2,
      "nullPointMode": "connected",
      "options": {
        "dataLinks": []
      },
      "percentage": false,
      "pointradius": 2,
      "points": false,
      "renderer": "flot",
      "repeat": "mountpoints",
      "repeatDirection": "h",
      "scopedVars": {
        "mountpoints": {
          "selected": false,
          "text": "boot",
          "value": "boot"
        }
      },
      "seriesOverrides": [
        {
          "alias": "percent",
          "color": "#C4162A",
          "fill": 4,
          "yaxis": 2
        }
      ],
      "spaceLength": 10,
      "stack": false,
      "steppedLine": false,
      "targets": [
        {
          "refCount": 0,
          "refId": "C",
          "target": "aliasByMetric(graphyte.$host.OPERATING_SYSTEM.disc.mountpoint.$mountpoints.percent)",
          "textEditor": false
        },
        {
          "refCount": 0,
          "refId": "B",
          "target": "aliasByMetric(graphyte.$host.OPERATING_SYSTEM.disc.mountpoint.$mountpoints.total)",
          "textEditor": false
        },
        {
          "refCount": 0,
          "refId": "A",
          "target": "aliasByMetric(graphyte.$host.OPERATING_SYSTEM.disc.mountpoint.$mountpoints.used)",
          "textEditor": false
        }
      ],
      "thresholds": [],
      "timeFrom": null,
      "timeRegions": [],
      "timeShift": null,
      "title": "Disk usage $mountpoints",
      "tooltip": {
        "shared": true,
        "sort": 0,
        "value_type": "individual"
      },
      "type": "graph",
      "xaxis": {
        "buckets": null,
        "mode": "time",
        "name": null,
        "show": true,
        "values": []
      },
      "yaxes": [
        {
          "format": "bytes",
          "label": null,
          "logBase": 1,
          "max": null,
          "min": null,
          "show": true
        },
        {
          "decimals": 0,
          "format": "percent",
          "label": "percent",
          "logBase": 1,
          "max": "110",
          "min": "0",
          "show": true
        }
      ],
      "yaxis": {
        "align": false,
        "alignLevel": null
      }
    },
    {
      "aliasColors": {},
      "bars": false,
      "dashLength": 10,
      "dashes": false,
      "datasource": null,
      "fill": 1,
      "fillGradient": 0,
      "gridPos": {
        "h": 7,
        "w": 12,
        "x": 12,
        "y": 28
      },
      "hiddenSeries": false,
      "id": 37,
      "legend": {
        "alignAsTable": true,
        "avg": false,
        "current": true,
        "max": false,
        "min": false,
        "rightSide": true,
        "show": true,
        "total": false,
        "values": true
      },
      "lines": true,
      "linewidth": 1,
      "maxPerRow": 2,
      "nullPointMode": "connected",
      "options": {
        "dataLinks": []
      },
      "percentage": false,
      "pointradius": 2,
      "points": false,
      "renderer": "flot",
      "repeat": null,
      "repeatDirection": "h",
      "repeatIteration": 1581417680703,
      "repeatPanelId": 4,
      "scopedVars": {
        "mountpoints": {
          "selected": false,
          "text": "rootfs",
          "value": "rootfs"
        }
      },
      "seriesOverrides": [
        {
          "alias": "percent",
          "color": "#C4162A",
          "fill": 4,
          "yaxis": 2
        }
      ],
      "spaceLength": 10,
      "stack": false,
      "steppedLine": false,
      "targets": [
        {
          "refCount": 0,
          "refId": "C",
          "target": "aliasByMetric(graphyte.$host.OPERATING_SYSTEM.disc.mountpoint.$mountpoints.percent)",
          "textEditor": false
        },
        {
          "refCount": 0,
          "refId": "B",
          "target": "aliasByMetric(graphyte.$host.OPERATING_SYSTEM.disc.mountpoint.$mountpoints.total)",
          "textEditor": false
        },
        {
          "refCount": 0,
          "refId": "A",
          "target": "aliasByMetric(graphyte.$host.OPERATING_SYSTEM.disc.mountpoint.$mountpoints.used)",
          "textEditor": false
        }
      ],
      "thresholds": [],
      "timeFrom": null,
      "timeRegions": [],
      "timeShift": null,
      "title": "Disk usage $mountpoints",
      "tooltip": {
        "shared": true,
        "sort": 0,
        "value_type": "individual"
      },
      "type": "graph",
      "xaxis": {
        "buckets": null,
        "mode": "time",
        "name": null,
        "show": true,
        "values": []
      },
      "yaxes": [
        {
          "format": "bytes",
          "label": null,
          "logBase": 1,
          "max": null,
          "min": null,
          "show": true
        },
        {
          "decimals": 0,
          "format": "percent",
          "label": "percent",
          "logBase": 1,
          "max": "110",
          "min": "0",
          "show": true
        }
      ],
      "yaxis": {
        "align": false,
        "alignLevel": null
      }
    },
    {
      "aliasColors": {},
      "bars": false,
      "dashLength": 10,
      "dashes": false,
      "datasource": null,
      "fill": 1,
      "fillGradient": 0,
      "gridPos": {
        "h": 7,
        "w": 12,
        "x": 0,
        "y": 35
      },
      "hiddenSeries": false,
      "id": 40,
      "legend": {
        "alignAsTable": true,
        "avg": false,
        "current": true,
        "max": false,
        "min": false,
        "rightSide": true,
        "show": true,
        "total": false,
        "values": true
      },
      "lines": true,
      "linewidth": 1,
      "maxPerRow": 2,
      "nullPointMode": "connected",
      "options": {
        "dataLinks": []
      },
      "percentage": false,
      "pointradius": 2,
      "points": false,
      "renderer": "flot",
      "repeat": null,
      "repeatDirection": "h",
      "repeatIteration": 1581417680703,
      "repeatPanelId": 4,
      "scopedVars": {
        "mountpoints": {
          "selected": false,
          "text": "var-cache-coremedia",
          "value": "var-cache-coremedia"
        }
      },
      "seriesOverrides": [
        {
          "alias": "percent",
          "color": "#C4162A",
          "fill": 4,
          "yaxis": 2
        }
      ],
      "spaceLength": 10,
      "stack": false,
      "steppedLine": false,
      "targets": [
        {
          "refCount": 0,
          "refId": "C",
          "target": "aliasByMetric(graphyte.$host.OPERATING_SYSTEM.disc.mountpoint.$mountpoints.percent)",
          "textEditor": false
        },
        {
          "refCount": 0,
          "refId": "B",
          "target": "aliasByMetric(graphyte.$host.OPERATING_SYSTEM.disc.mountpoint.$mountpoints.total)",
          "textEditor": false
        },
        {
          "refCount": 0,
          "refId": "A",
          "target": "aliasByMetric(graphyte.$host.OPERATING_SYSTEM.disc.mountpoint.$mountpoints.used)",
          "textEditor": false
        }
      ],
      "thresholds": [],
      "timeFrom": null,
      "timeRegions": [],
      "timeShift": null,
      "title": "Disk usage $mountpoints",
      "tooltip": {
        "shared": true,
        "sort": 0,
        "value_type": "individual"
      },
      "type": "graph",
      "xaxis": {
        "buckets": null,
        "mode": "time",
        "name": null,
        "show": true,
        "values": []
      },
      "yaxes": [
        {
          "format": "bytes",
          "label": null,
          "logBase": 1,
          "max": null,
          "min": null,
          "show": true
        },
        {
          "decimals": 0,
          "format": "percent",
          "label": "percent",
          "logBase": 1,
          "max": "110",
          "min": "0",
          "show": true
        }
      ],
      "yaxis": {
        "align": false,
        "alignLevel": null
      }
    },
    {
      "aliasColors": {},
      "bars": false,
      "dashLength": 10,
      "dashes": false,
      "datasource": null,
      "fill": 1,
      "fillGradient": 0,
      "gridPos": {
        "h": 7,
        "w": 12,
        "x": 12,
        "y": 35
      },
      "hiddenSeries": false,
      "id": 43,
      "legend": {
        "alignAsTable": true,
        "avg": false,
        "current": true,
        "max": false,
        "min": false,
        "rightSide": true,
        "show": true,
        "total": false,
        "values": true
      },
      "lines": true,
      "linewidth": 1,
      "maxPerRow": 2,
      "nullPointMode": "connected",
      "options": {
        "dataLinks": []
      },
      "percentage": false,
      "pointradius": 2,
      "points": false,
      "renderer": "flot",
      "repeat": null,
      "repeatDirection": "h",
      "repeatIteration": 1581417680703,
      "repeatPanelId": 4,
      "scopedVars": {
        "mountpoints": {
          "selected": false,
          "text": "rootfs",
          "value": "rootfs"
        }
      },
      "seriesOverrides": [
        {
          "alias": "percent",
          "color": "#C4162A",
          "fill": 4,
          "yaxis": 2
        }
      ],
      "spaceLength": 10,
      "stack": false,
      "steppedLine": false,
      "targets": [
        {
          "refCount": 0,
          "refId": "C",
          "target": "aliasByMetric(graphyte.$host.OPERATING_SYSTEM.disc.mountpoint.$mountpoints.percent)",
          "textEditor": false
        },
        {
          "refCount": 0,
          "refId": "B",
          "target": "aliasByMetric(graphyte.$host.OPERATING_SYSTEM.disc.mountpoint.$mountpoints.total)",
          "textEditor": false
        },
        {
          "refCount": 0,
          "refId": "A",
          "target": "aliasByMetric(graphyte.$host.OPERATING_SYSTEM.disc.mountpoint.$mountpoints.used)",
          "textEditor": false
        }
      ],
      "thresholds": [],
      "timeFrom": null,
      "timeRegions": [],
      "timeShift": null,
      "title": "Disk usage $mountpoints",
      "tooltip": {
        "shared": true,
        "sort": 0,
        "value_type": "individual"
      },
      "type": "graph",
      "xaxis": {
        "buckets": null,
        "mode": "time",
        "name": null,
        "show": true,
        "values": []
      },
      "yaxes": [
        {
          "format": "bytes",
          "label": null,
          "logBase": 1,
          "max": null,
          "min": null,
          "show": true
        },
        {
          "decimals": 0,
          "format": "percent",
          "label": "percent",
          "logBase": 1,
          "max": "110",
          "min": "0",
          "show": true
        }
      ],
      "yaxis": {
        "align": false,
        "alignLevel": null
      }
    }
  ],
  "refresh": "1m",
  "schemaVersion": 22,
  "style": "dark",
  "tags": [
    "backend",
    "operatingsystem"
  ],
  "templating": {
    "list": [
      {
        "allValue": null,
        "current": {
          "selected": true,
          "text": "All",
          "value": "$__all"
        },
        "datasource": "graphite",
        "definition": "graphyte.$host.OPERATING_SYSTEM.disc.mountpoint.*",
        "hide": 0,
        "includeAll": true,
        "label": null,
        "multi": false,
        "name": "mountpoints",
        "options": [],
        "query": "graphyte.$host.OPERATING_SYSTEM.disc.mountpoint.*",
        "refresh": 1,
        "regex": "",
        "skipUrlSync": false,
        "sort": 0,
        "tagValuesQuery": "",
        "tags": [],
        "tagsQuery": "",
        "type": "query",
        "useTags": false
      },
      {
        "allValue": null,
        "current": {
          "selected": true,
          "text": "All",
          "value": "$__all"
        },
        "datasource": "graphite",
        "definition": "graphyte.$host.OPERATING_SYSTEM.cpu_{0,1,2,3,4,5,6,7,8,9}.times.*",
        "hide": 0,
        "includeAll": true,
        "label": null,
        "multi": false,
        "name": "cpu_times",
        "options": [],
        "query": "graphyte.$host.OPERATING_SYSTEM.cpu_{0,1,2,3,4,5,6,7,8,9}.times.*",
        "refresh": 1,
        "regex": "",
        "skipUrlSync": false,
        "sort": 0,
        "tagValuesQuery": "",
        "tags": [],
        "tagsQuery": "",
        "type": "query",
        "useTags": false
      },
      {
        "current": {
          "selected": true,
          "text": "backend",
          "value": "backend"
        },
        "hide": 2,
        "label": null,
        "name": "host",
        "options": [
          {
            "selected": true,
            "text": "backend",
            "value": "backend"
          }
        ],
        "query": "backend",
        "skipUrlSync": false,
        "type": "constant"
      }
    ]
  },
  "time": {
    "from": "now-6h",
    "to": "now/d"
  },
  "timepicker": {
    "refresh_intervals": [
      "5s",
      "10s",
      "30s",
      "1m",
      "5m",
      "15m",
      "30m",
      "1h",
      "2h",
      "1d"
    ]
  },
  "timezone": "browser",
  "title": "backend - Operating System",
  "uid": "backend-operatingsystem",
  "version": 22
}