Place,Name,State,WeightClassKg,BodyweightKg,BirthDate,Age,Squat1Kg,Squat2Kg,Squat3Kg,Best3SquatKg,Bench1Kg,Bench2Kg,Bench3Kg,Best3BenchKg,Deadlift1Kg,Deadlift2Kg,Deadlift3Kg,Best3DeadliftKg,TotalKg,Bench4Kg,Deadlift4Kg,Event,Equipment,Sex,Division,Tested
DQ,Sarah Gunn,TX,75,74.8,,20,-110,-122.5,-122.5,,52.5,57.5,-62.5,57.5,145,152.5,155,155,,,,SBD,Raw,F,Juniors 20-23,Yes
1,Ursula Smith,TX,52,49.6,,25,102.5,-110,-110,102.5,65,70,-75.5,70,115,-120,120,120,292.5,,,SBD,Raw,F,Open,Yes
2,Anna Gonzalez,TX,52,50.9,,27,80,-95,95,95,45,52.5,55,55,115,122.5,127.5,127.5,277.5,,,SBD,Raw,F,Open,Yes
1,Ashlee Stanley,LA,60,59.4,,29,92.5,-97.5,97.5,97.5,52.5,57.5,60,60,120,127.5,137.5,137.5,295,,,SBD,Raw,F,Open,Yes
2,Charmaine Pisa,GA,60,59.3,,30,85,95,100,100,47.5,52.5,-57.5,52.5,85,102.5,110,110,262.5,,,SBD,Raw,F,Open,Yes
1,Roxann Spencer,TX,75,70.2,,26,110,125,130,130,77.5,82.5,87.5,87.5,145,152.5,162.5,162.5,380,,,SBD,Raw,F,Open,Yes
2,Rachel Yaw,TX,75,73.6,,27,130,-140,-140,130,67.5,75,-77.5,75,152.5,165,170,170,375,,,SBD,Raw,F,Open,Yes
1,Janice Montemayor,TX,82.5,81,,25,92.5,100,105,105,50,57.5,-60,57.5,115,132.5,-140,132.5,295,,,SBD,Raw,F,Open,Yes
1,Evan Rogers,TX,75,74.2,,23,197.5,205,210,210,137.5,142.5,147.5,147.5,265.5,277.5,285,285,642.5,,,SBD,Raw,M,Juniors 20-23,Yes
1,Austin Carlson #2,TX,90,89.8,,18,210,-217.5,,210,117.5,125,127.5,127.5,215,222.5,232.5,232.5,570,,,SBD,Raw,M,Juniors 18-19,Yes
2,Yubin Kim,TX,90,87.9,,19,155,-167.5,172.5,172.5,90,95,-100,95,170,177.5,190,190,457.5,,,SBD,Raw,M,Juniors 18-19,Yes
1,Evan Aguilar-Pine,TX,100,96.1,,17,140,155,167.5,167.5,125,132.5,137.5,137.5,192.5,210,-227.5,210,515,,,SBD,Raw,M,Juniors 16-17,Yes
1,Syd Blythe,TX,110,107,,18,230,-240,-240,230,135,140,-142.5,140,255,265,275,275,645,,,SBD,Raw,M,Juniors 18-19,Yes
1,Rafael Montemayor,TX,110,109.3,,22,235,255,260,260,122.5,137.5,150,150,225,240,245,245,655,,,SBD,Raw,M,Juniors 20-23,Yes
2,Blake Atwood,TX,110,107.4,,22,240,247.5,252.5,252.5,132.5,140,-147.5,140,240,255,260,260,652.5,,,SBD,Raw,M,Juniors 20-23,Yes
1,Joshua Lehman,WI,140,133.9,,22,232.5,240,250,250,142.5,152.5,162.5,162.5,232.5,245,-252.5,245,657.5,,,SBD,Raw,M,Juniors 20-23,Yes
1,Nathan Khaodeuanepheng,TX,67.5,66.7,,26,180,187.5,192.5,192.5,97.5,100,-107.5,100,225,232.5,237.5,237.5,530,,,SBD,Raw,M,Open,Yes
1,Simon Reyes,TX,82.5,81.5,,27,215,227.5,232.5,232.5,157.5,165,170,170,262.5,275,280,280,682.5,,,SBD,Raw,M,Open,Yes
2,Kyle Novak #2,TX,82.5,81.1,,24,187.5,200,-205,200,-120,-120,120,120,185,195,-202.5,195,515,,,SBD,Raw,M,Open,Yes
1,Anthony Upchurch,TX,90,89.4,,26,200,207.5,-217.5,207.5,145,152.5,-160,152.5,225,235,245,245,605,,,SBD,Raw,M,Open,Yes
2,Bruno Don-Romero,TX,90,87.4,,26,212.5,220,227.5,227.5,120,-127.5,-127.5,120,237.5,250,255,255,602.5,,,SBD,Raw,M,Open,Yes
3,Daniel Pineda,TX,90,87.9,,27,175,-180,,175,117.5,125,-132.5,125,197.5,-205,-205,197.5,497.5,,,SBD,Raw,M,Open,Yes
4,Dylan Sams,TX,90,87.3,,28,145,150,155,155,85,92.5,-102.5,92.5,155,-165,,155,402.5,,,SBD,Raw,M,Open,Yes
1,Kendall Robinson,TX,100,97.4,,34,237.5,252.5,257.5,257.5,172.5,185,-192.5,185,267.5,282.5,-292.5,282.5,725,,,SBD,Raw,M,Open,Yes
2,Prince Kim,TX,100,94.7,,24,200,212.5,220,220,125,-137.5,137.5,137.5,225,-242.5,247.5,247.5,605,,,SBD,Raw,M,Open,Yes
3,Xavier Guzman,TX,100,97.5,,41,190,197.5,210,210,-130,130,-140,130,175,192.5,200,200,540,,,SBD,Raw,M,Open,Yes
1,Jonathan Urrutia #1,TX,110,107.5,,30,230,245,-252.5,245,137.5,145,-150,145,275,292.5,302.5,302.5,692.5,,,SBD,Raw,M,Open,Yes
2,Blake Atwood,TX,110,107.4,,22,240,247.5,252.5,252.5,132.5,140,-147.5,140,240,255,260,260,652.5,,,SBD,Raw,M,Open,Yes
3,William Scott,TX,110,105.8,,34,182.5,187.5,192.5,192.5,125,132.5,137.5,137.5,202.5,227.5,235,235,565,,,SBD,Raw,M,Open,Yes
1,Abraham Flores,TX,125,112.7,,26,250,272.5,280,280,170,180,-182.5,180,297.5,317.5,-320,317.5,777.5,,,SBD,Raw,M,Open,Yes
2,Lucas Cordova,TX,125,122.5,,25,217.5,230,240,240,127.5,137.5,147.5,147.5,210,-225,232.5,232.5,620,,,SBD,Raw,M,Open,Yes
DD,John Duenes,TX,140,139,,37,300,317.5,330,330,190,200,-203,200,295,305,,305,,,,SBD,Raw,M,Open,Yes
1,David McCartney,TX,140,137.3,,43,200,212.5,220,220,155,160,-162.5,160,240,247.5,252.5,252.5,632.5,,,SBD,Raw,M,Open,Yes
1,Joel Luna,TX,140+,145.8,,24,225,237.5,250,250,205,220,-225,220,207.5,220,235,235,705,,,SBD,Raw,M,Open,Yes
1,Garrett Luddeke,TX,100,96.5,,36,185,-192.5,192.5,192.5,115,122.5,-127.5,122.5,205,215,227.5,227.5,542.5,,,SBD,Raw,M,Submasters 35-39,Yes
1,Benjamin Rowe,MA,90,87.2,,46,235,-245,245,245,145,155,,155,240,-255,,240,640,,,SBD,Raw,M,Masters 45-49,Yes
DQ,David Owen,TX,125,115.2,,52,-192.5,-200,-200,,,,,,,,,,,,,SBD,Raw,M,Masters 50-54,Yes
1,David McCartney,TX,140,137.3,,43,200,212.5,220,220,155,160,-162.5,160,240,247.5,252.5,252.5,632.5,,,SBD,Raw,M,Masters 40-44,Yes
1,Angelina Ochoa,TX,60,59.9,,22,-120,120,-127.5,120,57.5,62.5,65,65,120,132.5,137.5,137.5,322.5,67.5,140,SBD,Wraps,F,Juniors 20-23,Yes
1,Jesse Mendoza,TX,90,89.6,,30,192.5,207.5,227.5,227.5,112.5,120,130,130,210,-217.5,-232.5,210,567.5,,,SBD,Wraps,M,Open,Yes
2,Khristopher Pierce,TX,90,89.4,,32,-210,210,-220,210,120,130,-135,130,210,220,-227.5,220,560,,,SBD,Wraps,M,Open,Yes
3,Matthew Rodriguez,TX,90,87.5,,27,220,-230,230,230,-120,120,-130,120,192.5,202.5,-205,202.5,552.5,,,SBD,Wraps,M,Open,Yes
1,Albert Maldonado,TX,125,122.5,,39,180,202.5,217.5,217.5,140,145,152.5,152.5,185,202.5,227.5,227.5,597.5,,,SBD,Wraps,M,Open,Yes
1,Fred Lamas,TX,82.5,78.3,,64,130,140,147.5,147.5,80,85,90,90,162.5,172.5,182.5,182.5,420,,,SBD,Wraps,M,Masters 60-64,Yes
DQ,Alex Ortiz #1,TX,110,109.6,,52,-272.5,272.5,-290,272.5,-190,-190,-190,,230,242.5,250,250,,,,SBD,Wraps,M,Masters 50-54,Yes
1,David McCartney,TX,140,137.3,,43,,,,,155,160,-162.5,160,,,,,160,,,B,Raw,M,Open,Yes
1,Eric Brahin,TX,82.5,81.3,,44,,,,,-82.5,82.5,85,85,,,,,85,,,B,Raw,M,Masters 40-44,Yes
1,David McCartney,TX,140,137.3,,43,,,,,155,160,-162.5,160,,,,,160,,,B,Raw,M,Masters 40-44,Yes
1,Joanna Casas,TX,60,58.2,,37,,,,,,,,,80,87.5,95,95,95,,,D,Raw,F,Submasters 35-39,Yes
1,William Scott,TX,110,105.8,,34,,,,,,,,,202.5,227.5,235,235,235,,,D,Raw,M,Open,Yes
1,David McCartney,TX,140,137.3,,43,,,,,,,,,240,247.5,252.5,252.5,252.5,,,D,Raw,M,Open,Yes
1,David McCartney,TX,140,137.3,,43,,,,,,,,,240,247.5,252.5,252.5,252.5,,,D,Raw,M,Masters 40-44,Yes
1,Harvey Pendleton,TX,82.5,81.3,,75,,,,,,,,,110,125,140,140,140,,150.5,D,Single-ply,M,Open,Yes
1,Harvey Pendleton,TX,82.5,81.3,,75,,,,,,,,,110,125,140,140,140,,150.5,D,Single-ply,M,Masters 75-79,Yes
1,Valerie Galindo,TX,75,73.2,,35,,,,,62.5,67.5,75,75,102.5,107.5,-115,107.5,182.5,,,BD,Raw,F,Open,Yes
1,William Scott,TX,110,105.8,,34,,,,,125,132.5,137.5,137.5,202.5,227.5,235,235,372.5,,,BD,Raw,M,Open,Yes
1,David McCartney,TX,140,137.3,,43,,,,,155,160,-162.5,160,240,247.5,252.5,252.5,412.5,,,BD,Raw,M,Open,Yes
1,David McCartney,TX,140,137.3,,43,,,,,155,160,-162.5,160,240,247.5,252.5,252.5,412.5,,,BD,Raw,M,Masters 40-44,Yes
