Place,Name,State,WeightClassKg,BodyweightKg,BirthDate,Age,Squat1Kg,Squat2Kg,Squat3Kg,Best3SquatKg,Bench1Kg,Bench2Kg,Bench3Kg,Best3BenchKg,Deadlift1Kg,Deadlift2Kg,Deadlift3Kg,Best3DeadliftKg,TotalKg,Event,Equipment,Sex,Division,Tested
1,Lesley Picazo,CA,52,51.9,,19,95,105,-115,105,65,67.5,-70,67.5,120,130,135,135,307.5,SBD,Raw,F,Juniors 18-19,Yes
1,Giselle Aquino,CA,56,55.8,,19,107.5,112.5,117.5,117.5,60,65,-67.5,65,142.5,147.5,-150,147.5,330,SBD,Raw,F,Juniors 18-19,Yes
2,Lyndee D'Aiuto,CA,56,53.9,,18,45,50,55,55,37.5,42.5,-47.5,42.5,-90,95,100,100,197.5,SBD,Raw,F,Juniors 18-19,Yes
1,Olivia Presto,CA,56,54.7,,20,100,110,-125,110,60,67.5,72.5,72.5,110,120,130,130,312.5,SBD,Raw,F,Juniors 20-23,Yes
1,Nathy Hoang,CA,60,58.6,,23,-95,100,-102.5,100,40,45,-50,45,-130,140,150,150,295,SBD,Raw,F,Juniors 20-23,Yes
1,Vanessa Morales,CA,67.5,65.7,,22,110,115,117.5,117.5,60,62.5,65,65,115,122.5,127.5,127.5,310,SBD,Raw,F,Juniors 20-23,Yes
2,Amy Zhou,CA,67.5,63.2,,23,90,102.5,112.5,112.5,32.5,37.5,-47.5,37.5,112.5,122.5,-130,122.5,272.5,SBD,Raw,F,Juniors 20-23,Yes
1,Grace Gonzalez,CA,90,89.5,,21,-95,95,105,105,55,57.5,-60,57.5,115,122.5,132.5,132.5,295,SBD,Raw,F,Juniors 20-23,Yes
1,Charlene Enriquez,CA,52,50.6,,27,105,110,115,115,52.5,55,-57.5,55,130,132.5,135,135,305,SBD,Raw,F,Open,Yes
2,Julie Anne Pahuriray,CA,52,49.1,,26,95,105,-115,105,45,-50,50,50,120,135,145,145,300,SBD,Raw,F,Open,Yes
1,Gloria Luong,CA,56,55.7,,32,100,105,110,110,85,-87.5,-87.5,85,150,155,-160,155,350,SBD,Raw,F,Open,Yes
2,Lee Ann Long,CA,56,54.8,,29,102.5,120,130,130,-42.5,45,47.5,47.5,105,125,137.5,137.5,315,SBD,Raw,F,Open,Yes
1,Kayla Sides,CA,60,59.5,,26,107.5,112.5,117.5,117.5,62.5,65,-67.5,65,135,142.5,-147.5,142.5,325,SBD,Raw,F,Open,Yes
2,Leslie Aviles,CA,60,58,,30,-102.5,110,-117.5,110,47.5,52.5,-57.5,52.5,107.5,115,122.5,122.5,285,SBD,Raw,F,Open,Yes
3,Amy De Paz,CA,60,57.5,,25,80,85,90,90,-47.5,47.5,50,50,107.5,120,122.5,122.5,262.5,SBD,Raw,F,Open,Yes
1,Erin Avery,CA,67.5,66.8,,27,120,125,-127.5,125,60,62.5,65,65,-155,155,162.5,162.5,352.5,SBD,Raw,F,Open,Yes
2,Vanessa Morales,CA,67.5,65.7,,22,110,115,117.5,117.5,60,62.5,65,65,115,122.5,127.5,127.5,310,SBD,Raw,F,Open,Yes
3,Evelyn Nguyen,VA,67.5,66.7,,24,107.5,115,122.5,122.5,42.5,47.5,52.5,52.5,110,120,127.5,127.5,302.5,SBD,Raw,F,Open,Yes
4,Amy Zhou,CA,67.5,63.2,,23,90,102.5,112.5,112.5,32.5,37.5,-47.5,37.5,112.5,122.5,-130,122.5,272.5,SBD,Raw,F,Open,Yes
1,Daisy Aldana,CA,75,74.3,,32,85,92.5,-97.5,92.5,40,45,47.5,47.5,95,102.5,110,110,250,SBD,Raw,F,Open,Yes
1,Erin Castioni,CA,82.5,80,,38,125,-127.5,127.5,127.5,65,67.5,70,70,135,140,147.5,147.5,345,SBD,Raw,F,Open,Yes
1,Grace Gonzalez,CA,90,89.5,,21,-95,95,105,105,55,57.5,-60,57.5,115,122.5,132.5,132.5,295,SBD,Raw,F,Open,Yes
1,Crystal Gonzalez,CA,100,99,,33,132.5,140,147.5,147.5,70,75,77.5,77.5,140,155,-170,155,380,SBD,Raw,F,Open,Yes
1,Erin Castioni,CA,82.5,80,,38,125,-127.5,127.5,127.5,65,67.5,70,70,135,140,147.5,147.5,345,SBD,Raw,F,Submasters 35-39,Yes
1,Jennifer Ricci,CA,67.5,61.3,,49,70,77.5,-82.5,77.5,47.5,52.5,55,55,85,95,100,100,232.5,SBD,Raw,F,Masters 45-49,Yes
1,Alijah Macapagal,CA,60,56.8,,19,170,-180,-185,170,90,95,-100,95,200,210,227.5,227.5,492.5,SBD,Raw,M,Juniors 18-19,Yes
1,Warren Cha,CA,75,74.2,,22,185,195,205,205,102.5,115,125,125,195,-207.5,215,215,545,SBD,Raw,M,Juniors 20-23,Yes
2,Albert Tambalo,CA,75,73.5,,21,182.5,192.5,-202.5,192.5,105,-110,-112.5,105,-235,240,-252.5,240,537.5,SBD,Raw,M,Juniors 20-23,Yes
1,Ian Martinez,CA,82.5,79.6,,19,130,137.5,147.5,147.5,70,77.5,82.5,82.5,140,150,162.5,162.5,392.5,SBD,Raw,M,Juniors 18-19,Yes
1,Bryan Velasco,CA,100,99.5,,19,210,222.5,235,235,135,145,155,155,225,-240,250,250,640,SBD,Raw,M,Juniors 18-19,Yes
1,Justin Pena,CA,100,97,,21,177.5,180,185,185,-175,177.5,-182.5,177.5,225,-232.5,232.5,232.5,595,SBD,Raw,M,Juniors 20-23,Yes
1,Alijah Macapagal,CA,60,56.8,,19,170,-180,-185,170,90,95,-100,95,200,210,227.5,227.5,492.5,SBD,Raw,M,Open,Yes
1,Jason Vicente,CA,67.5,67,,38,162.5,175,182.5,182.5,130,137.5,145.5,145.5,215,-227.5,-227.5,215,543,SBD,Raw,M,Open,Yes
1,Darryl Liu,CA,75,73.4,,34,175,182.5,200,200,107.5,-112.5,,107.5,212.5,-227.5,,212.5,520,SBD,Raw,M,Open,Yes
1,Daniel Chang,CA,82.5,78.5,,29,142.5,152.5,160,160,-97.5,102.5,110,110,205,225,-242.5,225,495,SBD,Raw,M,Open,Yes
2,Sheridan Yates,CA,82.5,81.3,,25,150,162.5,170,170,105,112.5,120,120,165,175,-182.5,175,465,SBD,Raw,M,Open,Yes
1,Alex Gaynor,CA,90,89.4,,26,252.5,272.5,280,280,172.5,182.5,-190,182.5,-250,272.5,-280,272.5,735,SBD,Raw,M,Open,Yes
2,Ashley Streetly,CA,90,87.8,,33,230,245,255,255,142.5,150,-160,150,230,250,270,270,675,SBD,Raw,M,Open,Yes
3,Bryant Hernandez,CA,90,89,,24,180,195,205,205,110,117.5,125,125,205,217.5,232.5,232.5,562.5,SBD,Raw,M,Open,Yes
4,Matthew Alba,CA,90,86.8,,24,-172.5,-180,180,180,120,130,-135,130,-215,-225,225,225,535,SBD,Raw,M,Open,Yes
1,Zachary Welch,CA,100,99.5,,29,255,275,287.5,287.5,167.5,177.5,-185,177.5,277.5,295,307.5,307.5,772.5,SBD,Raw,M,Open,Yes
2,Justin Pena,CA,100,97,,21,177.5,180,185,185,-175,177.5,-182.5,177.5,225,-232.5,232.5,232.5,595,SBD,Raw,M,Open,Yes
3,Jorge Diaz,CA,100,96.6,,27,-185,192.5,200,200,142.5,-147.5,-147.5,142.5,227.5,237.5,242.5,242.5,585,SBD,Raw,M,Open,Yes
1,Gregory Correa,CA,125,124.3,,37,250,267.5,,267.5,180,185,192.5,192.5,292.5,312.5,-317.5,312.5,772.5,SBD,Raw,M,Open,Yes
2,Parker Jobin,CA,125,123.5,,25,230,250,-255,250,160,-172.5,172.5,172.5,265,272.5,295,295,717.5,SBD,Raw,M,Open,Yes
1,Jason Vicente,CA,67.5,67,,38,162.5,175,182.5,182.5,130,137.5,145.5,145.5,215,-227.5,-227.5,215,543,SBD,Raw,M,Open,Yes
1,Mark Lyons,CA,100,91.7,,56,130,135,145,145,102.5,112.5,-115,112.5,175,187.5,195,195,452.5,SBD,Raw,M,Masters 55-59,Yes
1,Robert Speno,CA,140,132.4,,54,207.5,217.5,227.5,227.5,130,137.5,140,140,210,225,227.5,227.5,595,SBD,Raw,M,Masters 50-54,Yes
1,Gloria Luong,CA,56,55.7,,32,,,,,85,-87.5,-87.5,85,,,,,85,B,Raw,F,Open,Yes
