{
   "PublicCell" : {
      "category" : {
         "type" : "String"
      },
      "cellType" : {
         "type" : "Number"
      },
      "chatRoom" : {
         "targetClass" : "ChatRoom",
         "type" : "Pointer"
      },
      "description" : {
         "type" : "String"
      },
      "isVerified" : {
         "defaultValue" : false,
         "required" : true,
         "type" : "Boolean"
      },
      "location" : {
         "type" : "GeoPoint"
      },
      "members" : {
         "targetClass" : "_User",
         "type" : "Relation"
      },
      "name" : {
         "type" : "String"
      },
      "owner" : {
         "required" : true,
         "targetClass" : "_User",
         "type" : "Pointer"
      },
      "verificationStatus" : {
         "type" : "Number"
      }
   }
}
