{
  "className": "RelationshipUpdate",
  "fields": {
    "objectId": {
      "type": "String"
    },
    "createdAt": {
      "type": "Date"
    },
    "updatedAt": {
      "type": "Date"
    },
    "ACL": {
      "type": "ACL"
    },
    "op": {
      "type": "String"
    },
    "owner": {
      "type": "Pointer",
      "targetClass": "_User"
    },
    "owningId": {
      "type": "String"
    },
    "relatedId": {
      "type": "String"
    },
    "owningClass": {
      "type": "String"
    },
    "owningField": {
      "type": "String"
    },
    "relatedClass": {
      "type": "String"
    },
    "relatedField": {
      "type": "String"
    }
  },
  "classLevelPermissions": {
    "find": {
      "*": true
    },
    "get": {
      "*": true
    },
    "count": {
      "*": true
    },
    "create": {
      "*": true
    },
    "update": {
      "*": true
    },
    "delete": {
      "*": true
    },
    "addField": {
      "*": true
    },
    "protectedFields": {
      "*": []
    }
  },
  "indexes": {
    "_id_": {
      "_id": 1
    }
  }
}