<?xml version="1.0" encoding="UTF-8" standalone="no"?>
<!-- Created with Inkscape (http://www.inkscape.org/) -->

<svg
   xmlns:dc="http://purl.org/dc/elements/1.1/"
   xmlns:cc="http://creativecommons.org/ns#"
   xmlns:rdf="http://www.w3.org/1999/02/22-rdf-syntax-ns#"
   xmlns:svg="http://www.w3.org/2000/svg"
   xmlns="http://www.w3.org/2000/svg"
   xmlns:sodipodi="http://sodipodi.sourceforge.net/DTD/sodipodi-0.dtd"
   xmlns:inkscape="http://www.inkscape.org/namespaces/inkscape"
   width="0.81380045mm"
   height="0.47836298mm"
   viewBox="0 0 0.81380045 0.47836298"
   version="1.1"
   id="svg1912"
   inkscape:version="0.92.4 (unknown)"
   sodipodi:docname="ஒரு கலம்.svg">
  <defs
     id="defs1906" />
  <sodipodi:namedview
     id="base"
     pagecolor="#ffffff"
     bordercolor="#666666"
     borderopacity="1.0"
     inkscape:pageopacity="0.0"
     inkscape:pageshadow="2"
     inkscape:zoom="256"
     inkscape:cx="1.5378908"
     inkscape:cy="0.90397671"
     inkscape:document-units="mm"
     inkscape:current-layer="layer1"
     showgrid="false"
     fit-margin-top="0"
     fit-margin-left="0"
     fit-margin-right="0"
     fit-margin-bottom="0"
     inkscape:window-width="1920"
     inkscape:window-height="1017"
     inkscape:window-x="0"
     inkscape:window-y="30"
     inkscape:window-maximized="1" />
  <metadata
     id="metadata1909">
    <rdf:RDF>
      <cc:Work
         rdf:about="">
        <dc:format>image/svg+xml</dc:format>
        <dc:type
           rdf:resource="http://purl.org/dc/dcmitype/StillImage" />
        <dc:title></dc:title>
      </cc:Work>
    </rdf:RDF>
  </metadata>
  <g
     inkscape:label="Layer 1"
     inkscape:groupmode="layer"
     id="layer1"
     transform="translate(-77.456195,-196.21915)">
    <g
       transform="matrix(0.35277777,0,0,0.35277777,-2.2803315,133.2328)"
       id="g1047"
       style="fill:#211e1e;fill-opacity:1">
      <g
         id="use1045"
         transform="matrix(0.26458333,0,0,0.26458333,226,179.89999)">
        <path
           inkscape:connector-curvature="0"
           id="path1924"
           d="m 8.8125,-2.765625 v -0.71875 H 6.578125 V -3.03125 C 6.3125,-3.3125 5.890625,-3.546875 5.296875,-3.546875 c -0.359375,0 -0.578125,0.0625 -0.9375,0.21875 H 3.53125 V -4.4375 H 5.1875 V -5.125 H 1.078125 v 1.953125 C 0.65625,-3.03125 0.09375,-2.3125 0.09375,-1.6875 0.09375,-0.453125 0.921875,0 1.828125,0 2.8125,0 3.53125,-0.765625 3.53125,-1.578125 v -1.1875 H 3.875 c -0.203125,0.234375 -0.296875,0.375 -0.296875,0.90625 0,1.21875 0.75,1.75 1.359375,1.75 0.3125,0 1,-0.203125 1,-1.25 0,-0.84375 -0.1875,-1.1875 -0.71875,-1.546875 0.09375,-0.0625 0.171875,-0.03125 0.21875,-0.03125 0.3125,0 0.78125,0.3125 0.78125,0.71875 v 2.03125 h 0.6875 v -2.078125 c 0,-0.140625 -0.046875,-0.3125 -0.140625,-0.5 H 7.625 V -0.1875 h 0.6875 v -2.578125 z m -6.015625,-0.5625 H 1.78125 V -4.4375 h 1.015625 z m 0,1.71875 c 0,0.390625 -0.15625,0.875 -0.984375,0.875 -0.765625,0 -0.9375,-0.359375 -0.9375,-0.875 0,-0.875 0.65625,-1.015625 0.828125,-1.015625 h 1.09375 z m 2.421875,0.15625 c 0,0.34375 -0.125,0.59375 -0.296875,0.59375 -0.4375,0 -0.734375,-0.4375 -0.734375,-0.90625 0,-0.328125 0.21875,-0.515625 0.421875,-0.515625 0.328125,0 0.609375,0.390625 0.609375,0.828125 z m 0,0"
           style="stroke:none" />
      </g>
    </g>
  </g>
</svg>
