<?xml version="1.0" standalone="no"?>
<!DOCTYPE svg PUBLIC "-//W3C//DTD SVG 1.1//EN" "http://www.w3.org/Graphics/SVG/1.1/DTD/svg11.dtd" >
<svg xmlns="http://www.w3.org/2000/svg" xmlns:xlink="http://www.w3.org/1999/xlink" version="1.1" viewBox="0 -410 2296 2048">
  <g transform="matrix(1 0 0 -1 0 1638)">
   <path fill="currentColor"
d="M580 984q178 0 234 -12q62 -14 140 -76q114 -90 188 -356q64 -236 142 -302q154 -138 328 -118q314 36 420 264q40 82 24 200q-14 116 -72 184q-108 124 -316 78q-68 -14 -116 -100q-10 -14 -14 -64q-4 -28 -4 -52l-116 2q0 28 2 62q8 74 30 112q74 128 194 154
q276 62 430 -116q86 -100 104 -246q18 -142 -40 -264q-134 -288 -514 -330q-224 -26 -418 146q-102 90 -178 360q-62 228 -146 294q-58 44 -94 54q-44 10 -208 10h-480v116h480z" />
  </g>

</svg>
