<?xml version="1.0" standalone="no"?>
<!DOCTYPE svg PUBLIC "-//W3C//DTD SVG 1.1//EN" "http://www.w3.org/Graphics/SVG/1.1/DTD/svg11.dtd" >
<svg xmlns="http://www.w3.org/2000/svg" xmlns:xlink="http://www.w3.org/1999/xlink" version="1.1" viewBox="0 -410 1984 2048">
  <g transform="matrix(1 0 0 -1 0 1638)">
   <path fill="currentColor"
d="M470 886v-346h246v346h-246zM494 74q90 0 156 58t66 138v172h-370q-52 0 -87 -35t-35 -87q0 -100 79 -173t191 -73zM936 442h-98v-172q0 -122 -101 -208t-243 -86q-162 0 -278 101t-116 243q0 90 73 155t173 65v444h836v-98h-344v-346h98q100 0 174 -72q6 -6 10 -12
l12 12q72 72 172 72q132 -2 214 -118q64 -94 66 -196v-22q0 -76 -6 -106h308v-98h-460l42 74q18 32 18 130v20q0 74 -48 142q-52 78 -134 78q-52 0 -87 -44t-35 -106v-294h-124v294q0 62 -35 105t-87 43z" />
  </g>

</svg>
