<?xml version="1.0" encoding="UTF-8" standalone="no"?>
<!-- Created with Inkscape (http://www.inkscape.org/) -->

<svg
   xmlns:dc="http://purl.org/dc/elements/1.1/"
   xmlns:cc="http://creativecommons.org/ns#"
   xmlns:rdf="http://www.w3.org/1999/02/22-rdf-syntax-ns#"
   xmlns:svg="http://www.w3.org/2000/svg"
   xmlns="http://www.w3.org/2000/svg"
   xmlns:sodipodi="http://sodipodi.sourceforge.net/DTD/sodipodi-0.dtd"
   xmlns:inkscape="http://www.inkscape.org/namespaces/inkscape"
   id="svg3396"
   version="1.1"
   inkscape:version="0.91 r13725"
   width="278.13556"
   height="181.86331"
   viewBox="0 0 278.13556 181.86331"
   sodipodi:docname="mukkal - முக்கால்.svg">
  <metadata
     id="metadata3402">
    <rdf:RDF>
      <cc:Work
         rdf:about="">
        <dc:format>image/svg+xml</dc:format>
        <dc:type
           rdf:resource="http://purl.org/dc/dcmitype/StillImage" />
        <dc:title></dc:title>
      </cc:Work>
    </rdf:RDF>
  </metadata>
  <defs
     id="defs3400" />
  <sodipodi:namedview
     pagecolor="#ffffff"
     bordercolor="#666666"
     borderopacity="1"
     objecttolerance="10"
     gridtolerance="10"
     guidetolerance="10"
     inkscape:pageopacity="0"
     inkscape:pageshadow="2"
     inkscape:window-width="1366"
     inkscape:window-height="705"
     id="namedview3398"
     showgrid="true"
     inkscape:zoom="2.1799584"
     inkscape:cx="165.97607"
     inkscape:cy="43.050144"
     inkscape:window-x="0"
     inkscape:window-y="30"
     inkscape:window-maximized="1"
     inkscape:current-layer="svg3396"
     fit-margin-top="0"
     fit-margin-left="0"
     fit-margin-right="0"
     fit-margin-bottom="0"
     showborder="false"
     showguides="true"
     inkscape:guide-bbox="true">
    <inkscape:grid
       type="xygrid"
       id="grid3368"
       originx="187.66215"
       originy="41.013777" />
    <sodipodi:guide
       position="206.66215,89.013777"
       orientation="1,0"
       id="guide3370" />
    <sodipodi:guide
       position="247.40652,59.013777"
       orientation="0,1"
       id="guide3372" />
    <sodipodi:guide
       position="239.66215,101.01378"
       orientation="1,0"
       id="guide3374" />
  </sodipodi:namedview>
  <path
     style="fill:#000000"
     d="m 212.66709,88.125197 c -13.40732,0 -24.28884,9.89839 -24.36452,23.395493 0,13.5029 7.82478,19.18958 18.9826,19.04792 6.0135,0 10.60471,-4.54502 10.76936,-10.57035 0.0307,-6.97467 -4.75586,-10.78558 -10.70367,-10.78558 -6.05219,0 -10.64701,3.81091 -10.64701,10.76256 0.0513,1.19371 0.27469,2.04835 0.68767,3.58962 -4.04787,-3.29731 -4.88273,-8.18317 -4.89168,-11.80198 0,-10.73929 9.98791,-19.239575 20.20218,-19.239575 12.78573,0 22.79525,11.500285 22.79525,15.778515 -6.00952,0 -9.54372,5.62615 -9.03261,11.74013 1.1857,7.57059 7.02309,13.39475 16.00628,13.39475 12.01681,0 15.33186,-8.41311 15.33186,-20.47656 9.68495,0 14.48255,3.146 14.48255,13.1876 0,11.48961 -16.22477,13.69918 -32.85274,13.76321 l -33.02235,0.12716 c -11.14116,0 -17.06009,4.98548 -17.06009,11.95172 0,3.03376 2.29184,5.58331 4.43629,8.19492 l 3.63779,-3.30387 c -2.01575,-2.05233 -2.99766,-2.85729 -2.99766,-4.95438 0,-4.51971 5.44496,-7.18304 12.07008,-7.20596 l 32.98999,0.006 c 16.00109,-2e-5 38.03544,-2.6207 38.03544,-18.64181 0,-10.97889 -7.03435,-17.27546 -20.00836,-17.44329 l 0,-7.75586 0,-7.755858 15.22833,-0.0929 -0.0265,-4.258618 -37.24355,-0.002 0.0214,11.187314 C 231.21373,92.551283 222.56924,88.125197 212.66709,88.125197 Z m 40.01862,4.96971 0.0446,15.259763 -12.55165,0.0413 0.0561,-15.278895 z m 0.0446,19.578533 c 0,9.06344 -1.24256,16.1578 -10.16714,16.1578 -7.07542,0 -11.2825,-4.80765 -11.2825,-8.77928 0,-3.02837 0.20708,-7.28267 4.66852,-7.28267 z m -45.42032,0.65787 c 3.67342,6.1e-4 6.65086,2.97893 6.65039,6.65234 -6.1e-4,3.67266 -2.97773,6.64978 -6.65039,6.65039 -3.67341,4.7e-4 -6.65173,-2.97697 -6.65234,-6.65039 -4.7e-4,-3.67418 2.97816,-6.6528 6.65234,-6.65234 z"
     id="path3406"
     inkscape:connector-curvature="0"
     sodipodi:nodetypes="ccccscccccccccscsccscccccccccccccccccccccccccc" />
  <rect
     style="opacity:1;fill:none;fill-opacity:1;stroke:#ff2a2a;stroke-width:0.50000006;stroke-linecap:round;stroke-linejoin:round;stroke-miterlimit:4;stroke-dasharray:1.00000003, 1.00000003;stroke-dashoffset:0;stroke-opacity:1"
     id="rect3350"
     width="89.946449"
     height="114.91668"
     x="187.93912"
     y="66.696632" />
  <g
     id="g3359"
     transform="matrix(3.5433071,0,0,3.5433071,-97.229718,-216.96859)">
    <rect
       y="61.303913"
       x="27.510942"
       height="16.96777"
       width="51.964855"
       id="rect3347"
       style="opacity:1;fill:#1a1a1a;fill-opacity:1;stroke:#ff2a2a;stroke-width:0.14111111;stroke-linecap:round;stroke-linejoin:round;stroke-miterlimit:4;stroke-dasharray:0.28222222, 0.28222222;stroke-dashoffset:0;stroke-opacity:1" />
    <text
       sodipodi:linespacing="125%"
       id="text3339"
       y="64.448685"
       x="28.661133"
       style="font-style:normal;font-weight:normal;font-size:9.63140392px;line-height:125%;font-family:sans-serif;letter-spacing:0px;word-spacing:0px;fill:#f9f9f9;fill-opacity:1;stroke:none;stroke-width:1px;stroke-linecap:butt;stroke-linejoin:miter;stroke-opacity:1"
       xml:space="preserve"><tspan
         style="font-style:normal;font-variant:normal;font-weight:normal;font-stretch:normal;font-size:3.00981379px;font-family:'American Typewriter';-inkscape-font-specification:'American Typewriter';fill:#f9f9f9"
         y="64.448685"
         x="28.661133"
         id="tspan3341"
         sodipodi:role="line">Glyph name :</tspan></text>
    <text
       xml:space="preserve"
       style="font-style:normal;font-weight:normal;font-size:11.28888893px;line-height:125%;font-family:sans-serif;letter-spacing:0px;word-spacing:0px;fill:#f9f9f9;fill-opacity:1;stroke:none;stroke-width:1px;stroke-linecap:butt;stroke-linejoin:miter;stroke-opacity:1"
       x="48.655766"
       y="64.322769"
       id="text3343"
       sodipodi:linespacing="125%"><tspan
         sodipodi:role="line"
         id="tspan3345"
         x="48.655766"
         y="64.322769"
         style="font-style:normal;font-variant:normal;font-weight:normal;font-stretch:normal;font-size:3.52777791px;font-family:'Uni Ila.Sundaram-07';-inkscape-font-specification:'Uni Ila.Sundaram-07';fill:#f9f9f9">முக்கால்</tspan></text>
    <text
       sodipodi:linespacing="125%"
       id="text3349"
       y="67.64711"
       x="29.506556"
       style="font-style:normal;font-weight:normal;font-size:11.28888893px;line-height:125%;font-family:sans-serif;letter-spacing:0px;word-spacing:0px;fill:#000000;fill-opacity:1;stroke:none;stroke-width:1px;stroke-linecap:butt;stroke-linejoin:miter;stroke-opacity:1"
       xml:space="preserve"><tspan
         style="font-style:normal;font-variant:normal;font-weight:normal;font-stretch:normal;font-size:1.76388896px;font-family:'American Typewriter';-inkscape-font-specification:'American Typewriter';fill:#ffffff"
         y="67.64711"
         x="29.506556"
         id="tspan3351"
         sodipodi:role="line">1. start with the raster image, resize, trace to vector.</tspan><tspan
         id="tspan3355"
         style="font-style:normal;font-variant:normal;font-weight:normal;font-stretch:normal;font-size:1.76388896px;font-family:'American Typewriter';-inkscape-font-specification:'American Typewriter';fill:#ffffff"
         y="69.851974"
         x="29.506556"
         sodipodi:role="line">2. use guidelines, boxes, simple geometries to edit.</tspan><tspan
         id="tspan3353"
         style="font-style:normal;font-variant:normal;font-weight:normal;font-stretch:normal;font-size:1.76388896px;font-family:'American Typewriter';-inkscape-font-specification:'American Typewriter';fill:#ffffff"
         y="72.056831"
         x="29.506556"
         sodipodi:role="line">3. use reduction process to remove unnecessary nodes.</tspan><tspan
         id="tspan3357"
         style="font-style:normal;font-variant:normal;font-weight:normal;font-stretch:normal;font-size:1.76388896px;font-family:'American Typewriter';-inkscape-font-specification:'American Typewriter';fill:#ffffff"
         y="74.261696"
         x="29.506556"
         sodipodi:role="line">4. use node tools to symmetrize and align with curvature.</tspan><tspan
         style="font-style:normal;font-variant:normal;font-weight:normal;font-stretch:normal;font-size:1.76388896px;font-family:'American Typewriter';-inkscape-font-specification:'American Typewriter';fill:#ffffff"
         y="76.466553"
         x="29.506556"
         sodipodi:role="line"
         id="tspan3375">5. use grids and snaps wherever possible.</tspan></text>
  </g>
</svg>
