<?xml version="1.0" standalone="no"?>
<!DOCTYPE svg PUBLIC "-//W3C//DTD SVG 1.1//EN" "http://www.w3.org/Graphics/SVG/1.1/DTD/svg11.dtd" >
<svg xmlns="http://www.w3.org/2000/svg" xmlns:xlink="http://www.w3.org/1999/xlink" version="1.1" viewBox="0 -324 636 1024">
  <g transform="matrix(1 0 0 -1 0 700)">
   <path fill="currentColor"
d="M139.5 75.5q-73.5 74.5 -73.5 180.5q0 103 73.5 176t178.5 73q104 0 178 -73t74 -176q0 -106 -74 -180.5t-178 -74.5q-105 0 -178.5 74.5zM457.5 108.5q58.5 60.5 58.5 147.5q0 83 -58.5 142.5t-141.5 59.5q-81 0 -138 -59.5t-57 -142.5q0 -87 57 -147.5t138 -60.5
q83 0 141.5 60.5z" />
  </g>

</svg>
