<?xml version="1.0" encoding="UTF-8" standalone="no"?>
<!-- Created with Inkscape (http://www.inkscape.org/) -->

<svg
   xmlns:dc="http://purl.org/dc/elements/1.1/"
   xmlns:cc="http://creativecommons.org/ns#"
   xmlns:rdf="http://www.w3.org/1999/02/22-rdf-syntax-ns#"
   xmlns:svg="http://www.w3.org/2000/svg"
   xmlns="http://www.w3.org/2000/svg"
   xmlns:sodipodi="http://sodipodi.sourceforge.net/DTD/sodipodi-0.dtd"
   xmlns:inkscape="http://www.inkscape.org/namespaces/inkscape"
   width="1.1652806mm"
   height="0.75254661mm"
   viewBox="0 0 1.1652806 0.75254661"
   version="1.1"
   id="svg2197"
   inkscape:version="0.92.4 (unknown)"
   sodipodi:docname="மாதம்.svg">
  <defs
     id="defs2191" />
  <sodipodi:namedview
     id="base"
     pagecolor="#ffffff"
     bordercolor="#666666"
     borderopacity="1.0"
     inkscape:pageopacity="0.0"
     inkscape:pageshadow="2"
     inkscape:zoom="256"
     inkscape:cx="2.2020899"
     inkscape:cy="1.4221344"
     inkscape:document-units="mm"
     inkscape:current-layer="layer1"
     showgrid="false"
     fit-margin-top="0"
     fit-margin-left="0"
     fit-margin-right="0"
     fit-margin-bottom="0"
     inkscape:window-width="1920"
     inkscape:window-height="1017"
     inkscape:window-x="0"
     inkscape:window-y="30"
     inkscape:window-maximized="1" />
  <metadata
     id="metadata2194">
    <rdf:RDF>
      <cc:Work
         rdf:about="">
        <dc:format>image/svg+xml</dc:format>
        <dc:type
           rdf:resource="http://purl.org/dc/dcmitype/StillImage" />
        <dc:title></dc:title>
      </cc:Work>
    </rdf:RDF>
  </metadata>
  <g
     inkscape:label="Layer 1"
     inkscape:groupmode="layer"
     id="layer1"
     transform="translate(170.67192,-66.05825)">
    <g
       transform="matrix(0.35277777,0,0,0.35277777,-250.3997,-31.367253)"
       id="g1153"
       style="fill:#211e1e;fill-opacity:1">
      <g
         id="use1151"
         transform="matrix(0.26458333,0,0,0.26458333,226,278.29999)">
        <path
           inkscape:connector-curvature="0"
           id="path2209"
           d="m 12.484375,-7.296875 -0.796875,-0.375 c -0.01563,0.53125 -0.53125,1.265625 -0.984375,1.265625 -0.8125,0 -0.703125,-1.40625 -2.375,-1.3125 C 7.96875,-7.9375 7.703125,-8.0625 7.25,-8.0625 c -1.125,0 -1.953125,0.890625 -1.953125,1.984375 0,0.25 0.015625,0.421875 0.15625,0.625 h -2 V -0.875 H 0.921875 V -5.453125 H 0 V 0 h 4.515625 c 2.203125,0 3,-1.28125 3,-2.75 0,-0.890625 -0.1875,-1.8125 -1.078125,-2.4375 -0.171875,-0.265625 -0.203125,-0.484375 -0.203125,-0.796875 0,-0.734375 0.40625,-1.078125 0.90625,-1.078125 -0.3125,0.28125 -0.40625,0.53125 -0.40625,0.9375 0,0.578125 0.421875,1.03125 1.125,1.03125 0.796875,0 1.359375,-0.765625 1.1875,-1.5 0.4375,0.640625 0.828125,1.140625 1.703125,1.140625 0.625,0 1.59375,-0.8125 1.734375,-1.84375 z M 8.0625,-6.75 C 8.328125,-6.53125 8.171875,-5.90625 7.859375,-5.90625 7.453125,-6.078125 7.671875,-6.71875 8.0625,-6.75 Z m -1.40625,4.03125 c 0,1.03125 -0.734375,1.8125 -1.703125,1.8125 h -0.53125 v -3.625 h 0.78125 c 1.1875,0 1.453125,1.015625 1.453125,1.8125 z m 0,0"
           style="stroke:none" />
      </g>
    </g>
  </g>
</svg>
