<?xml version="1.0" encoding="UTF-8" standalone="no"?>
<!-- Created with Inkscape (http://www.inkscape.org/) -->

<svg
   xmlns:dc="http://purl.org/dc/elements/1.1/"
   xmlns:cc="http://creativecommons.org/ns#"
   xmlns:rdf="http://www.w3.org/1999/02/22-rdf-syntax-ns#"
   xmlns:svg="http://www.w3.org/2000/svg"
   xmlns="http://www.w3.org/2000/svg"
   xmlns:sodipodi="http://sodipodi.sourceforge.net/DTD/sodipodi-0.dtd"
   xmlns:inkscape="http://www.inkscape.org/namespaces/inkscape"
   width="1.0340225mm"
   height="0.75400507mm"
   viewBox="0 0 1.0340225 0.75400507"
   version="1.1"
   id="svg2366"
   inkscape:version="0.92.4 (unknown)"
   sodipodi:docname="குழி.svg">
  <defs
     id="defs2360" />
  <sodipodi:namedview
     id="base"
     pagecolor="#ffffff"
     bordercolor="#666666"
     borderopacity="1.0"
     inkscape:pageopacity="0.0"
     inkscape:pageshadow="2"
     inkscape:zoom="256"
     inkscape:cx="1.954043"
     inkscape:cy="1.4248863"
     inkscape:document-units="mm"
     inkscape:current-layer="layer1"
     showgrid="false"
     fit-margin-top="0"
     fit-margin-left="0"
     fit-margin-right="0"
     fit-margin-bottom="0"
     inkscape:window-width="1920"
     inkscape:window-height="1017"
     inkscape:window-x="0"
     inkscape:window-y="30"
     inkscape:window-maximized="1" />
  <metadata
     id="metadata2363">
    <rdf:RDF>
      <cc:Work
         rdf:about="">
        <dc:format>image/svg+xml</dc:format>
        <dc:type
           rdf:resource="http://purl.org/dc/dcmitype/StillImage" />
        <dc:title></dc:title>
      </cc:Work>
    </rdf:RDF>
  </metadata>
  <g
     inkscape:label="Layer 1"
     inkscape:groupmode="layer"
     id="layer1"
     transform="translate(193.28486,-283.77181)">
    <g
       transform="matrix(0.35277777,0,0,0.35277777,-273.01264,168.32712)"
       id="g1195"
       style="fill:#211e1e;fill-opacity:1">
      <g
         id="use1193"
         transform="matrix(0.26458333,0,0,0.26458333,226,328.70001)">
        <path
           inkscape:connector-curvature="0"
           id="path2378"
           d="m 11.078125,0 v -2.65625 c 0,-0.9375 -0.796875,-1.703125 -1.78125,-1.703125 -1.125,0 -1.984375,0.78125 -1.984375,1.953125 V 0.25 h -0.875 c 0.203125,-0.46875 0.25,-0.75 0.25,-1.265625 0,-1.15625 -0.5625,-2.28125 -1.78125,-2.28125 H 4.046875 V -4.6875 H 5.8125 V -5.5 H 1.234375 v 2.25 C 0.453125,-3 0,-2.359375 0,-1.546875 c 0.015625,1.046875 0.984375,1.6875 2.078125,1.6875 0.96875,0 1.96875,-0.609375 1.96875,-1.6875 V -2.5 H 4.5625 c 0.84375,0 1.25,0.796875 1.25,1.5 0,0.484375 -0.203125,0.953125 -0.359375,1.296875 H 1.125 c -0.546875,0 -1.0625,0.28125 -1.0625,0.84375 0,1.03125 1.34375,1.4375 2.421875,1.4375 1.484375,0 2.84375,-0.625 3.578125,-1.5625 h 2.171875 v -3.28125 c 0,-0.625 0.3125,-1.1875 1,-1.1875 0.4375,0 0.796875,0.3125 0.796875,0.828125 V 0 Z M 3.03125,-3.296875 H 2.203125 v -1.375 H 3.03125 Z m 0,1.765625 c 0.015625,0.515625 -0.4375,0.875 -0.9375,0.875 C 1.53125,-0.65625 0.984375,-1.015625 1,-1.59375 1.015625,-2.0625 1.328125,-2.5 1.796875,-2.5 H 3.03125 Z m 1.75,2.5625 c -0.625,0.515625 -1.34375,0.734375 -2.265625,0.734375 -0.625,0 -1.53125,-0.21875 -1.53125,-0.515625 0,-0.109375 0.109375,-0.21875 0.25,-0.21875 z m 0,0"
           style="stroke:none" />
      </g>
    </g>
  </g>
</svg>
