<?xml version="1.0" encoding="UTF-8" standalone="no"?>
<!-- Created with Inkscape (http://www.inkscape.org/) -->

<svg
   xmlns:dc="http://purl.org/dc/elements/1.1/"
   xmlns:cc="http://creativecommons.org/ns#"
   xmlns:rdf="http://www.w3.org/1999/02/22-rdf-syntax-ns#"
   xmlns:svg="http://www.w3.org/2000/svg"
   xmlns="http://www.w3.org/2000/svg"
   xmlns:sodipodi="http://sodipodi.sourceforge.net/DTD/sodipodi-0.dtd"
   xmlns:inkscape="http://www.inkscape.org/namespaces/inkscape"
   width="0.9479754mm"
   height="0.85609472mm"
   viewBox="0 0 0.9479754 0.85609472"
   version="1.1"
   id="svg1550"
   inkscape:version="0.92.4 (unknown)"
   sodipodi:docname="ளம்.svg">
  <defs
     id="defs1544" />
  <sodipodi:namedview
     id="base"
     pagecolor="#ffffff"
     bordercolor="#666666"
     borderopacity="1.0"
     inkscape:pageopacity="0.0"
     inkscape:pageshadow="2"
     inkscape:zoom="256"
     inkscape:cx="1.7914587"
     inkscape:cy="1.6178165"
     inkscape:document-units="mm"
     inkscape:current-layer="layer1"
     showgrid="false"
     fit-margin-top="0"
     fit-margin-left="0"
     fit-margin-right="0"
     fit-margin-bottom="0"
     inkscape:window-width="1920"
     inkscape:window-height="1017"
     inkscape:window-x="0"
     inkscape:window-y="30"
     inkscape:window-maximized="1" />
  <metadata
     id="metadata1547">
    <rdf:RDF>
      <cc:Work
         rdf:about="">
        <dc:format>image/svg+xml</dc:format>
        <dc:type
           rdf:resource="http://purl.org/dc/dcmitype/StillImage" />
        <dc:title></dc:title>
      </cc:Work>
    </rdf:RDF>
  </metadata>
  <g
     inkscape:label="Layer 1"
     inkscape:groupmode="layer"
     id="layer1"
     transform="translate(236.33113,-31.232667)">
    <g
       transform="matrix(0.35277777,0,0,0.35277777,-452.83789,-48.897271)"
       id="g1757"
       style="fill:#211e1e;fill-opacity:1">
      <g
         id="use1755"
         transform="matrix(0.26458333,0,0,0.26458333,613.71997,228.62)">
        <path
           inkscape:connector-curvature="0"
           id="path1562"
           d="M 10.15625,-1.390625 V -5.59375 H 9.3125 v 3.890625 c 0,0.578125 -0.40625,1.125 -0.921875,1.125 -0.40625,0 -0.515625,-0.03125 -0.515625,-0.5 v -4.40625 H 4.625 V -5 C 4.125,-5.390625 3.703125,-5.546875 3.078125,-5.546875 1.40625,-5.546875 0,-4.671875 0,-2.578125 0,-0.875 0.75,0.203125 2.046875,0.203125 3.09375,0.203125 4,-0.453125 4,-1.65625 4,-2.59375 3.453125,-3.390625 2.359375,-3.390625 c -0.59375,0 -0.921875,0.09375 -1.390625,0.578125 0.03125,-1.296875 0.921875,-1.90625 2,-1.90625 0.921875,0 1.40625,0.75 1.40625,1.5625 V 0 H 5.390625 V -4.625 H 6.9375 v 4.640625 c -1.015625,0.3125 -3.34375,0.828125 -3.34375,2.3125 0,0.8125 0.71875,1.25 1.453125,1.25 1.015625,0 2.859375,-1.625 2.78125,-2.84375 0.65625,-0.265625 2.328125,-0.84375 2.328125,-2.125 z m -7.125,-0.15625 c 0,0.515625 -0.40625,0.921875 -0.921875,0.921875 -0.5,0 -0.890625,-0.40625 -0.890625,-0.921875 0,-0.5 0.390625,-0.890625 0.890625,-0.890625 0.515625,0 0.921875,0.390625 0.921875,0.890625 z m 3.765625,2.625 C 6.484375,2.078125 5.09375,3 4.671875,2.5625 4.125,1.984375 6.078125,1.140625 6.796875,1.078125 Z m 0,0"
           style="stroke:none" />
      </g>
    </g>
  </g>
</svg>
