<?xml version="1.0" standalone="no"?>
<!DOCTYPE svg PUBLIC "-//W3C//DTD SVG 1.1//EN" "http://www.w3.org/Graphics/SVG/1.1/DTD/svg11.dtd" >
<svg xmlns="http://www.w3.org/2000/svg" xmlns:xlink="http://www.w3.org/1999/xlink" version="1.1" viewBox="0 -324 1142 1024">
  <g transform="matrix(1 0 0 -1 0 700)">
   <path fill="currentColor"
d="M658 414q-30 -36 -28 -103q-1 -61 33 -127h-51q-34 40 -40 131q-4 72 37 131t142 59q88 0 134.5 -53.5t40.5 -167.5q-4 -67 -17 -99h111v308h61v-615h-61v258h-123q-37 -100 -146.5 -160.5t-253.5 -60.5q-95 0 -187 25t-175 73q-34 20 -54 46.5t-20 52.5q0 31 25 52
t61 21h701q21 45 20 99q6 47 -10 102.5t-107 65.5q-63 -2 -93 -38zM147 75q53 -53 142.5 -82t201.5 -29q127 0 221.5 47.5t122.5 124.5h-688q-10 0 -17.5 -7.5t-7.5 -16.5q0 -6 6.5 -15.5t18.5 -21.5z" />
  </g>

</svg>
