<?xml version="1.0" standalone="no"?>
<!DOCTYPE svg PUBLIC "-//W3C//DTD SVG 1.1//EN" "http://www.w3.org/Graphics/SVG/1.1/DTD/svg11.dtd" >
<svg xmlns="http://www.w3.org/2000/svg" xmlns:xlink="http://www.w3.org/1999/xlink" version="1.1" viewBox="0 -507 2038 2048">
  <g transform="matrix(1 0 0 -1 0 1638)">
   <path fill="currentColor"
d="M1260 1054q122 -6 232 -72q126 -74 160 -186q38 -124 -22 -262q-36 -84 -140 -224q-212 -284 -208 -412q4 -174 118 -248q58 -38 146 -42q88 -2 140 32q66 44 102 146q36 98 24 190q-12 94 -62 174q-52 80 -112 92l22 110q108 -22 184 -144q64 -100 78 -218
q16 -126 -26 -244q-46 -132 -148 -198q-88 -60 -206 -54q-112 4 -202 62q-164 106 -170 340q-4 166 230 480q96 130 128 204q44 100 18 182q-22 72 -110 124q-86 52 -182 58q-136 6 -224 -116q-54 -74 -30 -332q12 -134 2 -202q-16 -118 -94 -184q-126 -110 -328 -110
t-328 110q-142 122 -150 386q-2 82 8 216q10 160 12 202l110 -2q0 -52 -10 -208q-10 -132 -8 -206q6 -214 112 -304q94 -82 254 -82t256 82q46 38 56 114q8 58 -4 178q-28 298 50 406q126 172 322 162z" />
  </g>

</svg>
