<?xml version="1.0" encoding="UTF-8" standalone="no"?>
<!-- Created with Inkscape (http://www.inkscape.org/) -->

<svg
   xmlns:dc="http://purl.org/dc/elements/1.1/"
   xmlns:cc="http://creativecommons.org/ns#"
   xmlns:rdf="http://www.w3.org/1999/02/22-rdf-syntax-ns#"
   xmlns:svg="http://www.w3.org/2000/svg"
   xmlns="http://www.w3.org/2000/svg"
   xmlns:sodipodi="http://sodipodi.sourceforge.net/DTD/sodipodi-0.dtd"
   xmlns:inkscape="http://www.inkscape.org/namespaces/inkscape"
   id="svg3396"
   version="1.1"
   inkscape:version="0.91 r13725"
   width="278.13556"
   height="181.86331"
   viewBox="0 0 278.13556 181.86331"
   sodipodi:docname="rentu-ma - இரண்டு-மா.svg">
  <metadata
     id="metadata3402">
    <rdf:RDF>
      <cc:Work
         rdf:about="">
        <dc:format>image/svg+xml</dc:format>
        <dc:type
           rdf:resource="http://purl.org/dc/dcmitype/StillImage" />
        <dc:title></dc:title>
      </cc:Work>
    </rdf:RDF>
  </metadata>
  <defs
     id="defs3400" />
  <sodipodi:namedview
     pagecolor="#ffffff"
     bordercolor="#666666"
     borderopacity="1"
     objecttolerance="10"
     gridtolerance="10"
     guidetolerance="10"
     inkscape:pageopacity="0"
     inkscape:pageshadow="2"
     inkscape:window-width="1366"
     inkscape:window-height="705"
     id="namedview3398"
     showgrid="true"
     inkscape:zoom="2.5483871"
     inkscape:cx="146.64036"
     inkscape:cy="89.39257"
     inkscape:window-x="0"
     inkscape:window-y="30"
     inkscape:window-maximized="1"
     inkscape:current-layer="svg3396"
     showguides="true"
     inkscape:guide-bbox="true"
     fit-margin-top="0"
     fit-margin-left="0"
     fit-margin-right="0"
     fit-margin-bottom="0"
     showborder="false">
    <inkscape:grid
       type="xygrid"
       id="grid3365"
       originx="187.92549"
       originy="4.7487807" />
    <sodipodi:guide
       position="214.92549,86.74878"
       orientation="0,1"
       id="guide3367" />
    <sodipodi:guide
       position="211.3719,19.748781"
       orientation="1,0"
       id="guide3369" />
  </sodipodi:namedview>
  <g
     id="g4199"
     transform="matrix(0.63053847,0,0,0.63053847,140.45088,46.1405)">
    <path
       style="fill:#000000"
       d="M 40.392628,1.1647795 C 23.446408,1.6968884 12.692574,10.566179 12.484424,23.806641 c 0.230019,10.997278 9.832103,19.11914 19.791016,19.11914 10.813212,-0.01675 19.900391,-8.006554 19.900391,-19.019531 0.116215,-5.090696 -1.65333,-10.050719 -4.679687,-13.316406 6.81938,0 18.932358,5.329269 18.932358,17.148437 0,8.929732 -15.101902,16.504826 -30.309361,23.810547 -12.931556,7.222415 -36.10742225,14.369726 -36.10742225,34.515625 0,12.920395 9.88214245,19.816407 23.49804725,19.816407 10.380384,0 18.088249,-11.174057 21.597656,-16.251954 6.892012,14.290464 15.892122,16.291014 19.99414,16.291014 10.897982,0 21.658204,-8.90924 21.658204,-31.925779 l -8.853516,-0.03125 c 0,16.193154 -4.988199,21.676127 -12.867188,21.676127 -11.039965,0 -14.039269,-11.719465 -19.910156,-21.301127 -5.129115,8.883883 -14.290606,22.353515 -21.699218,22.353515 -7.591387,0 -12.935547,-4.24523 -12.935547,-11.048828 C 10.648459,75.256304 23.857546,68.956456 34.179688,62.996959 49.999028,53.86366 76.582081,47.664174 76.582081,27.644531 76.582081,10.919113 58.999999,1.1647795 40.392628,1.1647795 Z M 32.255909,11.767578 c 6.627521,-1e-6 11.808594,5.483808 11.808594,12.111328 0,6.62752 -5.37248,12.000002 -12,12 -6.627521,-2e-6 -12,-5.372482 -12,-12 0,-6.627517 5.563886,-12.111326 12.191406,-12.111328 z"
       transform="matrix(1.5859461,0,0,1.5859461,75.292178,39.73575)"
       id="path3406"
       inkscape:connector-curvature="0"
       sodipodi:nodetypes="cccccscsscsccscscsscsssss" />
  </g>
  <rect
     style="opacity:1;fill:none;fill-opacity:1;stroke:#ff2a2a;stroke-width:0.50000006;stroke-linecap:round;stroke-linejoin:round;stroke-miterlimit:4;stroke-dasharray:1.00000003, 1.00000003;stroke-dashoffset:0;stroke-opacity:1"
     id="rect3350"
     width="89.946449"
     height="114.91668"
     x="187.93912"
     y="66.696632" />
  <g
     id="g3359"
     transform="matrix(3.5433071,0,0,3.5433071,-97.229718,-216.96859)">
    <rect
       y="61.303913"
       x="27.510942"
       height="16.96777"
       width="51.964855"
       id="rect3347"
       style="opacity:1;fill:#1a1a1a;fill-opacity:1;stroke:#ff2a2a;stroke-width:0.14111111;stroke-linecap:round;stroke-linejoin:round;stroke-miterlimit:4;stroke-dasharray:0.28222222, 0.28222222;stroke-dashoffset:0;stroke-opacity:1" />
    <text
       sodipodi:linespacing="125%"
       id="text3339"
       y="64.448685"
       x="28.661133"
       style="font-style:normal;font-weight:normal;font-size:9.63140392px;line-height:125%;font-family:sans-serif;letter-spacing:0px;word-spacing:0px;fill:#f9f9f9;fill-opacity:1;stroke:none;stroke-width:1px;stroke-linecap:butt;stroke-linejoin:miter;stroke-opacity:1"
       xml:space="preserve"><tspan
         style="font-style:normal;font-variant:normal;font-weight:normal;font-stretch:normal;font-size:3.00981379px;font-family:'American Typewriter';-inkscape-font-specification:'American Typewriter';fill:#f9f9f9"
         y="64.448685"
         x="28.661133"
         id="tspan3341"
         sodipodi:role="line">Glyph name :</tspan></text>
    <text
       xml:space="preserve"
       style="font-style:normal;font-weight:normal;font-size:11.28888893px;line-height:125%;font-family:sans-serif;letter-spacing:0px;word-spacing:0px;fill:#f9f9f9;fill-opacity:1;stroke:none;stroke-width:1px;stroke-linecap:butt;stroke-linejoin:miter;stroke-opacity:1"
       x="48.655766"
       y="64.322769"
       id="text3343"
       sodipodi:linespacing="125%"><tspan
         sodipodi:role="line"
         id="tspan3345"
         x="48.655766"
         y="64.322769"
         style="font-style:normal;font-variant:normal;font-weight:normal;font-stretch:normal;font-size:3.52777791px;font-family:'Uni Ila.Sundaram-07';-inkscape-font-specification:'Uni Ila.Sundaram-07';fill:#f9f9f9">இரண்டுமா</tspan></text>
    <text
       sodipodi:linespacing="125%"
       id="text3349"
       y="67.64711"
       x="29.506556"
       style="font-style:normal;font-weight:normal;font-size:11.28888893px;line-height:125%;font-family:sans-serif;letter-spacing:0px;word-spacing:0px;fill:#000000;fill-opacity:1;stroke:none;stroke-width:1px;stroke-linecap:butt;stroke-linejoin:miter;stroke-opacity:1"
       xml:space="preserve"><tspan
         style="font-style:normal;font-variant:normal;font-weight:normal;font-stretch:normal;font-size:1.76388896px;font-family:'American Typewriter';-inkscape-font-specification:'American Typewriter';fill:#ffffff"
         y="67.64711"
         x="29.506556"
         id="tspan3351"
         sodipodi:role="line">1. start with the raster image, resize, trace to vector.</tspan><tspan
         id="tspan3355"
         style="font-style:normal;font-variant:normal;font-weight:normal;font-stretch:normal;font-size:1.76388896px;font-family:'American Typewriter';-inkscape-font-specification:'American Typewriter';fill:#ffffff"
         y="69.851974"
         x="29.506556"
         sodipodi:role="line">2. use guidelines, boxes, simple geometries to edit.</tspan><tspan
         id="tspan3353"
         style="font-style:normal;font-variant:normal;font-weight:normal;font-stretch:normal;font-size:1.76388896px;font-family:'American Typewriter';-inkscape-font-specification:'American Typewriter';fill:#ffffff"
         y="72.056831"
         x="29.506556"
         sodipodi:role="line">3. use reduction process to remove unnecessary nodes.</tspan><tspan
         id="tspan3357"
         style="font-style:normal;font-variant:normal;font-weight:normal;font-stretch:normal;font-size:1.76388896px;font-family:'American Typewriter';-inkscape-font-specification:'American Typewriter';fill:#ffffff"
         y="74.261696"
         x="29.506556"
         sodipodi:role="line">4. use node tools to symmetrize and align with curvature.</tspan><tspan
         style="font-style:normal;font-variant:normal;font-weight:normal;font-stretch:normal;font-size:1.76388896px;font-family:'American Typewriter';-inkscape-font-specification:'American Typewriter';fill:#ffffff"
         y="76.466553"
         x="29.506556"
         sodipodi:role="line"
         id="tspan3375">5. use grids and snaps wherever possible.</tspan></text>
  </g>
</svg>
