<?xml version="1.0" standalone="no"?>
<!DOCTYPE svg PUBLIC "-//W3C//DTD SVG 1.1//EN" "http://www.w3.org/Graphics/SVG/1.1/DTD/svg11.dtd" >
<svg xmlns="http://www.w3.org/2000/svg" xmlns:xlink="http://www.w3.org/1999/xlink" version="1.1" viewBox="0 -640 2410 2048">
  <g transform="matrix(1 0 0 -1 0 1638)">
   <path fill="currentColor"
d="M490 -246q-20 0 -35 -11t-15 -25q0 -106 180 -182t436 -76q212 0 380 78t246 216h-1192zM100 0v984h124v-886h710v640q0 114 78 192t192 78q74 0 131 -33t77 -89q32 56 99 89t147 33q148 0 252 -159t104 -417q0 -178 -38 -316t-110 -264h320v1132h124v-1230h-492
q-106 -182 -310 -288t-452 -106q-304 0 -521 105t-217 253q0 56 50 95t122 39h1254q72 126 110 264t38 316q0 208 -69 331t-165 123q-76 0 -130 -43t-54 -105v-738h-124v738q0 72 -43 122t-103 50q-62 0 -105 -51t-43 -121v-738h-956z" />
  </g>

</svg>
