<?xml version="1.0" encoding="UTF-8" standalone="no"?>
<!-- Created with Inkscape (http://www.inkscape.org/) -->

<svg
   xmlns:dc="http://purl.org/dc/elements/1.1/"
   xmlns:cc="http://creativecommons.org/ns#"
   xmlns:rdf="http://www.w3.org/1999/02/22-rdf-syntax-ns#"
   xmlns:svg="http://www.w3.org/2000/svg"
   xmlns="http://www.w3.org/2000/svg"
   xmlns:sodipodi="http://sodipodi.sourceforge.net/DTD/sodipodi-0.dtd"
   xmlns:inkscape="http://www.inkscape.org/namespaces/inkscape"
   width="315.89413mm"
   height="285.61349mm"
   viewBox="0 0 315.89413 285.61349"
   version="1.1"
   id="svg36114"
   inkscape:version="0.92.5 (0.92.5+68)"
   sodipodi:docname="Ticket - 2.svg"
   inkscape:export-filename="/media/cosmobird/Work/Cooperative/3 - Repo/uauto/uauto-interaction-design/V 0.0.2/mock/Rasters/Ticket - 2.png"
   inkscape:export-xdpi="96"
   inkscape:export-ydpi="96">
  <defs
     id="defs36108">
    <filter
       style="color-interpolation-filters:sRGB"
       inkscape:label="Drop Shadow"
       id="filter17567">
      <feFlood
         flood-opacity="0.498039"
         flood-color="rgb(0,0,0)"
         result="flood"
         id="feFlood17557" />
      <feComposite
         in="flood"
         in2="SourceGraphic"
         operator="in"
         result="composite1"
         id="feComposite17559" />
      <feGaussianBlur
         in="composite1"
         stdDeviation="1"
         result="blur"
         id="feGaussianBlur17561" />
      <feOffset
         dx="1"
         dy="1"
         result="offset"
         id="feOffset17563" />
      <feComposite
         in="SourceGraphic"
         in2="offset"
         operator="over"
         result="composite2"
         id="feComposite17565" />
    </filter>
    <filter
       style="color-interpolation-filters:sRGB"
       inkscape:label="Drop Shadow"
       id="filter8806">
      <feFlood
         flood-opacity="0.498039"
         flood-color="rgb(0,0,0)"
         result="flood"
         id="feFlood8796" />
      <feComposite
         in="flood"
         in2="SourceGraphic"
         operator="out"
         result="composite1"
         id="feComposite8798" />
      <feGaussianBlur
         in="composite1"
         stdDeviation="1"
         result="blur"
         id="feGaussianBlur8800" />
      <feOffset
         dx="1"
         dy="1"
         result="offset"
         id="feOffset8802" />
      <feComposite
         in="offset"
         in2="SourceGraphic"
         operator="in"
         result="composite2"
         id="feComposite8804" />
    </filter>
    <filter
       inkscape:label="Film Grain"
       inkscape:menu="Image Effects"
       inkscape:menu-tooltip="Adds a small scale graininess"
       style="color-interpolation-filters:sRGB"
       id="filter18141-2">
      <feTurbulence
         type="fractalNoise"
         numOctaves="3"
         baseFrequency="1"
         seed="0"
         result="result0"
         id="feTurbulence18131-0" />
      <feColorMatrix
         result="result4"
         values="0"
         type="saturate"
         id="feColorMatrix18133-6" />
      <feComposite
         k4="0"
         in="SourceGraphic"
         in2="result4"
         operator="arithmetic"
         k1="1.25"
         k2="0.5"
         k3="0.5"
         result="result2"
         id="feComposite18135-1" />
      <feBlend
         result="result5"
         mode="normal"
         in="result2"
         in2="SourceGraphic"
         id="feBlend18137-5" />
      <feComposite
         in="result5"
         in2="SourceGraphic"
         operator="in"
         result="result3"
         id="feComposite18139-5" />
    </filter>
    <filter
       style="color-interpolation-filters:sRGB"
       inkscape:label="Drop Shadow"
       id="filter18153-4">
      <feFlood
         flood-opacity="0.498039"
         flood-color="rgb(0,0,0)"
         result="flood"
         id="feFlood18143-7" />
      <feComposite
         in="flood"
         in2="SourceGraphic"
         operator="in"
         result="composite1"
         id="feComposite18145-6" />
      <feGaussianBlur
         in="composite1"
         stdDeviation="1"
         result="blur"
         id="feGaussianBlur18147-5" />
      <feOffset
         dx="1"
         dy="1"
         result="offset"
         id="feOffset18149-6" />
      <feComposite
         in="SourceGraphic"
         in2="offset"
         operator="over"
         result="composite2"
         id="feComposite18151-9" />
    </filter>
    <filter
       style="color-interpolation-filters:sRGB"
       inkscape:label="Drop Shadow"
       id="filter8806-2-3">
      <feFlood
         flood-opacity="0.498039"
         flood-color="rgb(0,0,0)"
         result="flood"
         id="feFlood8796-8-7" />
      <feComposite
         in="flood"
         in2="SourceGraphic"
         operator="out"
         result="composite1"
         id="feComposite8798-9-4" />
      <feGaussianBlur
         in="composite1"
         stdDeviation="1"
         result="blur"
         id="feGaussianBlur8800-7-5" />
      <feOffset
         dx="1"
         dy="1"
         result="offset"
         id="feOffset8802-3-2" />
      <feComposite
         in="offset"
         in2="SourceGraphic"
         operator="in"
         result="composite2"
         id="feComposite8804-6-5" />
    </filter>
  </defs>
  <sodipodi:namedview
     id="base"
     pagecolor="#ffffff"
     bordercolor="#666666"
     borderopacity="1.0"
     inkscape:pageopacity="0.0"
     inkscape:pageshadow="2"
     inkscape:zoom="0.49497475"
     inkscape:cx="680.02917"
     inkscape:cy="477.15319"
     inkscape:document-units="mm"
     inkscape:current-layer="layer1"
     showgrid="false"
     fit-margin-top="0"
     fit-margin-left="0"
     fit-margin-right="0"
     fit-margin-bottom="0"
     inkscape:window-width="1920"
     inkscape:window-height="1017"
     inkscape:window-x="0"
     inkscape:window-y="30"
     inkscape:window-maximized="1" />
  <metadata
     id="metadata36111">
    <rdf:RDF>
      <cc:Work
         rdf:about="">
        <dc:format>image/svg+xml</dc:format>
        <dc:type
           rdf:resource="http://purl.org/dc/dcmitype/StillImage" />
        <dc:title></dc:title>
      </cc:Work>
    </rdf:RDF>
  </metadata>
  <g
     inkscape:label="Layer 1"
     inkscape:groupmode="layer"
     id="layer1"
     transform="translate(370.36971,60.497254)">
    <g
       style="display:inline"
       transform="translate(-3174.7869,-3250.8618)"
       id="g35514">
      <path
         style="display:inline;opacity:1;fill:#fbedc5;fill-opacity:1;stroke:none;stroke-width:1;filter:url(#filter18141-2)"
         d="m 16954.85,12125.201 c -8.687,0 -15.68,6.993 -15.68,15.68 v 252.074 c 12.318,7.939 12.853,24.574 0,33.086 v 26.164 a 9.9436891,9.9436891 0 0 1 9.943,9.943 9.9436891,9.9436891 0 0 1 -9.943,9.944 v 4.476 a 9.9436891,9.9436891 0 0 1 9.943,9.944 9.9436891,9.9436891 0 0 1 -9.943,9.943 v 4.477 a 9.9436891,9.9436891 0 0 1 9.943,9.943 9.9436891,9.9436891 0 0 1 -9.943,9.943 v 4.477 a 9.9436891,9.9436891 0 0 1 9.943,9.945 9.9436891,9.9436891 0 0 1 -9.943,9.944 v 4.476 a 9.9436891,9.9436891 0 0 1 9.943,9.944 9.9436891,9.9436891 0 0 1 -9.943,9.943 v 4.476 a 9.9436891,9.9436891 0 0 1 9.943,9.944 9.9436891,9.9436891 0 0 1 -9.943,9.943 v 4.477 a 9.9436891,9.9436891 0 0 1 9.943,9.945 9.9436891,9.9436891 0 0 1 -9.943,9.943 v 4.475 a 9.9436891,9.9436891 0 0 1 9.943,9.943 9.9436891,9.9436891 0 0 1 -9.943,9.946 v 4.476 a 9.9436891,9.9436891 0 0 1 9.943,9.944 9.9436891,9.9436891 0 0 1 -9.943,9.943 v 4.477 a 9.9436891,9.9436891 0 0 1 9.943,9.943 9.9436891,9.9436891 0 0 1 -9.943,9.943 v 4.477 a 9.9436891,9.9436891 0 0 1 9.943,9.943 9.9436891,9.9436891 0 0 1 -9.943,9.945 v 4.477 a 9.9436891,9.9436891 0 0 1 9.943,9.943 9.9436891,9.9436891 0 0 1 -9.943,9.944 v 4.476 a 9.9436891,9.9436891 0 0 1 9.943,9.944 9.9436891,9.9436891 0 0 1 -9.943,9.943 v 4.477 a 9.9436891,9.9436891 0 0 1 9.943,9.943 9.9436891,9.9436891 0 0 1 -9.943,9.943 v 4.477 a 9.9436891,9.9436891 0 0 1 9.943,9.943 9.9436891,9.9436891 0 0 1 -9.943,9.946 v 4.474 a 9.9436891,9.9436891 0 0 1 9.943,9.945 9.9436891,9.9436891 0 0 1 -9.943,9.944 v 4.476 a 9.9436891,9.9436891 0 0 1 9.943,9.944 9.9436891,9.9436891 0 0 1 -9.943,9.943 v 4.477 a 9.9436891,9.9436891 0 0 1 9.943,9.943 9.9436891,9.9436891 0 0 1 -9.943,9.943 v 4.477 a 9.9436891,9.9436891 0 0 1 9.943,9.945 9.9436891,9.9436891 0 0 1 -9.943,9.944 v 4.474 a 9.9436891,9.9436891 0 0 1 9.943,9.946 9.9436891,9.9436891 0 0 1 -9.943,9.943 v 4.476 a 9.9436891,9.9436891 0 0 1 9.943,9.944 9.9436891,9.9436891 0 0 1 -9.943,9.943 v 4.477 a 9.9436891,9.9436891 0 0 1 9.943,9.943 9.9436891,9.9436891 0 0 1 -9.943,9.943 v 25.36 c 0,8.687 6.993,15.681 15.68,15.681 h 13.22 a 9.9436891,9.9436891 0 0 1 9.944,-9.943 9.9436891,9.9436891 0 0 1 9.943,9.943 h 4.572 a 9.9436891,9.9436891 0 0 1 9.944,-9.943 9.9436891,9.9436891 0 0 1 9.943,9.943 h 4.572 a 9.9436891,9.9436891 0 0 1 9.944,-9.943 9.9436891,9.9436891 0 0 1 9.943,9.943 h 4.572 a 9.9436891,9.9436891 0 0 1 9.944,-9.943 9.9436891,9.9436891 0 0 1 9.943,9.943 h 4.572 a 9.9436891,9.9436891 0 0 1 9.944,-9.943 9.9436891,9.9436891 0 0 1 9.943,9.943 h 4.572 a 9.9436891,9.9436891 0 0 1 9.944,-9.943 9.9436891,9.9436891 0 0 1 9.943,9.943 h 4.572 a 9.9436891,9.9436891 0 0 1 9.944,-9.943 9.9436891,9.9436891 0 0 1 9.943,9.943 h 4.572 a 9.9436891,9.9436891 0 0 1 9.944,-9.943 9.9436891,9.9436891 0 0 1 9.943,9.943 h 4.574 a 9.9436891,9.9436891 0 0 1 9.944,-9.943 9.9436891,9.9436891 0 0 1 9.943,9.943 h 4.57 a 9.9436891,9.9436891 0 0 1 9.944,-9.943 9.9436891,9.9436891 0 0 1 9.943,9.943 h 4.572 a 9.9436891,9.9436891 0 0 1 9.944,-9.943 9.9436891,9.9436891 0 0 1 9.943,9.943 h 4.572 a 9.9436891,9.9436891 0 0 1 9.943,-9.943 9.9436891,9.9436891 0 0 1 9.944,9.943 h 4.572 a 9.9436891,9.9436891 0 0 1 9.943,-9.943 9.9436891,9.9436891 0 0 1 9.944,9.943 h 4.572 a 9.9436891,9.9436891 0 0 1 9.943,-9.943 9.9436891,9.9436891 0 0 1 9.944,9.943 h 4.572 a 9.9436891,9.9436891 0 0 1 9.943,-9.943 9.9436891,9.9436891 0 0 1 9.944,9.943 h 4.572 a 9.9436891,9.9436891 0 0 1 9.943,-9.943 9.9436891,9.9436891 0 0 1 9.944,9.943 h 4.572 a 9.9436891,9.9436891 0 0 1 9.943,-9.943 9.9436891,9.9436891 0 0 1 9.944,9.943 h 4.572 a 9.9436891,9.9436891 0 0 1 9.945,-9.943 9.9436891,9.9436891 0 0 1 9.944,9.943 h 4.57 a 9.9436891,9.9436891 0 0 1 9.943,-9.943 9.9436891,9.9436891 0 0 1 9.944,9.943 h 4.572 a 9.9436891,9.9436891 0 0 1 9.943,-9.943 9.9436891,9.9436891 0 0 1 9.944,9.943 h 4.572 a 9.9436891,9.9436891 0 0 1 9.945,-9.943 9.9436891,9.9436891 0 0 1 9.944,9.943 h 4.568 a 9.9436891,9.9436891 0 0 1 9.945,-9.943 9.9436891,9.9436891 0 0 1 9.944,9.943 h 4.57 a 9.9436891,9.9436891 0 0 1 9.945,-9.943 9.9436891,9.9436891 0 0 1 9.944,9.943 h 4.572 a 9.9436891,9.9436891 0 0 1 9.943,-9.943 9.9436891,9.9436891 0 0 1 9.944,9.943 h 4.57 a 9.9436891,9.9436891 0 0 1 9.945,-9.943 9.9436891,9.9436891 0 0 1 9.944,9.943 h 4.572 a 9.9436891,9.9436891 0 0 1 9.943,-9.943 9.9436891,9.9436891 0 0 1 9.944,9.943 h 4.572 a 9.9436891,9.9436891 0 0 1 9.943,-9.943 9.9436891,9.9436891 0 0 1 9.944,9.943 h 4.572 a 9.9436891,9.9436891 0 0 1 9.943,-9.943 9.9436891,9.9436891 0 0 1 9.944,9.943 h 4.572 a 9.9436891,9.9436891 0 0 1 9.945,-9.943 9.9436891,9.9436891 0 0 1 9.944,9.943 h 4.568 a 9.9436891,9.9436891 0 0 1 9.945,-9.943 9.9436891,9.9436891 0 0 1 9.944,9.943 h 4.572 a 9.9436891,9.9436891 0 0 1 9.943,-9.943 9.9436891,9.9436891 0 0 1 9.944,9.943 h 4.572 a 9.9436891,9.9436891 0 0 1 9.945,-9.943 9.9436891,9.9436891 0 0 1 9.944,9.943 h 4.568 a 9.9436891,9.9436891 0 0 1 9.945,-9.943 9.9436891,9.9436891 0 0 1 9.944,9.943 h 4.57 a 9.9436891,9.9436891 0 0 1 9.945,-9.943 9.9436891,9.9436891 0 0 1 9.944,9.943 h 4.572 a 9.9436891,9.9436891 0 0 1 9.943,-9.943 9.9436891,9.9436891 0 0 1 9.943,9.943 h 4.573 a 9.9436891,9.9436891 0 0 1 9.943,-9.943 9.9436891,9.9436891 0 0 1 9.943,9.943 h 4.571 a 9.9436891,9.9436891 0 0 1 9.945,-9.943 9.9436891,9.9436891 0 0 1 9.943,9.943 h 4.573 a 9.9436891,9.9436891 0 0 1 9.943,-9.943 9.9436891,9.9436891 0 0 1 9.943,9.943 h 25.475 c 8.687,0 15.682,-6.994 15.682,-15.681 v -20.883 -4.477 c -5.492,0 -9.944,-4.451 -9.944,-9.943 0,-5.492 4.452,-9.943 9.944,-9.943 v -4.477 c -5.492,0 -9.944,-4.451 -9.944,-9.943 0,-5.492 4.452,-9.944 9.944,-9.944 v -4.476 c -5.492,0 -9.945,-4.453 -9.944,-9.945 0,-5.492 4.452,-9.944 9.944,-9.944 v -4.474 c -5.492,0 -9.944,-4.452 -9.944,-9.944 0,-5.492 4.452,-9.943 9.944,-9.943 v -4.479 c -5.492,0 -9.944,-4.451 -9.944,-9.943 0,-5.492 4.452,-9.943 9.944,-9.943 v -4.477 c -5.492,0 -9.944,-4.451 -9.944,-9.943 0,-5.492 4.452,-9.944 9.944,-9.944 v -4.476 c -5.492,0 -9.944,-4.452 -9.944,-9.944 0,-5.492 4.452,-9.943 9.944,-9.943 v -4.476 c -5.493,0 -9.945,-4.453 -9.944,-9.946 0,-5.492 4.452,-9.943 9.944,-9.943 v -4.477 c -5.492,0 -9.944,-4.451 -9.944,-9.943 0,-5.492 4.452,-9.943 9.944,-9.943 v -4.477 c -5.492,0 -9.944,-4.451 -9.944,-9.943 0,-5.492 4.452,-9.944 9.944,-9.944 v -4.476 c -5.492,0 -9.944,-4.452 -9.944,-9.944 0,-5.492 4.452,-9.943 9.944,-9.943 v -4.477 c -5.492,0 -9.945,-4.453 -9.944,-9.945 0,-5.492 4.452,-9.943 9.944,-9.943 v -4.477 c -5.492,0 -9.944,-4.451 -9.944,-9.943 0,-5.492 4.452,-9.943 9.944,-9.943 v -4.477 c -5.492,0 -9.944,-4.451 -9.944,-9.943 0,-5.492 4.452,-9.944 9.944,-9.944 v -4.476 c -5.492,0 -9.944,-4.452 -9.944,-9.944 -10e-4,-5.492 4.452,-9.945 9.944,-9.945 v -4.475 c -5.492,0 -9.944,-4.451 -9.944,-9.943 0,-5.492 4.452,-9.943 9.944,-9.943 v -4.477 c -5.492,0 -9.945,-4.453 -9.944,-9.945 0,-5.492 4.452,-9.944 9.944,-9.944 v -4.476 c -5.492,0 -9.944,-4.451 -9.944,-9.943 0,-5.492 4.452,-9.944 9.944,-9.944 v -4.476 c -5.492,0 -9.944,-4.452 -9.944,-9.944 -10e-4,-5.492 4.452,-9.945 9.944,-9.945 v -4.477 c -5.492,0 -9.944,-4.451 -9.944,-9.943 0,-5.492 4.452,-9.943 9.944,-9.943 v -4.477 c -5.492,0 -9.944,-4.451 -9.944,-9.943 0,-5.492 4.452,-9.944 9.944,-9.944 v -4.476 c -5.492,0 -9.944,-4.452 -9.944,-9.944 0,-5.492 4.452,-9.943 9.944,-9.943 v -26.685 c -12.391,-7.188 -12.87,-24.057 0,-31.877 v -252.762 c 0,-8.687 -6.995,-15.68 -15.682,-15.68 z"
         transform="matrix(0.26458334,0,0,0.26458334,-1651.0763,6.0394905)"
         id="path35262"
         inkscape:connector-curvature="0" />
      <path
         inkscape:connector-curvature="0"
         id="path35264"
         transform="matrix(0.26458334,0,0,0.26458334,-1651.0763,6.0394902)"
         d="m 16954.85,12125.201 c -8.687,0 -15.68,6.993 -15.68,15.68 v 252.074 c 12.318,7.939 12.853,24.574 0,33.086 v 26.164 a 9.9436891,9.9436891 0 0 1 9.943,9.943 9.9436891,9.9436891 0 0 1 -9.943,9.944 v 4.476 a 9.9436891,9.9436891 0 0 1 9.943,9.944 9.9436891,9.9436891 0 0 1 -9.943,9.943 v 4.477 a 9.9436891,9.9436891 0 0 1 9.943,9.943 9.9436891,9.9436891 0 0 1 -9.943,9.943 v 4.477 a 9.9436891,9.9436891 0 0 1 9.943,9.945 9.9436891,9.9436891 0 0 1 -9.943,9.944 v 4.476 a 9.9436891,9.9436891 0 0 1 9.943,9.944 9.9436891,9.9436891 0 0 1 -9.943,9.943 v 4.476 a 9.9436891,9.9436891 0 0 1 9.943,9.944 9.9436891,9.9436891 0 0 1 -9.943,9.943 v 4.477 a 9.9436891,9.9436891 0 0 1 9.943,9.945 9.9436891,9.9436891 0 0 1 -9.943,9.943 v 4.475 a 9.9436891,9.9436891 0 0 1 9.943,9.943 9.9436891,9.9436891 0 0 1 -9.943,9.946 v 4.476 a 9.9436891,9.9436891 0 0 1 9.943,9.944 9.9436891,9.9436891 0 0 1 -9.943,9.943 v 4.477 a 9.9436891,9.9436891 0 0 1 9.943,9.943 9.9436891,9.9436891 0 0 1 -9.943,9.943 v 4.477 a 9.9436891,9.9436891 0 0 1 9.943,9.943 9.9436891,9.9436891 0 0 1 -9.943,9.945 v 4.477 a 9.9436891,9.9436891 0 0 1 9.943,9.943 9.9436891,9.9436891 0 0 1 -9.943,9.944 v 4.476 a 9.9436891,9.9436891 0 0 1 9.943,9.944 9.9436891,9.9436891 0 0 1 -9.943,9.943 v 4.477 a 9.9436891,9.9436891 0 0 1 9.943,9.943 9.9436891,9.9436891 0 0 1 -9.943,9.943 v 4.477 a 9.9436891,9.9436891 0 0 1 9.943,9.943 9.9436891,9.9436891 0 0 1 -9.943,9.946 v 4.474 a 9.9436891,9.9436891 0 0 1 9.943,9.945 9.9436891,9.9436891 0 0 1 -9.943,9.944 v 4.476 a 9.9436891,9.9436891 0 0 1 9.943,9.944 9.9436891,9.9436891 0 0 1 -9.943,9.943 v 4.477 a 9.9436891,9.9436891 0 0 1 9.943,9.943 9.9436891,9.9436891 0 0 1 -9.943,9.943 v 4.477 a 9.9436891,9.9436891 0 0 1 9.943,9.945 9.9436891,9.9436891 0 0 1 -9.943,9.944 v 4.474 a 9.9436891,9.9436891 0 0 1 9.943,9.946 9.9436891,9.9436891 0 0 1 -9.943,9.943 v 4.476 a 9.9436891,9.9436891 0 0 1 9.943,9.944 9.9436891,9.9436891 0 0 1 -9.943,9.943 v 4.477 a 9.9436891,9.9436891 0 0 1 9.943,9.943 9.9436891,9.9436891 0 0 1 -9.943,9.943 v 25.36 c 0,8.687 6.993,15.681 15.68,15.681 h 13.22 a 9.9436891,9.9436891 0 0 1 9.944,-9.943 9.9436891,9.9436891 0 0 1 9.943,9.943 h 4.572 a 9.9436891,9.9436891 0 0 1 9.944,-9.943 9.9436891,9.9436891 0 0 1 9.943,9.943 h 4.572 a 9.9436891,9.9436891 0 0 1 9.944,-9.943 9.9436891,9.9436891 0 0 1 9.943,9.943 h 4.572 a 9.9436891,9.9436891 0 0 1 9.944,-9.943 9.9436891,9.9436891 0 0 1 9.943,9.943 h 4.572 a 9.9436891,9.9436891 0 0 1 9.944,-9.943 9.9436891,9.9436891 0 0 1 9.943,9.943 h 4.572 a 9.9436891,9.9436891 0 0 1 9.944,-9.943 9.9436891,9.9436891 0 0 1 9.943,9.943 h 4.572 a 9.9436891,9.9436891 0 0 1 9.944,-9.943 9.9436891,9.9436891 0 0 1 9.943,9.943 h 4.572 a 9.9436891,9.9436891 0 0 1 9.944,-9.943 9.9436891,9.9436891 0 0 1 9.943,9.943 h 4.574 a 9.9436891,9.9436891 0 0 1 9.944,-9.943 9.9436891,9.9436891 0 0 1 9.943,9.943 h 4.57 a 9.9436891,9.9436891 0 0 1 9.944,-9.943 9.9436891,9.9436891 0 0 1 9.943,9.943 h 4.572 a 9.9436891,9.9436891 0 0 1 9.944,-9.943 9.9436891,9.9436891 0 0 1 9.943,9.943 h 4.572 a 9.9436891,9.9436891 0 0 1 9.943,-9.943 9.9436891,9.9436891 0 0 1 9.944,9.943 h 4.572 a 9.9436891,9.9436891 0 0 1 9.943,-9.943 9.9436891,9.9436891 0 0 1 9.944,9.943 h 4.572 a 9.9436891,9.9436891 0 0 1 9.943,-9.943 9.9436891,9.9436891 0 0 1 9.944,9.943 h 4.572 a 9.9436891,9.9436891 0 0 1 9.943,-9.943 9.9436891,9.9436891 0 0 1 9.944,9.943 h 4.572 a 9.9436891,9.9436891 0 0 1 9.943,-9.943 9.9436891,9.9436891 0 0 1 9.944,9.943 h 4.572 a 9.9436891,9.9436891 0 0 1 9.943,-9.943 9.9436891,9.9436891 0 0 1 9.944,9.943 h 4.572 a 9.9436891,9.9436891 0 0 1 9.945,-9.943 9.9436891,9.9436891 0 0 1 9.944,9.943 h 4.57 a 9.9436891,9.9436891 0 0 1 9.943,-9.943 9.9436891,9.9436891 0 0 1 9.944,9.943 h 4.572 a 9.9436891,9.9436891 0 0 1 9.943,-9.943 9.9436891,9.9436891 0 0 1 9.944,9.943 h 4.572 a 9.9436891,9.9436891 0 0 1 9.945,-9.943 9.9436891,9.9436891 0 0 1 9.944,9.943 h 4.568 a 9.9436891,9.9436891 0 0 1 9.945,-9.943 9.9436891,9.9436891 0 0 1 9.944,9.943 h 4.57 a 9.9436891,9.9436891 0 0 1 9.945,-9.943 9.9436891,9.9436891 0 0 1 9.944,9.943 h 4.572 a 9.9436891,9.9436891 0 0 1 9.943,-9.943 9.9436891,9.9436891 0 0 1 9.944,9.943 h 4.57 a 9.9436891,9.9436891 0 0 1 9.945,-9.943 9.9436891,9.9436891 0 0 1 9.944,9.943 h 4.572 a 9.9436891,9.9436891 0 0 1 9.943,-9.943 9.9436891,9.9436891 0 0 1 9.944,9.943 h 4.572 a 9.9436891,9.9436891 0 0 1 9.943,-9.943 9.9436891,9.9436891 0 0 1 9.944,9.943 h 4.572 a 9.9436891,9.9436891 0 0 1 9.943,-9.943 9.9436891,9.9436891 0 0 1 9.944,9.943 h 4.572 a 9.9436891,9.9436891 0 0 1 9.945,-9.943 9.9436891,9.9436891 0 0 1 9.944,9.943 h 4.568 a 9.9436891,9.9436891 0 0 1 9.945,-9.943 9.9436891,9.9436891 0 0 1 9.944,9.943 h 4.572 a 9.9436891,9.9436891 0 0 1 9.943,-9.943 9.9436891,9.9436891 0 0 1 9.944,9.943 h 4.572 a 9.9436891,9.9436891 0 0 1 9.945,-9.943 9.9436891,9.9436891 0 0 1 9.944,9.943 h 4.568 a 9.9436891,9.9436891 0 0 1 9.945,-9.943 9.9436891,9.9436891 0 0 1 9.944,9.943 h 4.57 a 9.9436891,9.9436891 0 0 1 9.945,-9.943 9.9436891,9.9436891 0 0 1 9.944,9.943 h 4.572 a 9.9436891,9.9436891 0 0 1 9.943,-9.943 9.9436891,9.9436891 0 0 1 9.943,9.943 h 4.573 a 9.9436891,9.9436891 0 0 1 9.943,-9.943 9.9436891,9.9436891 0 0 1 9.943,9.943 h 4.571 a 9.9436891,9.9436891 0 0 1 9.945,-9.943 9.9436891,9.9436891 0 0 1 9.943,9.943 h 4.573 a 9.9436891,9.9436891 0 0 1 9.943,-9.943 9.9436891,9.9436891 0 0 1 9.943,9.943 h 25.475 c 8.687,0 15.682,-6.994 15.682,-15.681 v -20.883 -4.477 c -5.492,0 -9.944,-4.451 -9.944,-9.943 0,-5.492 4.452,-9.943 9.944,-9.943 v -4.477 c -5.492,0 -9.944,-4.451 -9.944,-9.943 0,-5.492 4.452,-9.944 9.944,-9.944 v -4.476 c -5.492,0 -9.945,-4.453 -9.944,-9.945 0,-5.492 4.452,-9.944 9.944,-9.944 v -4.474 c -5.492,0 -9.944,-4.452 -9.944,-9.944 0,-5.492 4.452,-9.943 9.944,-9.943 v -4.479 c -5.492,0 -9.944,-4.451 -9.944,-9.943 0,-5.492 4.452,-9.943 9.944,-9.943 v -4.477 c -5.492,0 -9.944,-4.451 -9.944,-9.943 0,-5.492 4.452,-9.944 9.944,-9.944 v -4.476 c -5.492,0 -9.944,-4.452 -9.944,-9.944 0,-5.492 4.452,-9.943 9.944,-9.943 v -4.476 c -5.493,0 -9.945,-4.453 -9.944,-9.946 0,-5.492 4.452,-9.943 9.944,-9.943 v -4.477 c -5.492,0 -9.944,-4.451 -9.944,-9.943 0,-5.492 4.452,-9.943 9.944,-9.943 v -4.477 c -5.492,0 -9.944,-4.451 -9.944,-9.943 0,-5.492 4.452,-9.944 9.944,-9.944 v -4.476 c -5.492,0 -9.944,-4.452 -9.944,-9.944 0,-5.492 4.452,-9.943 9.944,-9.943 v -4.477 c -5.492,0 -9.945,-4.453 -9.944,-9.945 0,-5.492 4.452,-9.943 9.944,-9.943 v -4.477 c -5.492,0 -9.944,-4.451 -9.944,-9.943 0,-5.492 4.452,-9.943 9.944,-9.943 v -4.477 c -5.492,0 -9.944,-4.451 -9.944,-9.943 0,-5.492 4.452,-9.944 9.944,-9.944 v -4.476 c -5.492,0 -9.944,-4.452 -9.944,-9.944 -10e-4,-5.492 4.452,-9.945 9.944,-9.945 v -4.475 c -5.492,0 -9.944,-4.451 -9.944,-9.943 0,-5.492 4.452,-9.943 9.944,-9.943 v -4.477 c -5.492,0 -9.945,-4.453 -9.944,-9.945 0,-5.492 4.452,-9.944 9.944,-9.944 v -4.476 c -5.492,0 -9.944,-4.451 -9.944,-9.943 0,-5.492 4.452,-9.944 9.944,-9.944 v -4.476 c -5.492,0 -9.944,-4.452 -9.944,-9.944 -10e-4,-5.492 4.452,-9.945 9.944,-9.945 v -4.477 c -5.492,0 -9.944,-4.451 -9.944,-9.943 0,-5.492 4.452,-9.943 9.944,-9.943 v -4.477 c -5.492,0 -9.944,-4.451 -9.944,-9.943 0,-5.492 4.452,-9.944 9.944,-9.944 v -4.476 c -5.492,0 -9.944,-4.452 -9.944,-9.944 0,-5.492 4.452,-9.943 9.944,-9.943 v -26.685 c -12.391,-7.188 -12.87,-24.057 0,-31.877 v -252.762 c 0,-8.687 -6.995,-15.68 -15.682,-15.68 z"
         style="display:inline;opacity:0.5;fill:#fbedc5;fill-opacity:1;stroke:none;stroke-width:1;filter:url(#filter18153-4)" />
      <g
         id="g35512">
        <g
           id="g35292"
           transform="translate(-733.98731,22.725123)">
          <path
             sodipodi:nodetypes="cc"
             inkscape:connector-curvature="0"
             id="path35266"
             d="M 3777.0243,3211.4754 H 3614.0612"
             style="display:inline;fill:#4d4d4d;stroke:#797979;stroke-width:2.11666679;stroke-linecap:round;stroke-linejoin:round;stroke-miterlimit:4;stroke-dasharray:6.35000014, 6.35000014;stroke-dashoffset:0;stroke-opacity:1" />
          <g
             style="display:inline;stroke-width:0.47403643"
             transform="matrix(2.1095425,0,0,2.1095425,-2602.4193,-1646.2592)"
             id="g35276">
            <circle
               style="opacity:1;fill:none;fill-opacity:1;fill-rule:nonzero;stroke:#333333;stroke-width:0.37626645;stroke-linecap:round;stroke-linejoin:round;stroke-miterlimit:4;stroke-dasharray:none;stroke-dashoffset:0;stroke-opacity:1;paint-order:normal"
               id="circle35268"
               cx="2947.0593"
               cy="2302.7432"
               r="3.2886682" />
            <circle
               r="1.4458965"
               cy="2302.7432"
               cx="2947.0593"
               id="circle35270"
               style="opacity:1;fill:#ffbc00;fill-opacity:1;fill-rule:nonzero;stroke:#333333;stroke-width:0.37626645;stroke-linecap:round;stroke-linejoin:round;stroke-miterlimit:4;stroke-dasharray:none;stroke-dashoffset:0;stroke-opacity:1;paint-order:normal" />
            <circle
               style="opacity:1;fill:#333333;fill-opacity:1;fill-rule:nonzero;stroke:none;stroke-width:0.37626645;stroke-linecap:round;stroke-linejoin:round;stroke-miterlimit:4;stroke-dasharray:none;stroke-dashoffset:0;stroke-opacity:1;paint-order:normal"
               id="circle35272"
               cx="2947.0593"
               cy="2309.0088"
               r="0.62711072" />
            <circle
               r="0.62711072"
               cy="2309.0088"
               cx="3024.5974"
               id="circle35274"
               style="opacity:1;fill:#333333;fill-opacity:1;fill-rule:nonzero;stroke:none;stroke-width:0.37626645;stroke-linecap:round;stroke-linejoin:round;stroke-miterlimit:4;stroke-dasharray:none;stroke-dashoffset:0;stroke-opacity:1;paint-order:normal" />
          </g>
          <text
             id="text35280"
             y="3214.0178"
             x="3587.9431"
             style="font-style:normal;font-variant:normal;font-weight:normal;font-stretch:normal;font-size:10.58333397px;line-height:1.25;font-family:TAU_Elango_Godavari;-inkscape-font-specification:TAU_Elango_Godavari;letter-spacing:0px;word-spacing:0px;display:inline;fill:#333333;fill-opacity:1;stroke:none;stroke-width:0.26458332"
             xml:space="preserve"><tspan
               style="font-style:normal;font-variant:normal;font-weight:bold;font-stretch:normal;font-size:7.05555582px;font-family:'Tlwg Typewriter';-inkscape-font-specification:'Tlwg Typewriter Bold';text-align:center;text-anchor:middle;fill:#333333;fill-opacity:1;stroke-width:0.26458332"
               y="3214.0178"
               x="3587.9431"
               id="tspan35278"
               sodipodi:role="line">07:24 PM</tspan></text>
          <text
             xml:space="preserve"
             style="font-style:normal;font-variant:normal;font-weight:normal;font-stretch:normal;font-size:10.58333397px;line-height:1.25;font-family:TAU_Elango_Godavari;-inkscape-font-specification:TAU_Elango_Godavari;letter-spacing:0px;word-spacing:0px;display:inline;fill:#333333;fill-opacity:1;stroke:none;stroke-width:0.26458332"
             x="3804.085"
             y="3214.0161"
             id="text35284"><tspan
               sodipodi:role="line"
               id="tspan35282"
               x="3804.085"
               y="3214.0161"
               style="font-style:normal;font-variant:normal;font-weight:bold;font-stretch:normal;font-size:7.05555582px;font-family:'Tlwg Typewriter';-inkscape-font-specification:'Tlwg Typewriter Bold';text-align:center;text-anchor:middle;fill:#333333;fill-opacity:1;stroke-width:0.26458332">07:50 PM</tspan></text>
          <g
             id="g35290"
             transform="matrix(2.1095425,0,0,2.1095425,-2438.8492,-1646.2592)"
             style="display:inline;stroke-width:0.47403643">
            <circle
               r="3.2886682"
               cy="2302.7432"
               cx="2947.0593"
               id="circle35286"
               style="opacity:1;fill:none;fill-opacity:1;fill-rule:nonzero;stroke:#333333;stroke-width:0.37626645;stroke-linecap:round;stroke-linejoin:round;stroke-miterlimit:4;stroke-dasharray:none;stroke-dashoffset:0;stroke-opacity:1;paint-order:normal" />
            <circle
               style="opacity:1;fill:#ffbc00;fill-opacity:1;fill-rule:nonzero;stroke:#333333;stroke-width:0.37626645;stroke-linecap:round;stroke-linejoin:round;stroke-miterlimit:4;stroke-dasharray:none;stroke-dashoffset:0;stroke-opacity:1;paint-order:normal"
               id="circle35288"
               cx="2947.0593"
               cy="2302.7432"
               r="1.4458965" />
          </g>
        </g>
        <text
           xml:space="preserve"
           style="font-style:normal;font-variant:normal;font-weight:normal;font-stretch:normal;font-size:10.58333397px;line-height:1.25;font-family:TAU_Elango_Godavari;-inkscape-font-specification:TAU_Elango_Godavari;letter-spacing:0px;word-spacing:0px;display:inline;fill:#333333;fill-opacity:1;stroke:none;stroke-width:0.26458332"
           x="2962.894"
           y="3273.8152"
           id="text35296"><tspan
             sodipodi:role="line"
             id="tspan35294"
             x="2962.894"
             y="3273.8152"
             style="font-style:normal;font-variant:normal;font-weight:bold;font-stretch:normal;font-size:16.93333435px;font-family:'Tlwg Typewriter';-inkscape-font-specification:'Tlwg Typewriter Bold';text-align:center;text-anchor:middle;fill:#333333;fill-opacity:1;stroke-width:0.26458332">43.75 Rs.</tspan></text>
        <path
           sodipodi:nodetypes="ccczccccssccc"
           inkscape:connector-curvature="0"
           id="path35298"
           d="m 2832.1203,3284.0423 h 261.8665 v 1.1252 c 0,0 -2.3075,0.9481 -2.5267,4.0078 -0.2192,3.0597 2.5225,4.4644 2.5225,4.4644 v 0.8725 h -263.2347 v -0.7493 c 1.6573,-0.9875 2.5228,-2.628 2.5173,-4.4856 -0.01,-3.0608 -2.5173,-4.2684 -2.5173,-4.378 v -0.8503 c 0.1463,5e-4 1.0766,0 1.3744,-0.01 z"
           style="display:inline;fill:#f5d169;fill-opacity:1;stroke-width:0.26458335" />
        <g
           style="display:inline"
           id="g35368"
           transform="translate(-737.59341,109.62669)">
          <rect
             height="27.045631"
             width="1.8030422"
             id="rect35300"
             y="3194.2979"
             x="3644.5161"
             style="fill:#000000;stroke-width:0.26458299" />
          <rect
             height="27.045631"
             width="0.90152109"
             id="rect35302"
             y="3194.2979"
             x="3647.2207"
             style="fill:#000000;stroke-width:0.26458299" />
          <rect
             height="27.045631"
             width="2.7045631"
             id="rect35304"
             y="3194.2979"
             x="3649.9253"
             style="fill:#000000;stroke-width:0.26458299" />
          <rect
             height="27.045631"
             width="1.8030422"
             id="rect35306"
             y="3194.2979"
             x="3654.4329"
             style="fill:#000000;stroke-width:0.26458299" />
          <rect
             height="27.045631"
             width="2.7045631"
             id="rect35308"
             y="3194.2979"
             x="3658.0391"
             style="fill:#000000;stroke-width:0.26458299" />
          <rect
             height="27.045631"
             width="0.90152109"
             id="rect35310"
             y="3194.2979"
             x="3661.645"
             style="fill:#000000;stroke-width:0.26458299" />
          <rect
             height="27.045631"
             width="3.6060843"
             id="rect35312"
             y="3194.2979"
             x="3664.3496"
             style="fill:#000000;stroke-width:0.26458299" />
          <rect
             height="27.045631"
             width="0.90152109"
             id="rect35314"
             y="3194.2979"
             x="3668.8572"
             style="fill:#000000;stroke-width:0.26458299" />
          <rect
             height="27.045631"
             width="0.90152109"
             id="rect35316"
             y="3194.2979"
             x="3671.5618"
             style="fill:#000000;stroke-width:0.26458299" />
          <rect
             height="27.045631"
             width="1.8030422"
             id="rect35318"
             y="3194.2979"
             x="3674.2664"
             style="fill:#000000;stroke-width:0.26458299" />
          <rect
             height="27.045631"
             width="0.90152109"
             id="rect35320"
             y="3194.2979"
             x="3679.6755"
             style="fill:#000000;stroke-width:0.26458299" />
          <rect
             height="27.045631"
             width="0.90152109"
             id="rect35322"
             y="3194.2979"
             x="3681.4785"
             style="fill:#000000;stroke-width:0.26458299" />
          <rect
             height="27.045631"
             width="0.90152109"
             id="rect35324"
             y="3194.2979"
             x="3684.1831"
             style="fill:#000000;stroke-width:0.26458299" />
          <rect
             height="27.045631"
             width="0.90152109"
             id="rect35326"
             y="3194.2979"
             x="3685.9861"
             style="fill:#000000;stroke-width:0.26458299" />
          <rect
             height="27.045631"
             width="3.6060843"
             id="rect35328"
             y="3194.2979"
             x="3687.7893"
             style="fill:#000000;stroke-width:0.26458299" />
          <rect
             height="27.045631"
             width="0.90152109"
             id="rect35330"
             y="3194.2979"
             x="3694.0999"
             style="fill:#000000;stroke-width:0.26458299" />
          <rect
             height="27.045631"
             width="0.90152109"
             id="rect35332"
             y="3194.2979"
             x="3695.9028"
             style="fill:#000000;stroke-width:0.26458299" />
          <rect
             height="27.045631"
             width="1.8030422"
             id="rect35334"
             y="3194.2979"
             x="3700.4104"
             style="fill:#000000;stroke-width:0.26458299" />
          <rect
             height="27.045631"
             width="0.90152109"
             id="rect35336"
             y="3194.2979"
             x="3704.0166"
             style="fill:#000000;stroke-width:0.26458299" />
          <rect
             height="27.045631"
             width="1.8030422"
             id="rect35338"
             y="3194.2979"
             x="3707.6226"
             style="fill:#000000;stroke-width:0.26458299" />
          <rect
             height="27.045631"
             width="0.90152109"
             id="rect35340"
             y="3194.2979"
             x="3710.3271"
             style="fill:#000000;stroke-width:0.26458299" />
          <rect
             height="27.045631"
             width="2.7045631"
             id="rect35342"
             y="3194.2979"
             x="3713.9333"
             style="fill:#000000;stroke-width:0.26458299" />
          <rect
             height="27.045631"
             width="0.90152109"
             id="rect35344"
             y="3194.2979"
             x="3717.5393"
             style="fill:#000000;stroke-width:0.26458299" />
          <rect
             height="27.045631"
             width="3.6060843"
             id="rect35346"
             y="3194.2979"
             x="3719.3425"
             style="fill:#000000;stroke-width:0.26458299" />
          <rect
             height="27.045631"
             width="1.8030422"
             id="rect35348"
             y="3194.2979"
             x="3723.8501"
             style="fill:#000000;stroke-width:0.26458299" />
          <rect
             height="27.045631"
             width="2.7045631"
             id="rect35350"
             y="3194.2979"
             x="3726.5547"
             style="fill:#000000;stroke-width:0.26458299" />
          <rect
             height="27.045631"
             width="0.90152109"
             id="rect35352"
             y="3194.2979"
             x="3731.0623"
             style="fill:#000000;stroke-width:0.26458299" />
          <rect
             height="27.045631"
             width="1.8030422"
             id="rect35354"
             y="3194.2979"
             x="3733.7668"
             style="fill:#000000;stroke-width:0.26458299" />
          <rect
             height="27.045631"
             width="2.7045631"
             id="rect35356"
             y="3194.2979"
             x="3736.4714"
             style="fill:#000000;stroke-width:0.26458299" />
          <rect
             height="27.045631"
             width="0.90152109"
             id="rect35358"
             y="3194.2979"
             x="3741.8804"
             style="fill:#000000;stroke-width:0.26458299" />
          <rect
             height="27.045631"
             width="1.8030422"
             id="rect35360"
             y="3194.2979"
             x="3743.6836"
             style="fill:#000000;stroke-width:0.26458299" />
          <rect
             height="27.045631"
             width="2.7045631"
             id="rect35362"
             y="3194.2979"
             x="3748.1912"
             style="fill:#000000;stroke-width:0.26458299" />
          <rect
             height="27.045631"
             width="0.90152109"
             id="rect35364"
             y="3194.2979"
             x="3751.7971"
             style="fill:#000000;stroke-width:0.26458299" />
          <rect
             height="27.045631"
             width="1.8030422"
             id="rect35366"
             y="3194.2979"
             x="3753.6003"
             style="fill:#000000;stroke-width:0.26458299" />
        </g>
        <g
           id="g35382"
           transform="matrix(1.0105242,0,0,1.0083538,-268.09315,1031.7334)"
           style="display:inline;stroke-width:0.99064982">
          <g
             style="stroke-width:0.4696041"
             transform="matrix(2.1095425,0,0,2.1095425,-3130.5723,-2539.9862)"
             id="g35374">
            <circle
               style="opacity:1;fill:none;fill-opacity:1;fill-rule:nonzero;stroke:#333333;stroke-width:0.37274832;stroke-linecap:round;stroke-linejoin:round;stroke-miterlimit:4;stroke-dasharray:none;stroke-dashoffset:0;stroke-opacity:1;paint-order:normal"
               id="circle35370"
               cx="2947.0593"
               cy="2302.7432"
               r="3.2886682" />
            <circle
               r="1.4458965"
               cy="2302.7432"
               cx="2947.0593"
               id="circle35372"
               style="opacity:1;fill:#ffbc00;fill-opacity:1;fill-rule:nonzero;stroke:#333333;stroke-width:0.37274832;stroke-linecap:round;stroke-linejoin:round;stroke-miterlimit:4;stroke-dasharray:none;stroke-dashoffset:0;stroke-opacity:1;paint-order:normal" />
          </g>
          <path
             inkscape:connector-curvature="0"
             id="path35376"
             d="m 3086.3747,2314.6982 v -3.8874"
             style="fill:none;stroke:#333333;stroke-width:0.78632838;stroke-linecap:round;stroke-linejoin:round;stroke-miterlimit:4;stroke-dasharray:none;stroke-opacity:1" />
          <path
             inkscape:connector-curvature="0"
             id="path35378"
             d="m 3083.6997,2319.2141 -3.3671,1.9439"
             style="fill:none;stroke:#333333;stroke-width:0.78632838;stroke-linecap:round;stroke-linejoin:round;stroke-miterlimit:4;stroke-dasharray:none;stroke-opacity:1" />
          <path
             inkscape:connector-curvature="0"
             id="path35380"
             d="m 3089.1639,2318.9827 3.375,1.9486"
             style="fill:none;stroke:#333333;stroke-width:0.78632838;stroke-linecap:round;stroke-linejoin:round;stroke-miterlimit:4;stroke-dasharray:none;stroke-opacity:1" />
        </g>
        <text
           id="text35386"
           y="3371.844"
           x="2909.5784"
           style="font-style:normal;font-variant:normal;font-weight:normal;font-stretch:normal;font-size:10.58333397px;line-height:1.25;font-family:TAU_Elango_Godavari;-inkscape-font-specification:TAU_Elango_Godavari;letter-spacing:0px;word-spacing:0px;display:inline;fill:#333333;fill-opacity:1;stroke:none;stroke-width:0.26458332"
           xml:space="preserve"><tspan
             style="font-style:normal;font-variant:normal;font-weight:bold;font-stretch:normal;font-size:9.87777805px;font-family:'Tlwg Typewriter';-inkscape-font-specification:'Tlwg Typewriter Bold';text-align:center;text-anchor:middle;fill:#333333;fill-opacity:1;stroke-width:0.26458332"
             y="3371.844"
             x="2909.5784"
             id="tspan35384"
             sodipodi:role="line">Vehicle No.</tspan></text>
        <text
           xml:space="preserve"
           style="font-style:normal;font-variant:normal;font-weight:normal;font-stretch:normal;font-size:10.58333397px;line-height:1.25;font-family:TAU_Elango_Godavari;-inkscape-font-specification:TAU_Elango_Godavari;letter-spacing:0px;word-spacing:0px;display:inline;fill:#333333;fill-opacity:1;stroke:none;stroke-width:0.26458332"
           x="3053.4187"
           y="3371.2822"
           id="text35390"><tspan
             sodipodi:role="line"
             id="tspan35388"
             x="3053.4187"
             y="3371.2822"
             style="font-style:normal;font-variant:normal;font-weight:bold;font-stretch:normal;font-size:9.87777805px;font-family:'Tlwg Typewriter';-inkscape-font-specification:'Tlwg Typewriter Bold';text-align:center;text-anchor:middle;fill:#333333;fill-opacity:1;stroke-width:0.26458332">TN22 86789</tspan></text>
        <text
           xml:space="preserve"
           style="font-style:normal;font-variant:normal;font-weight:normal;font-stretch:normal;font-size:10.58333397px;line-height:1.25;font-family:TAU_Elango_Godavari;-inkscape-font-specification:TAU_Elango_Godavari;letter-spacing:0px;word-spacing:0px;display:inline;fill:#333333;fill-opacity:1;stroke:none;stroke-width:0.26458332"
           x="2891.5037"
           y="3438.2866"
           id="text35394"><tspan
             sodipodi:role="line"
             id="tspan35392"
             x="2891.5037"
             y="3438.2866"
             style="font-style:normal;font-variant:normal;font-weight:bold;font-stretch:normal;font-size:9.87777805px;font-family:'Tlwg Typewriter';-inkscape-font-specification:'Tlwg Typewriter Bold';text-align:center;text-anchor:middle;fill:#333333;fill-opacity:1;stroke-width:0.26458332">Union</tspan></text>
        <text
           id="text35398"
           y="3438.3064"
           x="3070.7031"
           style="font-style:normal;font-variant:normal;font-weight:normal;font-stretch:normal;font-size:10.58333397px;line-height:1.25;font-family:TAU_Elango_Godavari;-inkscape-font-specification:TAU_Elango_Godavari;letter-spacing:0px;word-spacing:0px;display:inline;fill:#333333;fill-opacity:1;stroke:none;stroke-width:0.26458332"
           xml:space="preserve"><tspan
             style="font-style:normal;font-variant:normal;font-weight:bold;font-stretch:normal;font-size:9.87777805px;font-family:'Tlwg Typewriter';-inkscape-font-specification:'Tlwg Typewriter Bold';text-align:center;text-anchor:middle;fill:#333333;fill-opacity:1;stroke-width:0.26458332"
             y="3438.3064"
             x="3070.7031"
             id="tspan35396"
             sodipodi:role="line">CITU</tspan></text>
        <g
           style="display:inline;fill:#ffbc00;fill-opacity:1;stroke:#000000;stroke-width:5.32733202;stroke-linecap:round;stroke-linejoin:round;stroke-miterlimit:4;stroke-dasharray:none;stroke-opacity:1"
           transform="matrix(0.1479036,0,0,0.15009602,2843.3885,3427.9776)"
           id="g35422">
          <g
             style="fill:#ffbc00;fill-opacity:1;stroke:#000000;stroke-width:5.32733202;stroke-linecap:round;stroke-linejoin:round;stroke-miterlimit:4;stroke-dasharray:none;stroke-opacity:1"
             id="g35400" />
          <g
             style="fill:#ffbc00;fill-opacity:1;stroke:#000000;stroke-width:5.32733202;stroke-linecap:round;stroke-linejoin:round;stroke-miterlimit:4;stroke-dasharray:none;stroke-opacity:1"
             id="g35420">
            <g
               style="fill:#ffbc00;fill-opacity:1;stroke:#000000;stroke-width:5.32733202;stroke-linecap:round;stroke-linejoin:round;stroke-miterlimit:4;stroke-dasharray:none;stroke-opacity:1"
               id="g35418">
              <g
                 style="fill:#ffbc00;fill-opacity:1;stroke:#000000;stroke-width:5.32733202;stroke-linecap:round;stroke-linejoin:round;stroke-miterlimit:4;stroke-dasharray:none;stroke-opacity:1"
                 id="g35412">
                <g
                   style="fill:#ffbc00;fill-opacity:1;stroke:#000000;stroke-width:5.32733202;stroke-linecap:round;stroke-linejoin:round;stroke-miterlimit:4;stroke-dasharray:none;stroke-opacity:1"
                   id="g35410">
                  <g
                     style="fill:#ffbc00;fill-opacity:1;stroke:#000000;stroke-width:5.32733202;stroke-linecap:round;stroke-linejoin:round;stroke-miterlimit:4;stroke-dasharray:none;stroke-opacity:1"
                     id="g35408">
                    <g
                       style="fill:#ffbc00;fill-opacity:1;stroke:#000000;stroke-width:5.32733202;stroke-linecap:round;stroke-linejoin:round;stroke-miterlimit:4;stroke-dasharray:none;stroke-opacity:1"
                       id="g35406">
                      <path
                         style="fill:#ffbc00;fill-opacity:1;stroke:#000000;stroke-width:5.32733202;stroke-linecap:round;stroke-linejoin:round;stroke-miterlimit:4;stroke-dasharray:none;stroke-opacity:1"
                         inkscape:connector-curvature="0"
                         d="m 42.966,51.018 h 0.606 c -0.168,-0.14 -0.33,-0.268 -0.476,-0.422 -4.806,-4.341 -8.473,-12.778 -8.473,-19.599 0,-9.65 7.9,-15.998 15.371,-15.998 7.465,0 14.968,6.867 14.968,16.513 0,6.818 -4.056,14.999 -9.074,19.191 1.031,3.933 6.678,5.22 18.324,8.414 12.939,3.552 11.579,15.705 10.673,18.245 -1.497,4.195 -68.574,4.971 -69.839,0 C 14.765,75.305 11.8,62.669 24.741,59.117 36.067,56.008 41.709,54.703 42.966,51.018 Z"
                         id="path35402" />
                      <path
                         style="fill:#ffbc00;fill-opacity:1;stroke:#000000;stroke-width:5.32733202;stroke-linecap:round;stroke-linejoin:round;stroke-miterlimit:4;stroke-dasharray:none;stroke-opacity:1"
                         inkscape:connector-curvature="0"
                         d="m 43.572,51.018 h -0.606 c 0.05,-0.14 0.088,-0.275 0.129,-0.422 0.145,0.154 0.31,0.283 0.477,0.422 z"
                         id="path35404" />
                    </g>
                  </g>
                </g>
              </g>
              <path
                 style="fill:#ffbc00;fill-opacity:1;stroke:#000000;stroke-width:5.32733202;stroke-linecap:round;stroke-linejoin:round;stroke-miterlimit:4;stroke-dasharray:none;stroke-opacity:1"
                 inkscape:connector-curvature="0"
                 d="m 24.331,57.623 2.164,-0.592 c 4.106,-1.121 7.357,-2.015 9.796,-2.903 -1.913,-0.847 -3.007,-1.78 -3.362,-3.132 1.643,-1.373 3.129,-3.331 4.302,-5.512 -2.513,-4.452 -4.157,-9.818 -4.157,-14.486 0,-1.709 0.289,-3.44 0.814,-5.118 -1.656,-1.024 -3.512,-1.602 -5.369,-1.602 -5.591,0 -11.503,4.75 -11.503,11.972 0,5.104 2.744,11.418 6.34,14.667 0.109,0.115 0.231,0.211 0.356,0.316 h -0.454 c -0.94,2.758 -5.162,3.734 -13.638,6.061 -9.684,2.658 -7.465,12.114 -7.255,13.653 0.272,1.069 4.622,1.781 10.697,2.181 -0.251,-10.054 5.789,-14.002 11.269,-15.505 z"
                 id="path35414" />
              <path
                 style="fill:#ffbc00;fill-opacity:1;stroke:#000000;stroke-width:5.32733202;stroke-linecap:round;stroke-linejoin:round;stroke-miterlimit:4;stroke-dasharray:none;stroke-opacity:1"
                 inkscape:connector-curvature="0"
                 d="m 75.385,57.623 -2.164,-0.592 c -4.106,-1.121 -7.357,-2.015 -9.796,-2.903 1.913,-0.847 3.007,-1.78 3.362,-3.132 -1.643,-1.373 -3.129,-3.331 -4.302,-5.512 2.513,-4.452 4.157,-9.818 4.157,-14.486 0,-1.709 -0.289,-3.44 -0.814,-5.118 1.656,-1.024 3.512,-1.602 5.369,-1.602 5.591,0 11.503,4.75 11.503,11.972 0,5.104 -2.744,11.418 -6.34,14.667 -0.109,0.115 -0.231,0.211 -0.356,0.316 h 0.454 c 0.94,2.758 5.162,3.734 13.638,6.061 9.684,2.658 7.465,12.114 7.255,13.653 -0.272,1.069 -4.622,1.781 -10.697,2.181 0.251,-10.054 -5.79,-14.002 -11.269,-15.505 z"
                 id="path35416" />
            </g>
          </g>
        </g>
        <text
           id="text35426"
           y="3416.0435"
           x="2890.99"
           style="font-style:normal;font-variant:normal;font-weight:normal;font-stretch:normal;font-size:10.58333397px;line-height:1.25;font-family:TAU_Elango_Godavari;-inkscape-font-specification:TAU_Elango_Godavari;letter-spacing:0px;word-spacing:0px;display:inline;fill:#333333;fill-opacity:1;stroke:none;stroke-width:0.26458332"
           xml:space="preserve"><tspan
             style="font-style:normal;font-variant:normal;font-weight:bold;font-stretch:normal;font-size:9.87777805px;font-family:'Tlwg Typewriter';-inkscape-font-specification:'Tlwg Typewriter Bold';text-align:center;text-anchor:middle;fill:#333333;fill-opacity:1;stroke-width:0.26458332"
             y="3416.0435"
             x="2890.99"
             id="tspan35424"
             sodipodi:role="line">Stand</tspan></text>
        <text
           xml:space="preserve"
           style="font-style:normal;font-variant:normal;font-weight:normal;font-stretch:normal;font-size:10.58333397px;line-height:1.25;font-family:TAU_Elango_Godavari;-inkscape-font-specification:TAU_Elango_Godavari;letter-spacing:0px;word-spacing:0px;display:inline;fill:#333333;fill-opacity:1;stroke:none;stroke-width:0.26458332"
           x="3041.2766"
           y="3414.3235"
           id="text35430"><tspan
             sodipodi:role="line"
             id="tspan35428"
             x="3041.2766"
             y="3414.3235"
             style="font-style:normal;font-variant:normal;font-weight:bold;font-stretch:normal;font-size:9.87777805px;font-family:'Tlwg Typewriter';-inkscape-font-specification:'Tlwg Typewriter Bold';text-align:center;text-anchor:middle;fill:#333333;fill-opacity:1;stroke-width:0.26458332">Tholar Periyar</tspan></text>
        <g
           id="g35454"
           transform="matrix(0.1479036,0,0,0.15009602,2843.3886,3405.8505)"
           style="display:inline;fill:#ffbc00;fill-opacity:1;stroke:#000000;stroke-width:5.32733202;stroke-linecap:round;stroke-linejoin:round;stroke-miterlimit:4;stroke-dasharray:none;stroke-opacity:1">
          <g
             id="g35432"
             style="fill:#ffbc00;fill-opacity:1;stroke:#000000;stroke-width:5.32733202;stroke-linecap:round;stroke-linejoin:round;stroke-miterlimit:4;stroke-dasharray:none;stroke-opacity:1" />
          <g
             id="g35452"
             style="fill:#ffbc00;fill-opacity:1;stroke:#000000;stroke-width:5.32733202;stroke-linecap:round;stroke-linejoin:round;stroke-miterlimit:4;stroke-dasharray:none;stroke-opacity:1">
            <g
               id="g35450"
               style="fill:#ffbc00;fill-opacity:1;stroke:#000000;stroke-width:5.32733202;stroke-linecap:round;stroke-linejoin:round;stroke-miterlimit:4;stroke-dasharray:none;stroke-opacity:1">
              <g
                 id="g35444"
                 style="fill:#ffbc00;fill-opacity:1;stroke:#000000;stroke-width:5.32733202;stroke-linecap:round;stroke-linejoin:round;stroke-miterlimit:4;stroke-dasharray:none;stroke-opacity:1">
                <g
                   id="g35442"
                   style="fill:#ffbc00;fill-opacity:1;stroke:#000000;stroke-width:5.32733202;stroke-linecap:round;stroke-linejoin:round;stroke-miterlimit:4;stroke-dasharray:none;stroke-opacity:1">
                  <g
                     id="g35440"
                     style="fill:#ffbc00;fill-opacity:1;stroke:#000000;stroke-width:5.32733202;stroke-linecap:round;stroke-linejoin:round;stroke-miterlimit:4;stroke-dasharray:none;stroke-opacity:1">
                    <g
                       id="g35438"
                       style="fill:#ffbc00;fill-opacity:1;stroke:#000000;stroke-width:5.32733202;stroke-linecap:round;stroke-linejoin:round;stroke-miterlimit:4;stroke-dasharray:none;stroke-opacity:1">
                      <path
                         id="path35434"
                         d="m 42.966,51.018 h 0.606 c -0.168,-0.14 -0.33,-0.268 -0.476,-0.422 -4.806,-4.341 -8.473,-12.778 -8.473,-19.599 0,-9.65 7.9,-15.998 15.371,-15.998 7.465,0 14.968,6.867 14.968,16.513 0,6.818 -4.056,14.999 -9.074,19.191 1.031,3.933 6.678,5.22 18.324,8.414 12.939,3.552 11.579,15.705 10.673,18.245 -1.497,4.195 -68.574,4.971 -69.839,0 C 14.765,75.305 11.8,62.669 24.741,59.117 36.067,56.008 41.709,54.703 42.966,51.018 Z"
                         inkscape:connector-curvature="0"
                         style="fill:#ffbc00;fill-opacity:1;stroke:#000000;stroke-width:5.32733202;stroke-linecap:round;stroke-linejoin:round;stroke-miterlimit:4;stroke-dasharray:none;stroke-opacity:1" />
                      <path
                         id="path35436"
                         d="m 43.572,51.018 h -0.606 c 0.05,-0.14 0.088,-0.275 0.129,-0.422 0.145,0.154 0.31,0.283 0.477,0.422 z"
                         inkscape:connector-curvature="0"
                         style="fill:#ffbc00;fill-opacity:1;stroke:#000000;stroke-width:5.32733202;stroke-linecap:round;stroke-linejoin:round;stroke-miterlimit:4;stroke-dasharray:none;stroke-opacity:1" />
                    </g>
                  </g>
                </g>
              </g>
              <path
                 id="path35446"
                 d="m 24.331,57.623 2.164,-0.592 c 4.106,-1.121 7.357,-2.015 9.796,-2.903 -1.913,-0.847 -3.007,-1.78 -3.362,-3.132 1.643,-1.373 3.129,-3.331 4.302,-5.512 -2.513,-4.452 -4.157,-9.818 -4.157,-14.486 0,-1.709 0.289,-3.44 0.814,-5.118 -1.656,-1.024 -3.512,-1.602 -5.369,-1.602 -5.591,0 -11.503,4.75 -11.503,11.972 0,5.104 2.744,11.418 6.34,14.667 0.109,0.115 0.231,0.211 0.356,0.316 h -0.454 c -0.94,2.758 -5.162,3.734 -13.638,6.061 -9.684,2.658 -7.465,12.114 -7.255,13.653 0.272,1.069 4.622,1.781 10.697,2.181 -0.251,-10.054 5.789,-14.002 11.269,-15.505 z"
                 inkscape:connector-curvature="0"
                 style="fill:#ffbc00;fill-opacity:1;stroke:#000000;stroke-width:5.32733202;stroke-linecap:round;stroke-linejoin:round;stroke-miterlimit:4;stroke-dasharray:none;stroke-opacity:1" />
              <path
                 id="path35448"
                 d="m 75.385,57.623 -2.164,-0.592 c -4.106,-1.121 -7.357,-2.015 -9.796,-2.903 1.913,-0.847 3.007,-1.78 3.362,-3.132 -1.643,-1.373 -3.129,-3.331 -4.302,-5.512 2.513,-4.452 4.157,-9.818 4.157,-14.486 0,-1.709 -0.289,-3.44 -0.814,-5.118 1.656,-1.024 3.512,-1.602 5.369,-1.602 5.591,0 11.503,4.75 11.503,11.972 0,5.104 -2.744,11.418 -6.34,14.667 -0.109,0.115 -0.231,0.211 -0.356,0.316 h 0.454 c 0.94,2.758 5.162,3.734 13.638,6.061 9.684,2.658 7.465,12.114 7.255,13.653 -0.272,1.069 -4.622,1.781 -10.697,2.181 0.251,-10.054 -5.79,-14.002 -11.269,-15.505 z"
                 inkscape:connector-curvature="0"
                 style="fill:#ffbc00;fill-opacity:1;stroke:#000000;stroke-width:5.32733202;stroke-linecap:round;stroke-linejoin:round;stroke-miterlimit:4;stroke-dasharray:none;stroke-opacity:1" />
            </g>
          </g>
        </g>
        <text
           xml:space="preserve"
           style="font-style:normal;font-variant:normal;font-weight:normal;font-stretch:normal;font-size:10.58333397px;line-height:1.25;font-family:TAU_Elango_Godavari;-inkscape-font-specification:TAU_Elango_Godavari;letter-spacing:0px;word-spacing:0px;display:inline;fill:#333333;fill-opacity:1;stroke:none;stroke-width:0.26458332"
           x="2924.0496"
           y="3393.7954"
           id="text35458"><tspan
             sodipodi:role="line"
             id="tspan35456"
             x="2924.0496"
             y="3393.7954"
             style="font-style:normal;font-variant:normal;font-weight:bold;font-stretch:normal;font-size:9.87777805px;font-family:'Tlwg Typewriter';-inkscape-font-specification:'Tlwg Typewriter Bold';text-align:center;text-anchor:middle;fill:#333333;fill-opacity:1;stroke-width:0.26458332">Driver/Conductor</tspan></text>
        <text
           id="text35462"
           y="3391.9312"
           x="3056.0837"
           style="font-style:normal;font-variant:normal;font-weight:normal;font-stretch:normal;font-size:10.58333397px;line-height:1.25;font-family:TAU_Elango_Godavari;-inkscape-font-specification:TAU_Elango_Godavari;letter-spacing:0px;word-spacing:0px;display:inline;fill:#333333;fill-opacity:1;stroke:none;stroke-width:0.26458332"
           xml:space="preserve"><tspan
             style="font-style:normal;font-variant:normal;font-weight:bold;font-stretch:normal;font-size:9.87777805px;font-family:'Tlwg Typewriter';-inkscape-font-specification:'Tlwg Typewriter Bold';text-align:center;text-anchor:middle;fill:#333333;fill-opacity:1;stroke-width:0.26458332"
             y="3391.9312"
             x="3056.0837"
             id="tspan35460"
             sodipodi:role="line">Anbalagan</tspan></text>
        <g
           transform="matrix(0.19147142,0,0,0.19430966,2841.2725,3381.167)"
           id="g35468"
           style="display:inline;fill:#ffbc00;fill-opacity:1;stroke:#000000;stroke-width:4.11513948;stroke-miterlimit:4;stroke-dasharray:none;stroke-opacity:1">
          <path
             style="fill:#ffbc00;fill-opacity:1;stroke:#000000;stroke-width:4.11513948;stroke-miterlimit:4;stroke-dasharray:none;stroke-opacity:1"
             inkscape:connector-curvature="0"
             d="M 49.564,35.19 C 39.312,35.19 31,43.501 31,53.755 c 0,0.219 0.007,0.443 0.018,0.669 0.069,1.95 0.437,3.822 1.062,5.575 C 36.04,73.018 49.564,90 49.564,90 c 0,0 13.524,-16.981 17.486,-29.999 0.626,-1.753 0.993,-3.627 1.063,-5.577 0.011,-0.226 0.017,-0.449 0.017,-0.669 0,-10.254 -8.313,-18.565 -18.566,-18.565 z"
             id="path35464" />
          <circle
             style="fill:#ffbc00;fill-opacity:1;stroke:#000000;stroke-width:4.11513948;stroke-miterlimit:4;stroke-dasharray:none;stroke-opacity:1"
             cx="49.563999"
             cy="21.187"
             r="10.791"
             id="circle35466" />
        </g>
        <path
           inkscape:connector-curvature="0"
           d="m 2856.8861,3339.3448 h -1.2607 v 0.5409 c 0,0.5049 -0.3962,0.9017 -0.9004,0.9017 -0.5042,0 -0.9005,-0.3968 -0.9005,-0.9017 v -0.5409 h -6.3031 v 0.5409 c 0,0.5049 -0.3961,0.9017 -0.9004,0.9017 -0.5043,0 -0.9004,-0.3968 -0.9004,-0.9017 v -0.5409 h -1.0806 c -0.5043,0 -0.9004,0.3966 -0.9004,0.9016 v 3.0654 9.557 c 0,0.5049 0.3961,0.9016 0.9004,0.9016 h 12.2461 c 0.5042,0 0.9003,-0.3967 0.9003,-0.9016 v -9.557 -3.0654 c 0,-0.505 -0.3961,-0.9016 -0.9003,-0.9016 z m 0.9003,13.524 c 2e-4,0.5199 -0.4439,0.9016 -0.9003,0.9016 H 2844.64 c -0.3992,0 -0.901,-0.3189 -0.9004,-0.9016 l 0.01,-9.1963 h 14.0337 z m -11.7057,-12.9831 v -0.5409 -0.3607 c 0,-0.3066 0.2341,-0.541 0.5403,-0.541 0.3061,0 0.5402,0.2344 0.5402,0.541 v 0.3607 0.5409 c 0,0.2885 -0.2341,0.541 -0.5402,0.541 -0.3062,0 -0.5403,-0.2525 -0.5403,-0.541 z m 8.104,0 v -0.5409 -0.3607 c 0,-0.3066 0.2341,-0.541 0.5403,-0.541 0.3061,0 0.5403,0.2344 0.5403,0.541 v 0.3607 0.5409 c 0,0.2885 -0.2342,0.541 -0.5403,0.541 -0.3062,0 -0.5403,-0.2525 -0.5403,-0.541 z m -2.7997,5.0928 h 1.7186 v 1.7209 h -1.7186 z m 3.0648,0 h 1.7188 v 1.7209 h -1.7188 z m -7.4476,1.7209 h -1.7186 v -1.7209 h 1.7186 z m 3.0651,0 h -1.7188 v -1.7209 h 1.7188 z m 1.3177,1.1473 h 1.7186 v 1.7209 h -1.7186 z m 3.0648,0 h 1.7188 v 1.7209 h -1.7188 z m -7.4476,1.7209 h -1.7186 v -1.7209 h 1.7186 z m 3.0651,0 h -1.7188 v -1.7209 h 1.7188 z m 1.3177,1.1472 h 1.7186 v 1.7209 h -1.7186 z m 3.0648,0 h 1.7188 v 1.7209 h -1.7188 z m -7.4476,1.7209 h -1.7186 v -1.7209 h 1.7186 z m 3.0651,0 h -1.7188 v -1.7209 h 1.7188 z"
           id="path35470"
           style="fill:#ffbc00;fill-opacity:1;stroke:#333333;stroke-width:0.79375005;stroke-miterlimit:4;stroke-dasharray:none;stroke-opacity:1"
           sodipodi:nodetypes="scsssccssscsscsssscssssssccsscssscsssscssscssscccccccccccccccccccccccccccccccccccccccccccccccccccccccccccc" />
        <text
           id="text35474"
           y="3349.8232"
           x="3044.5344"
           style="font-style:normal;font-variant:normal;font-weight:normal;font-stretch:normal;font-size:10.58333397px;line-height:1.25;font-family:TAU_Elango_Godavari;-inkscape-font-specification:TAU_Elango_Godavari;letter-spacing:0px;word-spacing:0px;display:inline;fill:#333333;fill-opacity:1;stroke:none;stroke-width:0.26458332"
           xml:space="preserve"><tspan
             style="font-style:normal;font-variant:normal;font-weight:bold;font-stretch:normal;font-size:9.87777805px;font-family:'Tlwg Typewriter';-inkscape-font-specification:'Tlwg Typewriter Bold';text-align:center;text-anchor:middle;fill:#333333;fill-opacity:1;stroke-width:0.26458332"
             y="3349.8232"
             x="3044.5344"
             id="tspan35472"
             sodipodi:role="line">March 22 2019</tspan></text>
        <text
           xml:space="preserve"
           style="font-style:normal;font-variant:normal;font-weight:normal;font-stretch:normal;font-size:10.58333397px;line-height:1.25;font-family:TAU_Elango_Godavari;-inkscape-font-specification:TAU_Elango_Godavari;letter-spacing:0px;word-spacing:0px;display:inline;fill:#333333;fill-opacity:1;stroke:none;stroke-width:0.26458332"
           x="2888.5127"
           y="3349.7244"
           id="text35478"><tspan
             sodipodi:role="line"
             id="tspan35476"
             x="2888.5127"
             y="3349.7244"
             style="font-style:normal;font-variant:normal;font-weight:bold;font-stretch:normal;font-size:9.87777805px;font-family:'Tlwg Typewriter';-inkscape-font-specification:'Tlwg Typewriter Bold';text-align:center;text-anchor:middle;fill:#333333;fill-opacity:1;stroke-width:0.26458332">Date</tspan></text>
        <path
           style="display:inline;fill:#e3d9bc;fill-opacity:1;stroke-width:0.26458335;filter:url(#filter8806-2-3)"
           d="m 2832.1027,3284.0423 h 261.8841 v 1.1242 c 0,0 -2.5358,1.2326 -2.5358,4.2296 0,2.9969 2.5316,4.2265 2.5316,4.2265 v 0.8896 h -263.2409 v -0.7493 c 1.6922,-1.01 2.4997,-2.5786 2.4997,-4.6444 0,-2.1907 -1.8451,-3.7122 -2.4997,-4.1096 v -0.9599 z"
           id="path35480"
           inkscape:connector-curvature="0"
           sodipodi:nodetypes="ccczccccsccc" />
        <path
           sodipodi:nodetypes="cc"
           inkscape:connector-curvature="0"
           id="path35482"
           d="M 3090.2693,3289.7634 H 2833.9209"
           style="display:inline;fill:#4d4d4d;stroke:#797979;stroke-width:0.79375005;stroke-linecap:round;stroke-linejoin:round;stroke-miterlimit:4;stroke-dasharray:1.58750004, 1.58750004;stroke-dashoffset:0;stroke-opacity:1" />
        <path
           sodipodi:nodetypes="cc"
           inkscape:connector-curvature="0"
           id="path35484"
           d="m 2870.3981,3346.8843 h -6.0869"
           style="display:inline;fill:#4d4d4d;stroke:#797979;stroke-width:0.79375005;stroke-linecap:round;stroke-linejoin:round;stroke-miterlimit:4;stroke-dasharray:1.58750004, 1.58750004;stroke-dashoffset:0;stroke-opacity:1" />
        <path
           style="display:inline;fill:#4d4d4d;stroke:#797979;stroke-width:0.79375005;stroke-linecap:round;stroke-linejoin:round;stroke-miterlimit:4;stroke-dasharray:1.58750004, 1.58750004;stroke-dashoffset:0;stroke-opacity:1"
           d="m 2870.3981,3368.841 h -6.0869"
           id="path35486"
           inkscape:connector-curvature="0"
           sodipodi:nodetypes="cc" />
        <path
           sodipodi:nodetypes="cc"
           inkscape:connector-curvature="0"
           id="path35488"
           d="m 2870.3981,3390.9209 h -6.0869"
           style="display:inline;fill:#4d4d4d;stroke:#797979;stroke-width:0.79375005;stroke-linecap:round;stroke-linejoin:round;stroke-miterlimit:4;stroke-dasharray:1.58750004, 1.58750004;stroke-dashoffset:0;stroke-opacity:1" />
        <path
           style="display:inline;fill:#4d4d4d;stroke:#797979;stroke-width:0.79375005;stroke-linecap:round;stroke-linejoin:round;stroke-miterlimit:4;stroke-dasharray:1.58750004, 1.58750004;stroke-dashoffset:0;stroke-opacity:1"
           d="m 2870.3981,3413.0405 h -6.0869"
           id="path35490"
           inkscape:connector-curvature="0"
           sodipodi:nodetypes="cc" />
        <path
           sodipodi:nodetypes="cc"
           inkscape:connector-curvature="0"
           id="path35492"
           d="m 2870.3981,3435.2885 h -6.0869"
           style="display:inline;fill:#4d4d4d;stroke:#797979;stroke-width:0.79375005;stroke-linecap:round;stroke-linejoin:round;stroke-miterlimit:4;stroke-dasharray:1.58750004, 1.58750004;stroke-dashoffset:0;stroke-opacity:1" />
        <path
           style="display:inline;fill:#4d4d4d;stroke:#797979;stroke-width:0.79375005;stroke-linecap:round;stroke-linejoin:round;stroke-miterlimit:4;stroke-dasharray:1.58750004, 1.58750004;stroke-dashoffset:0;stroke-opacity:1"
           d="m 2986.8145,3346.8843 h -6.0869"
           id="path35494"
           inkscape:connector-curvature="0"
           sodipodi:nodetypes="cc" />
        <path
           sodipodi:nodetypes="cc"
           inkscape:connector-curvature="0"
           id="path35496"
           d="m 2986.8145,3368.841 h -6.0869"
           style="display:inline;fill:#4d4d4d;stroke:#797979;stroke-width:0.79375005;stroke-linecap:round;stroke-linejoin:round;stroke-miterlimit:4;stroke-dasharray:1.58750004, 1.58750004;stroke-dashoffset:0;stroke-opacity:1" />
        <path
           style="display:inline;fill:#4d4d4d;stroke:#797979;stroke-width:0.79375005;stroke-linecap:round;stroke-linejoin:round;stroke-miterlimit:4;stroke-dasharray:1.58750004, 1.58750004;stroke-dashoffset:0;stroke-opacity:1"
           d="m 2986.8145,3390.9209 h -6.0869"
           id="path35498"
           inkscape:connector-curvature="0"
           sodipodi:nodetypes="cc" />
        <path
           sodipodi:nodetypes="cc"
           inkscape:connector-curvature="0"
           id="path35500"
           d="m 2986.8145,3413.0405 h -6.0869"
           style="display:inline;fill:#4d4d4d;stroke:#797979;stroke-width:0.79375005;stroke-linecap:round;stroke-linejoin:round;stroke-miterlimit:4;stroke-dasharray:1.58750004, 1.58750004;stroke-dashoffset:0;stroke-opacity:1" />
        <path
           style="display:inline;fill:#4d4d4d;stroke:#797979;stroke-width:0.79375005;stroke-linecap:round;stroke-linejoin:round;stroke-miterlimit:4;stroke-dasharray:1.58750004, 1.58750004;stroke-dashoffset:0;stroke-opacity:1"
           d="m 2986.8145,3435.2885 h -6.0869"
           id="path35502"
           inkscape:connector-curvature="0"
           sodipodi:nodetypes="cc" />
        <text
           id="text35506"
           y="3257.7039"
           x="2880.165"
           style="font-style:normal;font-variant:normal;font-weight:normal;font-stretch:normal;font-size:10.58333397px;line-height:1.25;font-family:TAU_Elango_Godavari;-inkscape-font-specification:TAU_Elango_Godavari;letter-spacing:0px;word-spacing:0px;display:inline;fill:#333333;fill-opacity:1;stroke:none;stroke-width:0.26458332"
           xml:space="preserve"><tspan
             style="font-style:normal;font-variant:normal;font-weight:bold;font-stretch:normal;font-size:7.05555582px;font-family:'Tlwg Typewriter';-inkscape-font-specification:'Tlwg Typewriter Bold';text-align:center;text-anchor:middle;fill:#333333;fill-opacity:1;stroke-width:0.26458332"
             y="3257.7039"
             x="2880.165"
             id="tspan35504"
             sodipodi:role="line">Bus Stand</tspan></text>
        <text
           xml:space="preserve"
           style="font-style:normal;font-variant:normal;font-weight:normal;font-stretch:normal;font-size:10.58333397px;line-height:1.25;font-family:TAU_Elango_Godavari;-inkscape-font-specification:TAU_Elango_Godavari;letter-spacing:0px;word-spacing:0px;display:inline;fill:#333333;fill-opacity:1;stroke:none;stroke-width:0.26458332"
           x="3043.7351"
           y="3257.0334"
           id="text35510"><tspan
             sodipodi:role="line"
             id="tspan35508"
             x="3043.7351"
             y="3257.0334"
             style="font-style:normal;font-variant:normal;font-weight:bold;font-stretch:normal;font-size:7.05555582px;font-family:'Tlwg Typewriter';-inkscape-font-specification:'Tlwg Typewriter Bold';text-align:center;text-anchor:middle;fill:#333333;fill-opacity:1;stroke-width:0.26458332">University</tspan></text>
      </g>
    </g>
  </g>
</svg>
