<?xml version="1.0" encoding="UTF-8" standalone="no"?>
<!-- Created with Inkscape (http://www.inkscape.org/) -->

<svg
   xmlns:dc="http://purl.org/dc/elements/1.1/"
   xmlns:cc="http://creativecommons.org/ns#"
   xmlns:rdf="http://www.w3.org/1999/02/22-rdf-syntax-ns#"
   xmlns:svg="http://www.w3.org/2000/svg"
   xmlns="http://www.w3.org/2000/svg"
   xmlns:sodipodi="http://sodipodi.sourceforge.net/DTD/sodipodi-0.dtd"
   xmlns:inkscape="http://www.inkscape.org/namespaces/inkscape"
   width="128"
   height="128"
   viewBox="0 0 33.866666 33.866668"
   version="1.1"
   id="svg25326"
   inkscape:version="0.92.5 (0.92.5+68)"
   sodipodi:docname="icon_navbar_purchase.svg">
  <defs
     id="defs25320" />
  <sodipodi:namedview
     id="base"
     pagecolor="#ffffff"
     bordercolor="#666666"
     borderopacity="1.0"
     inkscape:pageopacity="0.0"
     inkscape:pageshadow="2"
     inkscape:zoom="1.5677083"
     inkscape:cx="85.670354"
     inkscape:cy="119.01361"
     inkscape:document-units="mm"
     inkscape:current-layer="layer1"
     showgrid="false"
     units="px"
     inkscape:window-width="1920"
     inkscape:window-height="1017"
     inkscape:window-x="0"
     inkscape:window-y="30"
     inkscape:window-maximized="1" />
  <metadata
     id="metadata25323">
    <rdf:RDF>
      <cc:Work
         rdf:about="">
        <dc:format>image/svg+xml</dc:format>
        <dc:type
           rdf:resource="http://purl.org/dc/dcmitype/StillImage" />
        <dc:title />
      </cc:Work>
    </rdf:RDF>
  </metadata>
  <g
     inkscape:label="Layer 1"
     inkscape:groupmode="layer"
     id="layer1"
     transform="translate(0,-263.13332)">
    <g
       id="g53219"
       style="stroke-width:0.92107779"
       transform="matrix(1.0856846,0,0,1.0856847,73.936452,3.9253919)">
      <g
         transform="rotate(-13.734566,40.179289,275.21067)"
         id="g26566"
         style="stroke-width:0.92107779">
        <path
           style="fill:#f9f9f9;fill-opacity:1;stroke:none;stroke-width:0.24370182px;stroke-linecap:butt;stroke-linejoin:miter;stroke-opacity:1"
           d="m 5.9333471,273.95223 -1.1972177,1.19722 1.0759136,1.23941 -1.0073505,1.11283 1.0495433,1.35544 -1.0917359,1.07064 1.1286543,1.48202 -1.1286543,1.03899 1.0126245,1.21304 -1.0231726,1.24469 1.1708471,1.32379 22.0667761,-0.0106 1.13393,-1.21304 -1.044271,-1.20776 0.986256,-1.29743 -1.054817,-1.16557 1.102283,-1.30797 -1.107559,-1.15503 1.112832,-1.23414 -1.139201,-1.22358 1.181394,-1.27106 -1.186669,-1.18139 z"
           id="path25993"
           inkscape:connector-curvature="0" />
        <path
           style="display:inline;fill:#333333;stroke-width:0.29610667"
           id="path24123-1"
           d="m 14.279398,277.82874 c -0.588686,-0.58869 -1.371412,-0.91286 -2.203834,-0.91274 -1.718548,1.2e-4 -3.1168117,1.39827 -3.1170547,3.11669 -1.22e-4,0.83206 0.324293,1.61503 0.912978,2.20359 0.5888067,0.58881 1.3711687,0.91322 2.2038337,0.91322 1.718548,-6.2e-4 3.116691,-1.39875 3.116812,-3.11693 1.22e-4,-0.83242 -0.324293,-1.61539 -0.912735,-2.20383 z m -2.204077,4.48397 c -0.60849,-2.4e-4 -1.18138,-0.23766 -1.611989,-0.66827 -0.430731,-0.43073 -0.6679057,-1.00326 -0.6680267,-1.61175 3.53e-4,-1.25683 1.0230597,-2.27953 2.2801367,-2.28001 0.60922,1.2e-4 1.181867,0.23729 1.612476,0.66778 0.430366,0.43049 0.667298,1.00313 0.667419,1.61223 0,1.25696 -1.023182,2.27941 -2.280016,2.28002 z m 5.409831,-5.42478 c 0.07533,0.0753 0.180311,0.12284 0.295983,0.12284 l 6.509194,3.6e-4 c 0.2311,-1.2e-4 0.418337,-0.18736 0.418337,-0.41846 -8.36e-4,-0.23171 -0.187115,-0.41846 -0.418337,-0.41846 l -6.509073,-6e-4 c -0.231223,0 -0.41846,0.18711 -0.41846,0.41845 0,0.11664 0.04739,0.22041 0.122356,0.29598 z m 7.224,1.99594 c -8.36e-4,-0.2317 -0.187237,-0.41845 -0.418458,-0.41845 l -6.509559,1.2e-4 c -0.231222,0 -0.418582,0.18711 -0.41846,0.41833 -6.1e-4,0.11543 0.04739,0.22017 0.122598,0.29599 0.07533,0.0753 0.180433,0.12272 0.295983,0.1226 l 6.509438,-1.3e-4 c 0.231221,0 0.418458,-0.18723 0.418458,-0.41846 z m -1.21e-4,2.29193 c -9.65e-4,-0.23171 -0.187359,-0.41846 -0.41858,-0.41846 l -6.509802,-2.4e-4 c -0.231222,0 -0.418459,0.18723 -0.418339,0.41846 3.54e-4,0.11542 0.04739,0.22016 0.12272,0.29598 0.07533,0.0753 0.18019,0.12272 0.295862,0.12272 l 6.50968,1.2e-4 c 0.2311,-1.2e-4 0.418216,-0.18748 0.418459,-0.41858 z m -0.418945,1.8731 -6.509073,-2.4e-4 c -0.2311,0 -0.418338,0.18723 -0.41846,0.41845 4.83e-4,0.11543 0.04739,0.22017 0.122842,0.29599 0.07533,0.0753 0.18019,0.12272 0.295861,0.12272 l 6.508952,1.2e-4 c 0.231343,1.2e-4 0.418458,-0.18724 0.418458,-0.41846 -9.64e-4,-0.23171 -0.18748,-0.4187 -0.41858,-0.41858 z m 5.22004,1.63884 -0.931811,-0.93181 0.931933,-0.93157 c 0.07898,-0.0778 0.123325,-0.18456 0.123084,-0.29586 -3.54e-4,-0.11057 -0.04496,-0.21737 -0.122719,-0.29586 l -0.931691,-0.93169 0.931812,-0.93181 c 0.163058,-0.16343 0.162086,-0.42903 -1.21e-4,-0.59185 l -0.931812,-0.93181 0.931812,-0.93181 c 0.163179,-0.16342 0.162086,-0.42903 0,-0.59185 l -0.93157,-0.93156 0.931205,-0.93121 c 0.163058,-0.16342 0.16318,-0.42842 0,-0.59184 l -1.227794,-1.22768 c -0.07898,-0.079 -0.184807,-0.12247 -0.295862,-0.12272 l -22.0807407,2.5e-4 c -0.110569,-6.1e-4 -0.215548,0.0437 -0.294161,0.12028 l -1.244076,1.22756 c -0.07898,0.079 -0.12527,0.18554 -0.124177,0.29781 -6.07e-4,0.11057 0.04374,0.21749 0.122719,0.29598 v 0 l 0.94141,0.9295 -0.94299,0.92841 c -0.07898,0.079 -0.125391,0.18554 -0.124176,0.2978 3.64e-4,0.11057 0.04374,0.21737 0.122475,0.29587 v 0 l 0.942018,0.92999 -0.94299,0.92804 c -0.07898,0.079 -0.124055,0.18578 -0.124298,0.29781 0.0012,0.11178 0.03524,0.22417 0.124541,0.29768 l 0.941775,0.92999 -0.94384,0.92889 c -0.07898,0.079 -0.125392,0.18554 -0.124177,0.29781 3.65e-4,0.11057 0.04374,0.21749 0.122719,0.29598 v 0 l 0.941896,0.92999 -0.942868,0.92805 c -0.08141,0.0778 -0.125392,0.18565 -0.124298,0.2978 -6.08e-4,0.11057 0.04374,0.21737 0.122718,0.29599 v 0 l 1.243955,1.22791 c 0.07776,0.0765 0.183956,0.12029 0.294039,0.12029 H 27.974562 c 0.110569,-1.2e-4 0.217493,-0.0437 0.295862,-0.12272 l 1.227917,-1.22767 c 0.162693,-0.1627 0.163909,-0.42721 -6.11e-4,-0.59124 z m -1.697162,1.1052 -21.7354287,-1.2e-4 -0.819907,-0.80946 0.943112,-0.92805 c 0.07898,-0.079 0.125392,-0.18553 0.124298,-0.2978 6.08e-4,-0.11057 -0.04374,-0.21749 -0.12284,-0.29598 v 0 l -0.941775,-0.92999 0.943719,-0.9289 c 0.07898,-0.079 0.125392,-0.18554 0.124177,-0.2978 9.72e-4,-0.11057 -0.04374,-0.21336 -0.124298,-0.29757 l -0.941897,-0.92999 0.94299,-0.92804 c 0.07898,-0.079 0.125149,-0.18517 0.124298,-0.29793 -4.86e-4,-0.11057 -0.04374,-0.21737 -0.122718,-0.29586 v 0 l -0.941775,-0.92999 0.943233,-0.92853 c 0.07898,-0.079 0.125391,-0.18554 0.124176,-0.29781 9.72e-4,-0.11056 -0.03767,-0.21189 -0.124662,-0.29792 l -0.941411,-0.9295 0.821851,-0.80691 21.7360357,-4.8e-4 0.809093,0.80909 -0.931569,0.93132 c -0.163058,0.16355 -0.162086,0.42915 1.22e-4,0.59197 l 0.93169,0.93169 -0.931812,0.93169 c -0.163058,0.16354 -0.162086,0.42903 0,0.59184 l 0.931933,0.93194 -0.931811,0.93181 c -0.16318,0.16342 -0.164274,0.42781 0,0.59184 l 0.931811,0.93181 -0.931811,0.93169 c -0.07898,0.0778 -0.123448,0.18445 -0.123085,0.29574 -7.38e-4,0.11057 0.04374,0.21737 0.12272,0.29586 l 0.931812,0.93194 -0.809093,0.80897 z"
           inkscape:connector-curvature="0" />
        <path
           style="opacity:1;fill:#333333;fill-opacity:1;fill-rule:nonzero;stroke:none;stroke-width:2.43701816;stroke-linecap:round;stroke-linejoin:round;stroke-miterlimit:4;stroke-dasharray:none;stroke-dashoffset:0;stroke-opacity:1;paint-order:normal"
           d="m 17.784827,276.17847 6.509165,5.2e-4 c 0.231222,0 0.417224,0.18687 0.418061,0.41857 0,0.2311 -0.186963,0.41795 -0.418061,0.41807 h -6.509165 c -0.11567,0 -0.220776,-0.0477 -0.296106,-0.12299 -0.07496,-0.0756 -0.122473,-0.17895 -0.122473,-0.29559 0,-0.23134 0.187357,-0.41858 0.418579,-0.41858 z m -5.705594,0.74207 c 0.832422,-1.2e-4 1.615313,0.32444 2.204,0.91313 0.588442,0.58843 0.912728,1.37106 0.912606,2.20348 -1.21e-4,1.71818 -1.398574,3.1165 -3.117122,3.11712 -0.832665,0 -1.614678,-0.32431 -2.2034849,-0.91312 -0.588685,-0.58856 -0.913244,-1.37142 -0.913122,-2.20348 2.43e-4,-1.71842 1.3985749,-3.11701 3.1171229,-3.11713 z m 0,0.83665 c -1.257078,4.7e-4 -2.2801299,1.02364 -2.2804819,2.28048 1.22e-4,0.60849 0.2374449,1.18054 0.6681759,1.61127 0.430611,0.43061 1.003299,0.66845 1.61179,0.66869 1.256833,-6.1e-4 2.279962,-1.023 2.279962,-2.27996 -1.19e-4,-0.6091 -0.236776,-1.18182 -0.667141,-1.61231 -0.43061,-0.43049 -1.003086,-0.66806 -1.612305,-0.66817 z m 5.705594,0.71313 h 6.509681 c 0.23122,0 0.417227,0.18636 0.418063,0.41806 0,0.23123 -0.186843,0.41858 -0.418063,0.41858 h -6.509681 c -0.115549,1.2e-4 -0.220776,-0.0472 -0.296106,-0.12247 -0.07521,-0.0758 -0.123081,-0.18068 -0.122473,-0.29611 -1.21e-4,-0.23122 0.187357,-0.41806 0.418579,-0.41806 z m -5.29e-4,2.29133 6.509681,5.3e-4 c 0.23122,0 0.417613,0.18687 0.418579,0.41858 -2.43e-4,0.2311 -0.187481,0.41846 -0.418579,0.41858 l -6.509681,-5.3e-4 c -0.115674,0 -0.22026,-0.0472 -0.29559,-0.12247 -0.07533,-0.0758 -0.122635,-0.18069 -0.122989,-0.29611 -1.19e-4,-0.23123 0.187357,-0.41858 0.418579,-0.41858 z m 5.29e-4,2.29185 h 6.508647 c 0.2311,-1.2e-4 0.417615,0.18687 0.418579,0.41858 0,0.23122 -0.18672,0.4187 -0.418061,0.41858 h -6.509165 c -0.11567,0 -0.220258,-0.0477 -0.295587,-0.12299 -0.07545,-0.0758 -0.122508,-0.18016 -0.122992,-0.29559 1.22e-4,-0.23122 0.187479,-0.41858 0.418579,-0.41858 z"
           id="rect25964"
           inkscape:connector-curvature="0"
           sodipodi:nodetypes="ccccscscccccccccccccccsscscccsccccccccscccsccs" />
      </g>
      <g
         transform="rotate(-45,13.107177,281.45567)"
         id="g53191"
         style="stroke-width:0.92107779">
        <path
           inkscape:connector-curvature="0"
           id="path53185"
           d="m 5.9333471,273.95223 -1.1972177,1.19722 1.0759136,1.23941 -1.0073505,1.11283 1.0495433,1.35544 -1.0917359,1.07064 1.1286543,1.48202 -1.1286543,1.03899 1.0126245,1.21304 -1.0231726,1.24469 1.1708471,1.32379 22.0667761,-0.0106 1.13393,-1.21304 -1.044271,-1.20776 0.986256,-1.29743 -1.054817,-1.16557 1.102283,-1.30797 -1.107559,-1.15503 1.112832,-1.23414 -1.139201,-1.22358 1.181394,-1.27106 -1.186669,-1.18139 z"
           style="fill:#f5f5f5;fill-opacity:1;stroke:none;stroke-width:0.24370182px;stroke-linecap:butt;stroke-linejoin:miter;stroke-opacity:1" />
        <path
           inkscape:connector-curvature="0"
           d="m 14.279398,277.82874 c -0.588686,-0.58869 -1.371412,-0.91286 -2.203834,-0.91274 -1.718548,1.2e-4 -3.1168117,1.39827 -3.1170547,3.11669 -1.22e-4,0.83206 0.324293,1.61503 0.912978,2.20359 0.5888067,0.58881 1.3711687,0.91322 2.2038337,0.91322 1.718548,-6.2e-4 3.116691,-1.39875 3.116812,-3.11693 1.22e-4,-0.83242 -0.324293,-1.61539 -0.912735,-2.20383 z m -2.204077,4.48397 c -0.60849,-2.4e-4 -1.18138,-0.23766 -1.611989,-0.66827 -0.430731,-0.43073 -0.6679057,-1.00326 -0.6680267,-1.61175 3.53e-4,-1.25683 1.0230597,-2.27953 2.2801367,-2.28001 0.60922,1.2e-4 1.181867,0.23729 1.612476,0.66778 0.430366,0.43049 0.667298,1.00313 0.667419,1.61223 0,1.25696 -1.023182,2.27941 -2.280016,2.28002 z m 5.409831,-5.42478 c 0.07533,0.0753 0.180311,0.12284 0.295983,0.12284 l 6.509194,3.6e-4 c 0.2311,-1.2e-4 0.418337,-0.18736 0.418337,-0.41846 -8.36e-4,-0.23171 -0.187115,-0.41846 -0.418337,-0.41846 l -6.509073,-6e-4 c -0.231223,0 -0.41846,0.18711 -0.41846,0.41845 0,0.11664 0.04739,0.22041 0.122356,0.29598 z m 7.224,1.99594 c -8.36e-4,-0.2317 -0.187237,-0.41845 -0.418458,-0.41845 l -6.509559,1.2e-4 c -0.231222,0 -0.418582,0.18711 -0.41846,0.41833 -6.1e-4,0.11543 0.04739,0.22017 0.122598,0.29599 0.07533,0.0753 0.180433,0.12272 0.295983,0.1226 l 6.509438,-1.3e-4 c 0.231221,0 0.418458,-0.18723 0.418458,-0.41846 z m -1.21e-4,2.29193 c -9.65e-4,-0.23171 -0.187359,-0.41846 -0.41858,-0.41846 l -6.509802,-2.4e-4 c -0.231222,0 -0.418459,0.18723 -0.418339,0.41846 3.54e-4,0.11542 0.04739,0.22016 0.12272,0.29598 0.07533,0.0753 0.18019,0.12272 0.295862,0.12272 l 6.50968,1.2e-4 c 0.2311,-1.2e-4 0.418216,-0.18748 0.418459,-0.41858 z m -0.418945,1.8731 -6.509073,-2.4e-4 c -0.2311,0 -0.418338,0.18723 -0.41846,0.41845 4.83e-4,0.11543 0.04739,0.22017 0.122842,0.29599 0.07533,0.0753 0.18019,0.12272 0.295861,0.12272 l 6.508952,1.2e-4 c 0.231343,1.2e-4 0.418458,-0.18724 0.418458,-0.41846 -9.64e-4,-0.23171 -0.18748,-0.4187 -0.41858,-0.41858 z m 5.22004,1.63884 -0.931811,-0.93181 0.931933,-0.93157 c 0.07898,-0.0778 0.123325,-0.18456 0.123084,-0.29586 -3.54e-4,-0.11057 -0.04496,-0.21737 -0.122719,-0.29586 l -0.931691,-0.93169 0.931812,-0.93181 c 0.163058,-0.16343 0.162086,-0.42903 -1.21e-4,-0.59185 l -0.931812,-0.93181 0.931812,-0.93181 c 0.163179,-0.16342 0.162086,-0.42903 0,-0.59185 l -0.93157,-0.93156 0.931205,-0.93121 c 0.163058,-0.16342 0.16318,-0.42842 0,-0.59184 l -1.227794,-1.22768 c -0.07898,-0.079 -0.184807,-0.12247 -0.295862,-0.12272 l -22.0807407,2.5e-4 c -0.110569,-6.1e-4 -0.215548,0.0437 -0.294161,0.12028 l -1.244076,1.22756 c -0.07898,0.079 -0.12527,0.18554 -0.124177,0.29781 -6.07e-4,0.11057 0.04374,0.21749 0.122719,0.29598 v 0 l 0.94141,0.9295 -0.94299,0.92841 c -0.07898,0.079 -0.125391,0.18554 -0.124176,0.2978 3.64e-4,0.11057 0.04374,0.21737 0.122475,0.29587 v 0 l 0.942018,0.92999 -0.94299,0.92804 c -0.07898,0.079 -0.124055,0.18578 -0.124298,0.29781 0.0012,0.11178 0.03524,0.22417 0.124541,0.29768 l 0.941775,0.92999 -0.94384,0.92889 c -0.07898,0.079 -0.125392,0.18554 -0.124177,0.29781 3.65e-4,0.11057 0.04374,0.21749 0.122719,0.29598 v 0 l 0.941896,0.92999 -0.942868,0.92805 c -0.08141,0.0778 -0.125392,0.18565 -0.124298,0.2978 -6.08e-4,0.11057 0.04374,0.21737 0.122718,0.29599 v 0 l 1.243955,1.22791 c 0.07776,0.0765 0.183956,0.12029 0.294039,0.12029 H 27.974562 c 0.110569,-1.2e-4 0.217493,-0.0437 0.295862,-0.12272 l 1.227917,-1.22767 c 0.162693,-0.1627 0.163909,-0.42721 -6.11e-4,-0.59124 z m -1.697162,1.1052 -21.7354287,-1.2e-4 -0.819907,-0.80946 0.943112,-0.92805 c 0.07898,-0.079 0.125392,-0.18553 0.124298,-0.2978 6.08e-4,-0.11057 -0.04374,-0.21749 -0.12284,-0.29598 v 0 l -0.941775,-0.92999 0.943719,-0.9289 c 0.07898,-0.079 0.125392,-0.18554 0.124177,-0.2978 9.72e-4,-0.11057 -0.04374,-0.21336 -0.124298,-0.29757 l -0.941897,-0.92999 0.94299,-0.92804 c 0.07898,-0.079 0.125149,-0.18517 0.124298,-0.29793 -4.86e-4,-0.11057 -0.04374,-0.21737 -0.122718,-0.29586 v 0 l -0.941775,-0.92999 0.943233,-0.92853 c 0.07898,-0.079 0.125391,-0.18554 0.124176,-0.29781 9.72e-4,-0.11056 -0.03767,-0.21189 -0.124662,-0.29792 l -0.941411,-0.9295 0.821851,-0.80691 21.7360357,-4.8e-4 0.809093,0.80909 -0.931569,0.93132 c -0.163058,0.16355 -0.162086,0.42915 1.22e-4,0.59197 l 0.93169,0.93169 -0.931812,0.93169 c -0.163058,0.16354 -0.162086,0.42903 0,0.59184 l 0.931933,0.93194 -0.931811,0.93181 c -0.16318,0.16342 -0.164274,0.42781 0,0.59184 l 0.931811,0.93181 -0.931811,0.93169 c -0.07898,0.0778 -0.123448,0.18445 -0.123085,0.29574 -7.38e-4,0.11057 0.04374,0.21737 0.12272,0.29586 l 0.931812,0.93194 -0.809093,0.80897 z"
           id="path53187"
           style="display:inline;fill:#333333;stroke-width:0.29610667" />
        <path
           sodipodi:nodetypes="ccccscscccccccccccccccsscscccsccccccccscccsccs"
           inkscape:connector-curvature="0"
           id="path53189"
           d="m 17.784827,276.17847 6.509165,5.2e-4 c 0.231222,0 0.417224,0.18687 0.418061,0.41857 0,0.2311 -0.186963,0.41795 -0.418061,0.41807 h -6.509165 c -0.11567,0 -0.220776,-0.0477 -0.296106,-0.12299 -0.07496,-0.0756 -0.122473,-0.17895 -0.122473,-0.29559 0,-0.23134 0.187357,-0.41858 0.418579,-0.41858 z m -5.705594,0.74207 c 0.832422,-1.2e-4 1.615313,0.32444 2.204,0.91313 0.588442,0.58843 0.912728,1.37106 0.912606,2.20348 -1.21e-4,1.71818 -1.398574,3.1165 -3.117122,3.11712 -0.832665,0 -1.614678,-0.32431 -2.2034849,-0.91312 -0.588685,-0.58856 -0.913244,-1.37142 -0.913122,-2.20348 2.43e-4,-1.71842 1.3985749,-3.11701 3.1171229,-3.11713 z m 0,0.83665 c -1.257078,4.7e-4 -2.2801299,1.02364 -2.2804819,2.28048 1.22e-4,0.60849 0.2374449,1.18054 0.6681759,1.61127 0.430611,0.43061 1.003299,0.66845 1.61179,0.66869 1.256833,-6.1e-4 2.279962,-1.023 2.279962,-2.27996 -1.19e-4,-0.6091 -0.236776,-1.18182 -0.667141,-1.61231 -0.43061,-0.43049 -1.003086,-0.66806 -1.612305,-0.66817 z m 5.705594,0.71313 h 6.509681 c 0.23122,0 0.417227,0.18636 0.418063,0.41806 0,0.23123 -0.186843,0.41858 -0.418063,0.41858 h -6.509681 c -0.115549,1.2e-4 -0.220776,-0.0472 -0.296106,-0.12247 -0.07521,-0.0758 -0.123081,-0.18068 -0.122473,-0.29611 -1.21e-4,-0.23122 0.187357,-0.41806 0.418579,-0.41806 z m -5.29e-4,2.29133 6.509681,5.3e-4 c 0.23122,0 0.417613,0.18687 0.418579,0.41858 -2.43e-4,0.2311 -0.187481,0.41846 -0.418579,0.41858 l -6.509681,-5.3e-4 c -0.115674,0 -0.22026,-0.0472 -0.29559,-0.12247 -0.07533,-0.0758 -0.122635,-0.18069 -0.122989,-0.29611 -1.19e-4,-0.23123 0.187357,-0.41858 0.418579,-0.41858 z m 5.29e-4,2.29185 h 6.508647 c 0.2311,-1.2e-4 0.417615,0.18687 0.418579,0.41858 0,0.23122 -0.18672,0.4187 -0.418061,0.41858 h -6.509165 c -0.11567,0 -0.220258,-0.0477 -0.295587,-0.12299 -0.07545,-0.0758 -0.122508,-0.18016 -0.122992,-0.29559 1.22e-4,-0.23122 0.187479,-0.41858 0.418579,-0.41858 z"
           style="opacity:1;fill:#333333;fill-opacity:1;fill-rule:nonzero;stroke:none;stroke-width:2.43701816;stroke-linecap:round;stroke-linejoin:round;stroke-miterlimit:4;stroke-dasharray:none;stroke-dashoffset:0;stroke-opacity:1;paint-order:normal" />
      </g>
    </g>
    <g
       id="g6179"
       transform="translate(-44.319311,8.0639086)">
      <path
         inkscape:connector-curvature="0"
         id="path59147"
         d="m 48.917224,268.83055 -0.838032,1.3802 1.277372,0.90458 -0.681245,1.25903 1.279215,1.01805 -0.768974,1.23905 1.381166,1.1174 -0.810342,1.21809 1.21277,0.89448 -0.666046,1.38477 1.384425,0.96126 20.440478,-5.00632 0.775819,-1.38053 -1.240892,-0.88243 0.619905,-1.42526 -1.241109,-0.84096 0.725007,-1.4613 -1.287583,-0.81925 0.751496,-1.3953 -1.332418,-0.87559 0.806653,-1.44502 -1.36684,-0.82576 z"
         style="fill:#f9f9f9;fill-opacity:1;stroke:none;stroke-width:0.26458332px;stroke-linecap:butt;stroke-linejoin:miter;stroke-opacity:1" />
      <g
         transform="matrix(0.9264098,-0.22642659,0.22642656,0.92640989,-18.609548,16.381962)"
         id="g59153"
         style="stroke-width:1.04857051">
        <g
           transform="translate(1.0780055,0.26347852)"
           id="g59279">
          <path
             inkscape:connector-curvature="0"
             d="m 14.279398,277.82874 c -0.588686,-0.58869 -1.371412,-0.91286 -2.203834,-0.91274 -1.718548,1.2e-4 -3.1168117,1.39827 -3.1170547,3.11669 -1.22e-4,0.83206 0.324293,1.61503 0.912978,2.20359 0.5888067,0.58881 1.3711687,0.91322 2.2038337,0.91322 1.718548,-6.2e-4 3.116691,-1.39875 3.116812,-3.11693 1.22e-4,-0.83242 -0.324293,-1.61539 -0.912735,-2.20383 z m -2.204077,4.48397 c -0.60849,-2.4e-4 -1.18138,-0.23766 -1.611989,-0.66827 -0.430731,-0.43073 -0.6679057,-1.00326 -0.6680267,-1.61175 3.53e-4,-1.25683 1.0230597,-2.27953 2.2801367,-2.28001 0.60922,1.2e-4 1.181867,0.23729 1.612476,0.66778 0.430366,0.43049 0.667298,1.00313 0.667419,1.61223 0,1.25696 -1.023182,2.27941 -2.280016,2.28002 z m 5.409831,-5.42478 c 0.07533,0.0753 0.180311,0.12284 0.295983,0.12284 l 6.509194,3.6e-4 c 0.2311,-1.2e-4 0.418337,-0.18736 0.418337,-0.41846 -8.36e-4,-0.23171 -0.187115,-0.41846 -0.418337,-0.41846 l -6.509073,-6e-4 c -0.231223,0 -0.41846,0.18711 -0.41846,0.41845 0,0.11664 0.04739,0.22041 0.122356,0.29598 z m 7.224,1.99594 c -8.36e-4,-0.2317 -0.187237,-0.41845 -0.418458,-0.41845 l -6.509559,1.2e-4 c -0.231222,0 -0.418582,0.18711 -0.41846,0.41833 -6.1e-4,0.11543 0.04739,0.22017 0.122598,0.29599 0.07533,0.0753 0.180433,0.12272 0.295983,0.1226 l 6.509438,-1.3e-4 c 0.231221,0 0.418458,-0.18723 0.418458,-0.41846 z m -1.21e-4,2.29193 c -9.65e-4,-0.23171 -0.187359,-0.41846 -0.41858,-0.41846 l -6.509802,-2.4e-4 c -0.231222,0 -0.418459,0.18723 -0.418339,0.41846 3.54e-4,0.11542 0.04739,0.22016 0.12272,0.29598 0.07533,0.0753 0.18019,0.12272 0.295862,0.12272 l 6.50968,1.2e-4 c 0.2311,-1.2e-4 0.418216,-0.18748 0.418459,-0.41858 z m -0.418945,1.8731 -6.509073,-2.4e-4 c -0.2311,0 -0.418338,0.18723 -0.41846,0.41845 4.83e-4,0.11543 0.04739,0.22017 0.122842,0.29599 0.07533,0.0753 0.18019,0.12272 0.295861,0.12272 l 6.508952,1.2e-4 c 0.231343,1.2e-4 0.418458,-0.18724 0.418458,-0.41846 -9.64e-4,-0.23171 -0.18748,-0.4187 -0.41858,-0.41858 z m 5.22004,1.63884 -0.931811,-0.93181 0.931933,-0.93157 c 0.07898,-0.0778 0.123325,-0.18456 0.123084,-0.29586 -3.54e-4,-0.11057 -0.04496,-0.21737 -0.122719,-0.29586 l -0.931691,-0.93169 0.931812,-0.93181 c 0.163058,-0.16343 0.162086,-0.42903 -1.21e-4,-0.59185 l -0.931812,-0.93181 0.931812,-0.93181 c 0.163179,-0.16342 0.162086,-0.42903 0,-0.59185 l -0.93157,-0.93156 0.931205,-0.93121 c 0.163058,-0.16342 0.16318,-0.42842 0,-0.59184 l -1.227794,-1.22768 c -0.07898,-0.079 -0.184807,-0.12247 -0.295862,-0.12272 l -22.0807407,2.5e-4 c -0.110569,-6.1e-4 -0.215548,0.0437 -0.294161,0.12028 l -1.244076,1.22756 c -0.07898,0.079 -0.12527,0.18554 -0.124177,0.29781 -6.07e-4,0.11057 0.04374,0.21749 0.122719,0.29598 v 0 l 0.94141,0.9295 -0.94299,0.92841 c -0.07898,0.079 -0.125391,0.18554 -0.124176,0.2978 3.64e-4,0.11057 0.04374,0.21737 0.122475,0.29587 v 0 l 0.942018,0.92999 -0.94299,0.92804 c -0.07898,0.079 -0.124055,0.18578 -0.124298,0.29781 0.0012,0.11178 0.03524,0.22417 0.124541,0.29768 l 0.941775,0.92999 -0.94384,0.92889 c -0.07898,0.079 -0.125392,0.18554 -0.124177,0.29781 3.65e-4,0.11057 0.04374,0.21749 0.122719,0.29598 v 0 l 0.941896,0.92999 -0.942868,0.92805 c -0.08141,0.0778 -0.125392,0.18565 -0.124298,0.2978 -6.08e-4,0.11057 0.04374,0.21737 0.122718,0.29599 v 0 l 1.243955,1.22791 c 0.07776,0.0765 0.183956,0.12029 0.294039,0.12029 H 27.974562 c 0.110569,-1.2e-4 0.217493,-0.0437 0.295862,-0.12272 l 1.227917,-1.22767 c 0.162693,-0.1627 0.163909,-0.42721 -6.11e-4,-0.59124 z m -1.697162,1.1052 -21.7354287,-1.2e-4 -0.819907,-0.80946 0.943112,-0.92805 c 0.07898,-0.079 0.125392,-0.18553 0.124298,-0.2978 6.08e-4,-0.11057 -0.04374,-0.21749 -0.12284,-0.29598 v 0 l -0.941775,-0.92999 0.943719,-0.9289 c 0.07898,-0.079 0.125392,-0.18554 0.124177,-0.2978 9.72e-4,-0.11057 -0.04374,-0.21336 -0.124298,-0.29757 l -0.941897,-0.92999 0.94299,-0.92804 c 0.07898,-0.079 0.125149,-0.18517 0.124298,-0.29793 -4.86e-4,-0.11057 -0.04374,-0.21737 -0.122718,-0.29586 v 0 l -0.941775,-0.92999 0.943233,-0.92853 c 0.07898,-0.079 0.125391,-0.18554 0.124176,-0.29781 9.72e-4,-0.11056 -0.03767,-0.21189 -0.124662,-0.29792 l -0.941411,-0.9295 0.821851,-0.80691 21.7360357,-4.8e-4 0.809093,0.80909 -0.931569,0.93132 c -0.163058,0.16355 -0.162086,0.42915 1.22e-4,0.59197 l 0.93169,0.93169 -0.931812,0.93169 c -0.163058,0.16354 -0.162086,0.42903 0,0.59184 l 0.931933,0.93194 -0.931811,0.93181 c -0.16318,0.16342 -0.164274,0.42781 0,0.59184 l 0.931811,0.93181 -0.931811,0.93169 c -0.07898,0.0778 -0.123448,0.18445 -0.123085,0.29574 -7.38e-4,0.11057 0.04374,0.21737 0.12272,0.29586 l 0.931812,0.93194 -0.809093,0.80897 z"
             id="path59149"
             style="display:inline;fill:#333333;stroke-width:0.33709282" />
          <path
             sodipodi:nodetypes="ccccscscccccccccccccccsscscccsccccccccscccsccs"
             inkscape:connector-curvature="0"
             id="path59151"
             d="m 17.784827,276.17847 6.509165,5.2e-4 c 0.231222,0 0.417224,0.18687 0.418061,0.41857 0,0.2311 -0.186963,0.41795 -0.418061,0.41807 h -6.509165 c -0.11567,0 -0.220776,-0.0477 -0.296106,-0.12299 -0.07496,-0.0756 -0.122473,-0.17895 -0.122473,-0.29559 0,-0.23134 0.187357,-0.41858 0.418579,-0.41858 z m -5.705594,0.74207 c 0.832422,-1.2e-4 1.615313,0.32444 2.204,0.91313 0.588442,0.58843 0.912728,1.37106 0.912606,2.20348 -1.21e-4,1.71818 -1.398574,3.1165 -3.117122,3.11712 -0.832665,0 -1.614678,-0.32431 -2.2034849,-0.91312 -0.588685,-0.58856 -0.913244,-1.37142 -0.913122,-2.20348 2.43e-4,-1.71842 1.3985749,-3.11701 3.1171229,-3.11713 z m 0,0.83665 c -1.257078,4.7e-4 -2.2801299,1.02364 -2.2804819,2.28048 1.22e-4,0.60849 0.2374449,1.18054 0.6681759,1.61127 0.430611,0.43061 1.003299,0.66845 1.61179,0.66869 1.256833,-6.1e-4 2.279962,-1.023 2.279962,-2.27996 -1.19e-4,-0.6091 -0.236776,-1.18182 -0.667141,-1.61231 -0.43061,-0.43049 -1.003086,-0.66806 -1.612305,-0.66817 z m 5.705594,0.71313 h 6.509681 c 0.23122,0 0.417227,0.18636 0.418063,0.41806 0,0.23123 -0.186843,0.41858 -0.418063,0.41858 h -6.509681 c -0.115549,1.2e-4 -0.220776,-0.0472 -0.296106,-0.12247 -0.07521,-0.0758 -0.123081,-0.18068 -0.122473,-0.29611 -1.21e-4,-0.23122 0.187357,-0.41806 0.418579,-0.41806 z m -5.29e-4,2.29133 6.509681,5.3e-4 c 0.23122,0 0.417613,0.18687 0.418579,0.41858 -2.43e-4,0.2311 -0.187481,0.41846 -0.418579,0.41858 l -6.509681,-5.3e-4 c -0.115674,0 -0.22026,-0.0472 -0.29559,-0.12247 -0.07533,-0.0758 -0.122635,-0.18069 -0.122989,-0.29611 -1.19e-4,-0.23123 0.187357,-0.41858 0.418579,-0.41858 z m 5.29e-4,2.29185 h 6.508647 c 0.2311,-1.2e-4 0.417615,0.18687 0.418579,0.41858 0,0.23122 -0.18672,0.4187 -0.418061,0.41858 h -6.509165 c -0.11567,0 -0.220258,-0.0477 -0.295587,-0.12299 -0.07545,-0.0758 -0.122508,-0.18016 -0.122992,-0.29559 1.22e-4,-0.23122 0.187479,-0.41858 0.418579,-0.41858 z"
             style="opacity:1;fill:#333333;fill-opacity:1;fill-rule:nonzero;stroke:none;stroke-width:2.77434278;stroke-linecap:round;stroke-linejoin:round;stroke-miterlimit:4;stroke-dasharray:none;stroke-dashoffset:0;stroke-opacity:1;paint-order:normal" />
        </g>
      </g>
    </g>
  </g>
</svg>
