<?xml version="1.0" encoding="UTF-8" standalone="no"?>
<svg
   xmlns:dc="http://purl.org/dc/elements/1.1/"
   xmlns:cc="http://creativecommons.org/ns#"
   xmlns:rdf="http://www.w3.org/1999/02/22-rdf-syntax-ns#"
   xmlns:svg="http://www.w3.org/2000/svg"
   xmlns="http://www.w3.org/2000/svg"
   xmlns:sodipodi="http://sodipodi.sourceforge.net/DTD/sodipodi-0.dtd"
   xmlns:inkscape="http://www.inkscape.org/namespaces/inkscape"
   sodipodi:docname="intro - 5.svg"
   inkscape:version="1.0 (1.0+r73+1)"
   id="svg39140"
   version="1.1"
   viewBox="0 0 285.75015 508"
   height="508mm"
   width="285.75015mm">
  <defs
     id="defs39134">
    <clipPath
       id="clipPath38461"
       clipPathUnits="userSpaceOnUse">
      <rect
         x="5102.8813"
         y="493.72928"
         width="164.86522"
         height="70.537865"
         ry="0"
         style="display:inline;fill:#f9f9f9;fill-opacity:1;stroke-width:0.26458332"
         id="rect38463" />
    </clipPath>
    <clipPath
       id="clipPath38653"
       clipPathUnits="userSpaceOnUse">
      <path
         sodipodi:nodetypes="ccccccccc"
         style="fill:#3f3d56;stroke-width:0.64020276"
         inkscape:connector-curvature="0"
         d="m 4956.3726,258.25606 -1.4401,-0.83146 29.9233,-51.82858 L 4727.9997,57.300097 4622.3442,240.30083 c -17.4123,56.84903 232.0861,191.25856 256.8561,148.29592 l 59.5174,-103.08723 1.4401,0.83145 z"
         id="path38655" />
    </clipPath>
    <clipPath
       id="clipPath39935"
       clipPathUnits="userSpaceOnUse">
      <rect
         x="5092.7871"
         y="174.61172"
         width="285.75"
         height="508"
         ry="0"
         style="display:inline;fill:#f9f9f9;fill-opacity:1;stroke-width:0.26458332"
         id="rect39937"
         inkscape:export-filename="/media/cosmobird/Work/Cooperative/3 - Repo/uauto/uauto-interaction-design/V 0.0.2/mock/Rasters/Intro-4.png"
         inkscape:export-xdpi="96"
         inkscape:export-ydpi="96" />
    </clipPath>
    <clipPath
       id="clipPath59230"
       clipPathUnits="userSpaceOnUse">
      <rect
         id="rect59232"
         style="display:inline;fill:#f9f9f9;fill-opacity:1;stroke-width:0.26458332"
         ry="0"
         height="1510.2666"
         width="849.52496"
         y="-378.40848"
         x="253.09644"
         inkscape:export-filename="/media/cosmobird/Work/Cooperative/3 - Repo/uauto/uauto-interaction-design/V 0.0.2/mock/Rasters/Intro-5.png"
         inkscape:export-xdpi="96"
         inkscape:export-ydpi="96" />
    </clipPath>
    <clipPath
       clipPathUnits="userSpaceOnUse"
       id="clipPath59230-1">
      <rect
         inkscape:export-ydpi="96"
         inkscape:export-xdpi="96"
         inkscape:export-filename="/media/cosmobird/Work/Cooperative/3 - Repo/uauto/uauto-interaction-design/V 0.0.2/mock/Rasters/Intro-5.png"
         x="253.09644"
         y="-378.40848"
         width="849.52496"
         height="1510.2666"
         ry="0"
         style="display:inline;fill:#f9f9f9;fill-opacity:1;stroke-width:0.264583"
         id="rect59232-7" />
    </clipPath>
  </defs>
  <sodipodi:namedview
     inkscape:document-rotation="0"
     inkscape:window-maximized="1"
     inkscape:window-y="30"
     inkscape:window-x="0"
     inkscape:window-height="1017"
     inkscape:window-width="1920"
     fit-margin-bottom="0"
     fit-margin-right="0"
     fit-margin-left="0"
     fit-margin-top="0"
     showgrid="false"
     inkscape:current-layer="layer1"
     inkscape:document-units="mm"
     inkscape:cy="950.21605"
     inkscape:cx="-1027.975"
     inkscape:zoom="0.35"
     inkscape:pageshadow="2"
     inkscape:pageopacity="0.0"
     borderopacity="1.0"
     bordercolor="#666666"
     pagecolor="#ffffff"
     id="base" />
  <metadata
     id="metadata39137">
    <rdf:RDF>
      <cc:Work
         rdf:about="">
        <dc:format>image/svg+xml</dc:format>
        <dc:type
           rdf:resource="http://purl.org/dc/dcmitype/StillImage" />
        <dc:title />
      </cc:Work>
    </rdf:RDF>
  </metadata>
  <g
     transform="translate(41.923435,165.50136)"
     id="layer1"
     inkscape:groupmode="layer"
     inkscape:label="Layer 1">
    <g
       transform="translate(-191.74637,191.80559)"
       id="g40671">
      <rect
         id="rect50445"
         style="display:inline;fill:#f9f9f9;fill-opacity:1;stroke-width:0.26458332"
         ry="0"
         height="508"
         width="285.75"
         y="-357.30695"
         x="149.82309"
         inkscape:export-filename="/media/cosmobird/Work/Cooperative/3 - Repo/uauto/uauto-interaction-design/V 0.0.2/mock/Rasters/Intro-5.png"
         inkscape:export-xdpi="96"
         inkscape:export-ydpi="96" />
      <g
         style="display:inline;stroke-width:0.78659719"
         id="g65998"
         transform="matrix(0.33636447,0,0,0.33636447,64.690287,-230.02378)"
         inkscape:export-filename="/media/cosmobird/Work/Cooperative/3 - Repo/uauto/uauto-interaction-design/V 0.0.2/mock/Rasters/Intro-5.png"
         inkscape:export-xdpi="96"
         inkscape:export-ydpi="96"
         clip-path="url(#clipPath59230)">
        <ellipse
           id="ellipse65862"
           ry="37"
           rx="562"
           cy="739"
           cx="562"
           style="fill:#43415c;fill-opacity:1;stroke-width:0.78659719" />
        <ellipse
           id="ellipse65864"
           ry="53"
           rx="58"
           cy="216"
           cx="534"
           style="fill:#f9a826;stroke-width:0.78659719" />
        <path
           id="path65866"
           transform="translate(-38,-62)"
           d="m 674.5,763.5 c 0,0 -123.5,49.5 -211,1 l 0.81,-14 7.54,-130 7.13,-123 8.52,-147 h 164 l 7.88,147 6.6,123 6.97,130 z"
           inkscape:connector-curvature="0"
           style="fill:#3f3d56;stroke-width:0.78659719" />
        <path
           id="path65868"
           stroke-miterlimit="10"
           transform="translate(-38,-62)"
           d="M 463.5,350.5"
           inkscape:connector-curvature="0"
           style="fill:none;stroke:#2f2e41;stroke-width:0.78659719;stroke-miterlimit:10" />
        <path
           id="path65870"
           transform="translate(-38,-62)"
           d="m 674.5,763.5 c 0,0 -113.5,50.5 -211,1 l 0.81,-14 h 208.64 z"
           inkscape:connector-curvature="0"
           style="fill:#f9a826;stroke-width:0.78659719" />
        <polygon
           id="polygon65872"
           points="433.85,558.5 440.98,435.5 621.38,435.5 627.98,558.5 "
           style="fill:#f9a826;stroke-width:0.78659719" />
        <rect
           id="rect65874"
           height="20"
           width="184"
           y="272.5"
           x="439.5"
           style="fill:#3f3d56;stroke-width:0.78659719" />
        <rect
           id="rect65876"
           height="20"
           width="184"
           y="205.5"
           x="439.5"
           style="fill:#3f3d56;stroke-width:0.78659719" />
        <rect
           id="rect65878"
           height="52"
           width="11"
           y="225.5"
           x="455.5"
           style="fill:#3f3d56;stroke-width:0.78659719" />
        <rect
           id="rect65880"
           height="52"
           width="11"
           y="225.5"
           x="484.5"
           style="fill:#3f3d56;stroke-width:0.78659719" />
        <rect
           id="rect65882"
           height="52"
           width="11"
           y="225.5"
           x="513.5"
           style="fill:#3f3d56;stroke-width:0.78659719" />
        <rect
           id="rect65884"
           height="52"
           width="11"
           y="225.5"
           x="542.5"
           style="fill:#3f3d56;stroke-width:0.78659719" />
        <rect
           id="rect65886"
           height="52"
           width="11"
           y="225.5"
           x="571.5"
           style="fill:#3f3d56;stroke-width:0.78659719" />
        <rect
           id="rect65888"
           height="68.5"
           width="11"
           y="146"
           x="484.5"
           style="fill:#3f3d56;stroke-width:0.78659719" />
        <rect
           id="rect65890"
           height="68.5"
           width="11"
           y="146"
           x="513.5"
           style="fill:#3f3d56;stroke-width:0.78659719" />
        <rect
           id="rect65892"
           height="68.5"
           width="11"
           y="146"
           x="542.5"
           style="fill:#3f3d56;stroke-width:0.78659719" />
        <rect
           id="rect65894"
           height="68.5"
           width="11"
           y="146"
           x="571.5"
           style="fill:#3f3d56;stroke-width:0.78659719" />
        <rect
           id="rect65896"
           height="52"
           width="11"
           y="225.5"
           x="600.5"
           style="fill:#3f3d56;stroke-width:0.78659719" />
        <rect
           id="rect65898"
           height="61"
           width="11"
           y="154"
           x="456"
           style="fill:#3f3d56;stroke-width:0.78659719" />
        <rect
           id="rect65900"
           height="61"
           width="11"
           y="154"
           x="601"
           style="fill:#3f3d56;stroke-width:0.78659719" />
        <polygon
           id="polygon65902"
           points="440,105.5 532,31 624,105.5 624,165.5 440,165.5 "
           style="fill:#3f3d56;stroke-width:0.78659719" />
        <circle
           id="circle65904"
           r="154.69511"
           cy="215"
           cx="534"
           style="opacity:0.3;fill:#f9a826;stroke-width:0.78659719" />
        <circle
           id="circle65906"
           r="215"
           cy="215"
           cx="534"
           style="opacity:0.3;fill:#f9a826;stroke-width:0.78659719" />
        <path
           id="path65908"
           d="m 726.28172,692.73447 c -6.07317,22.45005 -26.87512,36.35394 -26.87512,36.35394 0,0 -10.95541,-22.49485 -4.88225,-44.94491 6.07316,-22.45006 26.87512,-36.35394 26.87512,-36.35394 0,0 10.95541,22.49485 4.88225,44.94491 z"
           inkscape:connector-curvature="0"
           style="fill:#8985a8;stroke-width:0.78659719" />
        <path
           id="path65910"
           d="m 708.66289,687.90971 c 16.66484,16.22255 18.70033,41.1604 18.70033,41.1604 0,0 -24.98356,-1.36411 -41.64841,-17.58667 -16.66485,-16.22256 -18.70033,-41.16044 -18.70033,-41.16044 0,0 24.98356,1.36415 41.64841,17.58671 z"
           inkscape:connector-curvature="0"
           style="fill:#3f3d56;stroke-width:0.78659719" />
        <path
           id="path65912"
           d="m 384.35554,660.4082 c -8.95314,33.09618 -39.61966,53.59348 -39.61966,53.59348 0,0 -16.15062,-33.16222 -7.19748,-66.2584 8.95314,-33.09618 39.61966,-53.59348 39.61966,-53.59348 0,0 16.15062,33.1622 7.19748,66.2584 z"
           inkscape:connector-curvature="0"
           style="fill:#8985a8;stroke-width:0.78659719" />
        <path
           id="path65914"
           d="m 302.90695,660.4082 c 8.95314,33.09618 39.61966,53.59348 39.61966,53.59348 0,0 16.15062,-33.16222 7.19748,-66.2584 -8.95314,-33.09618 -39.61967,-53.59348 -39.61967,-53.59348 0,0 -16.15061,33.1622 -7.19747,66.2584 z"
           inkscape:connector-curvature="0"
           style="fill:#8985a8;stroke-width:0.78659719" />
        <path
           id="path65916"
           d="m 316.06295,653.29547 c 24.56755,23.91552 27.56829,60.67923 27.56829,60.67923 0,0 -36.83111,-2.011 -61.39865,-25.92651 C 257.66505,664.13268 254.6643,627.369 254.6643,627.369 c 0,0 36.83111,2.011 61.39865,25.92647 z"
           inkscape:connector-curvature="0"
           style="fill:#3f3d56;stroke-width:0.78659719" />
        <path
           id="path65918"
           d="m 371.19953,653.29547 c -24.56754,23.91553 -27.56829,60.67923 -27.56829,60.67923 0,0 36.83112,-2.011 61.39866,-25.92651 24.56754,-23.91551 27.56829,-60.67919 27.56829,-60.67919 0,0 -36.83111,2.011 -61.39866,25.92647 z"
           inkscape:connector-curvature="0"
           style="fill:#3f3d56;stroke-width:0.78659719" />
        <path
           id="path65920"
           transform="translate(-38,-62)"
           d="m 946.958,427.97294 c -7.88435,-13.32212 -23.48292,-13.943 -23.48292,-13.943 0,0 -15.19991,-1.94375 -24.95056,18.346 -9.08838,18.91172 -21.63151,37.17136 -2.01934,41.59846 l 3.54253,-11.02593 2.19386,11.8468 a 76.7367,76.7367 0 0 0 8.39132,0.14341 c 21.00305,-0.6781 41.00527,0.19839 40.36123,-7.33838 -0.85612,-10.01907 3.5502,-26.80882 -4.03612,-39.62736 z"
           inkscape:connector-curvature="0"
           style="fill:#2f2e41;stroke-width:0.78659719" />
        <circle
           id="circle65922"
           r="20.35767"
           cy="383.50128"
           cx="887.04596"
           style="fill:#a0616a;stroke-width:0.78659719" />
        <path
           id="path65924"
           transform="translate(-38,-62)"
           d="m 916.71782,458.76461 c 0,0 9.25348,21.59146 -3.0845,25.90976 l 12.338,40.71533 20.97457,-1.2338 5.55209,-13.57178 -1.2338,-20.35766 -1.8507,-13.57178 c 0,0 -12.95488,3.0845 -11.72108,-19.74077 z"
           inkscape:connector-curvature="0"
           style="fill:#a0616a;stroke-width:0.78659719" />
        <path
           id="path65926"
           transform="translate(-38,-62)"
           d="m 911.78262,484.05747 c 0,0 -20.35766,-1.8507 -18.507,12.95488 1.85066,14.80558 3.7014,17.89007 3.7014,17.89007 l 1.8507,22.20836 -11.10419,6.78589 h -10.48725 c 0,0 -32.07875,7.40279 -16.03937,15.42248 16.03938,8.01969 21.59146,-6.169 21.59146,-6.169 0,0 29.61115,0 31.46185,-4.9352 1.8507,-4.9352 -2.4676,-64.15748 -2.4676,-64.15748 z"
           inkscape:connector-curvature="0"
           style="fill:#a0616a;stroke-width:0.78659719" />
        <path
           id="path65928"
           transform="translate(-38,-62)"
           d="m 951.26416,477.88848 c 0,0 19.12387,-6.78589 20.35767,8.01969 1.2338,14.80558 1.23379,16.03937 1.23379,16.03937 l 3.7014,20.97456 c 0,0 7.40279,18.507 7.40279,24.05907 0,5.55207 5.55209,22.82526 5.55209,22.82526 0,0 7.40279,24.05906 -0.6169,23.44216 -8.01969,-0.6169 -9.25349,-25.90976 -9.25349,-25.90976 l -16.65627,-33.31254 -4.93519,-20.35767 z"
           inkscape:connector-curvature="0"
           style="fill:#a0616a;stroke-width:0.78659719" />
        <path
           id="path65930"
           transform="translate(-38,-62)"
           d="m 914.86712,481.58987 h -4.93519 l -0.6169,25.90976 c 0,0 -8.01969,11.10418 1.8507,20.97457 l 2.46759,16.03937 45.03363,-1.8507 3.08449,-16.65627 c 0,0 6.169,-13.57178 -2.46759,-25.90976 L 951.26416,474.804 h -4.31829 c 0,0 10.00158,36.87706 -11.10419,37.63084 -17.27317,0.61688 -20.97456,-30.84497 -20.97456,-30.84497 z"
           inkscape:connector-curvature="0"
           style="fill:#d0cde1;stroke-width:0.78659719" />
        <path
           id="path65932"
           transform="translate(-38,-62)"
           d="m 916.10092,541.42907 -3.7014,12.338 c 0,0 -77.11237,217.14843 -53.67021,222.70052 23.44216,5.55209 56.13781,12.95488 59.2223,7.40279 3.08449,-5.55209 19.12387,-167.79653 19.12387,-167.79653 0,0 -2.46759,169.64723 5.55209,169.64723 8.01968,0 61.07303,1.23379 64.15753,-6.78589 3.0845,-8.01968 -27.76049,-222.70054 -45.65056,-227.63573 l -4.93519,-11.10418 z"
           inkscape:connector-curvature="0"
           style="fill:#2f2e41;stroke-width:0.78659719" />
        <path
           id="path65934"
           transform="translate(-38,-62)"
           d="m 960.51764,535.26008 -48.735,1.8507 c 0,0 -2.22426,16.65627 0,16.65627 0.6169,0 51.20262,4.3183 50.58572,-3.08449 -0.6169,-7.40279 -1.85072,-15.42248 -1.85072,-15.42248 z"
           inkscape:connector-curvature="0"
           style="fill:#3f3d56;stroke-width:0.78659719" />
        <circle
           id="circle65936"
           r="11.27862"
           cy="352.09744"
           cx="887.38416"
           style="fill:#2f2e41;stroke-width:0.78659719" />
        <path
           id="path65938"
           transform="translate(-38,-62)"
           d="m 912.91833,411.12937 a 11.27906,11.27906 0 0 1 10.0914,-11.21521 11.27862,11.27862 0 1 0 0,22.43042 11.279,11.279 0 0 1 -10.0914,-11.21521 z"
           inkscape:connector-curvature="0"
           style="fill:#2f2e41;stroke-width:0.78659719" />
        <polygon
           id="polygon65940"
           points="868.78,359.919 864.377,379.366 875.338,378.944 878.4,371.799 878.4,378.826 883.457,378.632 886.392,367.257 888.227,379.366 906.206,378.999 905.472,364.689 890.062,356.616 "
           style="fill:#2f2e41;stroke-width:0.78659719" />
        <rect
           id="rect65942"
           transform="rotate(-16.83579,638.21256,636.38196)"
           height="88.038208"
           width="5.8692098"
           y="494.97263"
           x="863.7569"
           style="fill:#3f3d56;stroke-width:0.78659719" />
        <path
           id="path65944"
           transform="translate(-38,-62)"
           d="M 873.43778,477.54775 A 24.01042,24.01042 0 0 1 827.47517,491.456 c -3.84066,-12.69223 8.69714,-54.159 8.69714,-54.159 0,0 33.42481,27.55853 37.26547,40.25075 z"
           inkscape:connector-curvature="0"
           style="fill:#f9a826;stroke-width:0.78659719" />
        <path
           id="path65946"
           transform="translate(-38,-62)"
           d="m 866.43519,484.75374 a 16.345645,16.345645 0 1 1 -31.2901,9.46837 c -2.61461,-8.64052 5.92078,-36.87 5.92078,-36.87 0,0 22.75471,18.76111 25.36932,27.40163 z"
           inkscape:connector-curvature="0"
           style="opacity:0.1;stroke-width:0.78659719" />
      </g>
    </g>
    <g
       id="g18928"
       inkscape:export-filename="/media/cosmobird/Work/Cooperative/3 - Repo/uauto/uauto-interaction-design/V 0.0.2/mock/Rasters/Intro-5.png"
       inkscape:export-xdpi="96"
       inkscape:export-ydpi="96">
      <rect
         inkscape:export-ydpi="96"
         inkscape:export-xdpi="96"
         inkscape:export-filename="/media/cosmobird/Work/Cooperative/3 - Repo/uauto/uauto-interaction-design/V 0.0.2/mock/Rasters/Intro-5.png"
         x="-448.83469"
         y="-165.50136"
         width="285.75"
         height="427.30209"
         ry="0"
         style="display:inline;fill:none;fill-opacity:1;stroke-width:0.24266"
         id="rect18866" />
      <g
         clip-path="url(#clipPath59230-1)"
         inkscape:export-ydpi="96"
         inkscape:export-xdpi="96"
         inkscape:export-filename="/media/cosmobird/Work/Cooperative/3 - Repo/uauto/uauto-interaction-design/V 0.0.2/mock/Rasters/Intro-5.png"
         transform="matrix(0.33636445,0,0,0.33636445,-533.96734,-41.517091)"
         id="g65998-2"
         style="display:inline;stroke-width:0.786597">
        <ellipse
           style="fill:#43415c;fill-opacity:1;stroke-width:0.786597"
           cx="562"
           cy="739"
           rx="562"
           ry="37"
           id="ellipse65862-7" />
        <ellipse
           style="fill:#f9a826;stroke-width:0.786597"
           cx="534"
           cy="216"
           rx="58"
           ry="53"
           id="ellipse65864-2" />
        <path
           style="fill:#3f3d56;stroke-width:0.786597"
           inkscape:connector-curvature="0"
           d="m 674.5,763.5 c 0,0 -123.5,49.5 -211,1 l 0.81,-14 7.54,-130 7.13,-123 8.52,-147 h 164 l 7.88,147 6.6,123 6.97,130 z"
           transform="translate(-38,-62)"
           id="path65866-2" />
        <path
           style="fill:none;stroke:#2f2e41;stroke-width:0.786597;stroke-miterlimit:10"
           inkscape:connector-curvature="0"
           d="M 463.5,350.5"
           transform="translate(-38,-62)"
           stroke-miterlimit="10"
           id="path65868-6" />
        <path
           style="fill:#f9a826;stroke-width:0.786597"
           inkscape:connector-curvature="0"
           d="m 674.5,763.5 c 0,0 -113.5,50.5 -211,1 l 0.81,-14 h 208.64 z"
           transform="translate(-38,-62)"
           id="path65870-1" />
        <polygon
           style="fill:#f9a826;stroke-width:0.786597"
           points="621.38,435.5 627.98,558.5 433.85,558.5 440.98,435.5 "
           id="polygon65872-0" />
        <rect
           style="fill:#3f3d56;stroke-width:0.786597"
           x="439.5"
           y="272.5"
           width="184"
           height="20"
           id="rect65874-6" />
        <rect
           style="fill:#3f3d56;stroke-width:0.786597"
           x="439.5"
           y="205.5"
           width="184"
           height="20"
           id="rect65876-1" />
        <rect
           style="fill:#3f3d56;stroke-width:0.786597"
           x="455.5"
           y="225.5"
           width="11"
           height="52"
           id="rect65878-5" />
        <rect
           style="fill:#3f3d56;stroke-width:0.786597"
           x="484.5"
           y="225.5"
           width="11"
           height="52"
           id="rect65880-9" />
        <rect
           style="fill:#3f3d56;stroke-width:0.786597"
           x="513.5"
           y="225.5"
           width="11"
           height="52"
           id="rect65882-4" />
        <rect
           style="fill:#3f3d56;stroke-width:0.786597"
           x="542.5"
           y="225.5"
           width="11"
           height="52"
           id="rect65884-9" />
        <rect
           style="fill:#3f3d56;stroke-width:0.786597"
           x="571.5"
           y="225.5"
           width="11"
           height="52"
           id="rect65886-0" />
        <rect
           style="fill:#3f3d56;stroke-width:0.786597"
           x="484.5"
           y="146"
           width="11"
           height="68.5"
           id="rect65888-9" />
        <rect
           style="fill:#3f3d56;stroke-width:0.786597"
           x="513.5"
           y="146"
           width="11"
           height="68.5"
           id="rect65890-1" />
        <rect
           style="fill:#3f3d56;stroke-width:0.786597"
           x="542.5"
           y="146"
           width="11"
           height="68.5"
           id="rect65892-7" />
        <rect
           style="fill:#3f3d56;stroke-width:0.786597"
           x="571.5"
           y="146"
           width="11"
           height="68.5"
           id="rect65894-7" />
        <rect
           style="fill:#3f3d56;stroke-width:0.786597"
           x="600.5"
           y="225.5"
           width="11"
           height="52"
           id="rect65896-1" />
        <rect
           style="fill:#3f3d56;stroke-width:0.786597"
           x="456"
           y="154"
           width="11"
           height="61"
           id="rect65898-1" />
        <rect
           style="fill:#3f3d56;stroke-width:0.786597"
           x="601"
           y="154"
           width="11"
           height="61"
           id="rect65900-5" />
        <polygon
           style="fill:#3f3d56;stroke-width:0.786597"
           points="440,105.5 532,31 624,105.5 624,165.5 440,165.5 "
           id="polygon65902-9" />
        <circle
           style="opacity:0.3;fill:#f9a826;stroke-width:0.786597"
           cx="534"
           cy="215"
           r="154.69511"
           id="circle65904-7" />
        <circle
           style="opacity:0.3;fill:#f9a826;stroke-width:0.786597"
           cx="534"
           cy="215"
           r="215"
           id="circle65906-7" />
        <path
           style="fill:#8985a8;stroke-width:0.786597"
           inkscape:connector-curvature="0"
           d="m 726.28172,692.73447 c -6.07317,22.45005 -26.87512,36.35394 -26.87512,36.35394 0,0 -10.95541,-22.49485 -4.88225,-44.94491 6.07316,-22.45006 26.87512,-36.35394 26.87512,-36.35394 0,0 10.95541,22.49485 4.88225,44.94491 z"
           id="path65908-6" />
        <path
           style="fill:#3f3d56;stroke-width:0.786597"
           inkscape:connector-curvature="0"
           d="m 708.66289,687.90971 c 16.66484,16.22255 18.70033,41.1604 18.70033,41.1604 0,0 -24.98356,-1.36411 -41.64841,-17.58667 -16.66485,-16.22256 -18.70033,-41.16044 -18.70033,-41.16044 0,0 24.98356,1.36415 41.64841,17.58671 z"
           id="path65910-7" />
        <path
           style="fill:#8985a8;stroke-width:0.786597"
           inkscape:connector-curvature="0"
           d="m 384.35554,660.4082 c -8.95314,33.09618 -39.61966,53.59348 -39.61966,53.59348 0,0 -16.15062,-33.16222 -7.19748,-66.2584 8.95314,-33.09618 39.61966,-53.59348 39.61966,-53.59348 0,0 16.15062,33.1622 7.19748,66.2584 z"
           id="path65912-3" />
        <path
           style="fill:#8985a8;stroke-width:0.786597"
           inkscape:connector-curvature="0"
           d="m 302.90695,660.4082 c 8.95314,33.09618 39.61966,53.59348 39.61966,53.59348 0,0 16.15062,-33.16222 7.19748,-66.2584 -8.95314,-33.09618 -39.61967,-53.59348 -39.61967,-53.59348 0,0 -16.15061,33.1622 -7.19747,66.2584 z"
           id="path65914-6" />
        <path
           style="fill:#3f3d56;stroke-width:0.786597"
           inkscape:connector-curvature="0"
           d="m 316.06295,653.29547 c 24.56755,23.91552 27.56829,60.67923 27.56829,60.67923 0,0 -36.83111,-2.011 -61.39865,-25.92651 C 257.66505,664.13268 254.6643,627.369 254.6643,627.369 c 0,0 36.83111,2.011 61.39865,25.92647 z"
           id="path65916-5" />
        <path
           style="fill:#3f3d56;stroke-width:0.786597"
           inkscape:connector-curvature="0"
           d="m 371.19953,653.29547 c -24.56754,23.91553 -27.56829,60.67923 -27.56829,60.67923 0,0 36.83112,-2.011 61.39866,-25.92651 24.56754,-23.91551 27.56829,-60.67919 27.56829,-60.67919 0,0 -36.83111,2.011 -61.39866,25.92647 z"
           id="path65918-6" />
        <path
           style="fill:#2f2e41;stroke-width:0.786597"
           inkscape:connector-curvature="0"
           d="m 946.958,427.97294 c -7.88435,-13.32212 -23.48292,-13.943 -23.48292,-13.943 0,0 -15.19991,-1.94375 -24.95056,18.346 -9.08838,18.91172 -21.63151,37.17136 -2.01934,41.59846 l 3.54253,-11.02593 2.19386,11.8468 a 76.7367,76.7367 0 0 0 8.39132,0.14341 c 21.00305,-0.6781 41.00527,0.19839 40.36123,-7.33838 -0.85612,-10.01907 3.5502,-26.80882 -4.03612,-39.62736 z"
           transform="translate(-38,-62)"
           id="path65920-3" />
        <circle
           style="fill:#a0616a;stroke-width:0.786597"
           cx="887.04596"
           cy="383.50128"
           r="20.35767"
           id="circle65922-9" />
        <path
           style="fill:#a0616a;stroke-width:0.786597"
           inkscape:connector-curvature="0"
           d="m 916.71782,458.76461 c 0,0 9.25348,21.59146 -3.0845,25.90976 l 12.338,40.71533 20.97457,-1.2338 5.55209,-13.57178 -1.2338,-20.35766 -1.8507,-13.57178 c 0,0 -12.95488,3.0845 -11.72108,-19.74077 z"
           transform="translate(-38,-62)"
           id="path65924-4" />
        <path
           style="fill:#a0616a;stroke-width:0.786597"
           inkscape:connector-curvature="0"
           d="m 911.78262,484.05747 c 0,0 -20.35766,-1.8507 -18.507,12.95488 1.85066,14.80558 3.7014,17.89007 3.7014,17.89007 l 1.8507,22.20836 -11.10419,6.78589 h -10.48725 c 0,0 -32.07875,7.40279 -16.03937,15.42248 16.03938,8.01969 21.59146,-6.169 21.59146,-6.169 0,0 29.61115,0 31.46185,-4.9352 1.8507,-4.9352 -2.4676,-64.15748 -2.4676,-64.15748 z"
           transform="translate(-38,-62)"
           id="path65926-8" />
        <path
           style="fill:#a0616a;stroke-width:0.786597"
           inkscape:connector-curvature="0"
           d="m 951.26416,477.88848 c 0,0 19.12387,-6.78589 20.35767,8.01969 1.2338,14.80558 1.23379,16.03937 1.23379,16.03937 l 3.7014,20.97456 c 0,0 7.40279,18.507 7.40279,24.05907 0,5.55207 5.55209,22.82526 5.55209,22.82526 0,0 7.40279,24.05906 -0.6169,23.44216 -8.01969,-0.6169 -9.25349,-25.90976 -9.25349,-25.90976 l -16.65627,-33.31254 -4.93519,-20.35767 z"
           transform="translate(-38,-62)"
           id="path65928-1" />
        <path
           style="fill:#f9a826;fill-opacity:1;stroke-width:0.786597"
           inkscape:connector-curvature="0"
           d="m 914.86712,481.58987 h -4.93519 l -0.6169,25.90976 c 0,0 -8.01969,11.10418 1.8507,20.97457 l 2.46759,16.03937 45.03363,-1.8507 3.08449,-16.65627 c 0,0 6.169,-13.57178 -2.46759,-25.90976 L 951.26416,474.804 h -4.31829 c 0,0 10.00158,36.87706 -11.10419,37.63084 -17.27317,0.61688 -20.97456,-30.84497 -20.97456,-30.84497 z"
           transform="translate(-38,-62)"
           id="path65930-2" />
        <path
           style="fill:#2f2e41;stroke-width:0.786597"
           inkscape:connector-curvature="0"
           d="m 916.10092,541.42907 -3.7014,12.338 c 0,0 -77.11237,217.14843 -53.67021,222.70052 23.44216,5.55209 56.13781,12.95488 59.2223,7.40279 3.08449,-5.55209 19.12387,-167.79653 19.12387,-167.79653 0,0 -2.46759,169.64723 5.55209,169.64723 8.01968,0 61.07303,1.23379 64.15753,-6.78589 3.0845,-8.01968 -27.76049,-222.70054 -45.65056,-227.63573 l -4.93519,-11.10418 z"
           transform="translate(-38,-62)"
           id="path65932-9" />
        <path
           style="fill:#3f3d56;stroke-width:0.786597"
           inkscape:connector-curvature="0"
           d="m 960.51764,535.26008 -48.735,1.8507 c 0,0 -2.22426,16.65627 0,16.65627 0.6169,0 51.20262,4.3183 50.58572,-3.08449 -0.6169,-7.40279 -1.85072,-15.42248 -1.85072,-15.42248 z"
           transform="translate(-38,-62)"
           id="path65934-3" />
        <circle
           style="fill:#2f2e41;stroke-width:0.786597"
           cx="887.38416"
           cy="352.09744"
           r="11.27862"
           id="circle65936-9" />
        <path
           style="fill:#2f2e41;stroke-width:0.786597"
           inkscape:connector-curvature="0"
           d="m 912.91833,411.12937 a 11.27906,11.27906 0 0 1 10.0914,-11.21521 11.27862,11.27862 0 1 0 0,22.43042 11.279,11.279 0 0 1 -10.0914,-11.21521 z"
           transform="translate(-38,-62)"
           id="path65938-0" />
        <polygon
           style="fill:#2f2e41;stroke-width:0.786597"
           points="886.392,367.257 888.227,379.366 906.206,378.999 905.472,364.689 890.062,356.616 868.78,359.919 864.377,379.366 875.338,378.944 878.4,371.799 878.4,378.826 883.457,378.632 "
           id="polygon65940-8" />
        <rect
           style="fill:#3f3d56;stroke-width:0.786597"
           x="863.7569"
           y="494.97263"
           width="5.8692098"
           height="88.038208"
           transform="rotate(-16.83579,638.21256,636.38196)"
           id="rect65942-8" />
        <path
           style="fill:#f9a826;stroke-width:0.786597"
           inkscape:connector-curvature="0"
           d="M 873.43778,477.54775 A 24.01042,24.01042 0 0 1 827.47517,491.456 c -3.84066,-12.69223 8.69714,-54.159 8.69714,-54.159 0,0 33.42481,27.55853 37.26547,40.25075 z"
           transform="translate(-38,-62)"
           id="path65944-5" />
        <path
           style="opacity:0.398;fill:#3f3d56;fill-opacity:1;stroke-width:0.786597"
           inkscape:connector-curvature="0"
           d="m 866.43519,484.75374 a 16.345645,16.345645 0 1 1 -31.2901,9.46837 c -2.61461,-8.64052 5.92078,-36.87 5.92078,-36.87 0,0 22.75471,18.76111 25.36932,27.40163 z"
           transform="translate(-38,-62)"
           id="path65946-0" />
      </g>
    </g>
  </g>
</svg>
