<?xml version="1.0" encoding="UTF-8" standalone="no"?>
<!-- Created with Inkscape (http://www.inkscape.org/) -->

<svg
   xmlns:dc="http://purl.org/dc/elements/1.1/"
   xmlns:cc="http://creativecommons.org/ns#"
   xmlns:rdf="http://www.w3.org/1999/02/22-rdf-syntax-ns#"
   xmlns:svg="http://www.w3.org/2000/svg"
   xmlns="http://www.w3.org/2000/svg"
   xmlns:sodipodi="http://sodipodi.sourceforge.net/DTD/sodipodi-0.dtd"
   xmlns:inkscape="http://www.inkscape.org/namespaces/inkscape"
   width="144.49777mm"
   height="144.49779mm"
   viewBox="0 0 511.99998 512.00003"
   id="svg3479"
   version="1.1"
   inkscape:version="0.91 r13725"
   sodipodi:docname="photo-male-colored.svg">
  <defs
     id="defs3481" />
  <sodipodi:namedview
     id="base"
     pagecolor="#ffffff"
     bordercolor="#666666"
     borderopacity="1.0"
     inkscape:pageopacity="0.0"
     inkscape:pageshadow="2"
     inkscape:zoom="0.35"
     inkscape:cx="822.42855"
     inkscape:cy="398.85715"
     inkscape:document-units="px"
     inkscape:current-layer="layer1"
     showgrid="false"
     fit-margin-top="0"
     fit-margin-left="0"
     fit-margin-right="0"
     fit-margin-bottom="0"
     inkscape:window-width="1366"
     inkscape:window-height="705"
     inkscape:window-x="0"
     inkscape:window-y="30"
     inkscape:window-maximized="1" />
  <metadata
     id="metadata3484">
    <rdf:RDF>
      <cc:Work
         rdf:about="">
        <dc:format>image/svg+xml</dc:format>
        <dc:type
           rdf:resource="http://purl.org/dc/dcmitype/StillImage" />
        <dc:title></dc:title>
      </cc:Work>
    </rdf:RDF>
  </metadata>
  <g
     inkscape:label="Layer 1"
     inkscape:groupmode="layer"
     id="layer1"
     transform="translate(447.42855,-419.21934)">
    <g
       id="g19959"
       transform="matrix(3.5433071,0,0,3.5433071,2951.7599,731.16699)">
      <path
         style="opacity:1;fill:#eab839;fill-opacity:1;stroke:#1a1a1a;stroke-width:3.62929559;stroke-linecap:round;stroke-linejoin:round;stroke-miterlimit:4;stroke-dasharray:none;stroke-dashoffset:0;stroke-opacity:1"
         id="path19948"
         sodipodi:type="arc"
         sodipodi:cx="-887.07745"
         sodipodi:cy="-15.789863"
         sodipodi:rx="70.420219"
         sodipodi:ry="70.42041"
         sodipodi:start="4.4738897"
         sodipodi:end="4.4505896"
         sodipodi:open="true"
         d="m -903.71385,-84.216925 a 70.420219,70.42041 0 0 1 84.96521,51.392312 70.420219,70.42041 0 0 1 -50.89638,85.263358 70.420219,70.42041 0 0 1 -85.55816,-50.3989952 70.420219,70.42041 0 0 1 49.89963,-85.8505058" />
      <g
         style="stroke:#2f2f2f;stroke-width:1;stroke-miterlimit:4;stroke-dasharray:none;stroke-opacity:1"
         id="g19950">
        <g
           id="g19910"
           transform="matrix(4.9496087,0,0,4.9496087,-946.46902,-71.456758)"
           style="fill:#2f2f2f;fill-opacity:1;stroke:#2f2f2f;stroke-width:0.20203617;stroke-miterlimit:4;stroke-dasharray:none;stroke-opacity:1">
          <path
             inkscape:connector-curvature="0"
             d="M 2.364,21.222341 C 2.443,19.668341 2.533,18.47 3.312,16.877 c 1.69,-1 4.4073784,-2.591976 6.2723784,-3.188976 0.21,-0.067 0.326,-0.292 0.259,-0.503 -0.067,-0.211 -0.291,-0.329 -0.503,-0.259 C 7.3803784,13.553024 4.572,15.191 2.801,16.25 2.737,16.289 2.684,16.344 2.65,16.412 1.746,18.183 1.646,19.015618 1.565,20.600618 l -0.021,0.396 c -0.006,0.11 0.034,0.218 0.11,0.298 m 20.801,-0.02853 -0.023,-0.702471 C 22.35,18.988618 22.246,18.17 21.346,16.412 c -0.031,-0.059 -0.075,-0.11 -0.131,-0.147 -1.559,-1.066 -4.335651,-2.863743 -6.527651,-3.495743 -0.214,-0.061 -0.434,0.062 -0.495,0.273 -0.061,0.212 0.062,0.434 0.274,0.495 2.069,0.596 4.739651,2.337743 6.212651,3.329743 0.781,1.583 0.873,2.192618 0.954,3.738618 l 0.011,0.587815"
             id="path19912"
             sodipodi:nodetypes="cccscccccccccccccccc"
             style="fill:#2f2f2f;fill-opacity:1;stroke:#2f2f2f;stroke-width:0.20203617;stroke-miterlimit:4;stroke-dasharray:none;stroke-opacity:1" />
          <path
             inkscape:connector-curvature="0"
             d="m 7.412,11.302344 c 0.9410188,1.616834 2.069,2.526771 4.027,3.224771 0.129,0.04 0.374,0.048 0.557,0.048 0.316,0 0.46,-0.022 0.529,-0.04 0.016,-0.003 0.031,-0.007 0.047,-0.013 2.004,-0.697 3.01951,-1.91114 3.934,-3.377771 C 17.24647,9.9568001 17.597775,8.4793185 17.56,7.0803438 17.503502,4.9879851 16.570885,1.834 15.657885,1.096 c -1.548,-1.252 -3.32777,-1.378 -6.0777704,-0.339 -0.238,0.09 -0.489,0.139 -0.731,0.186 -0.541,0.106 -1.153,0.225 -1.589,0.827 C 5.8195501,4.8845512 5.7118343,8.2753706 7.412,11.302344 Z M 7.148,7.5773438 C 7.3217131,5.8754853 6.9096585,3.7042935 7.9091146,2.239 c 0.238,-0.33 0.555,-0.405 1.092,-0.509 0.262,-0.052 0.56,-0.11 0.862,-0.224 2.4770004,-0.933 3.9687704,-0.856 5.2917704,0.213 1.117,0.904 1.517568,3.6028393 1.576115,5.5133438 -0.01384,3.2055302 -2.60525,6.3395972 -4.403,6.5287712 -0.139,0.024 -0.572,0.016 -0.638,0.008 C 9.9073505,13.42774 7.2050438,10.655576 7.148,7.5773438 Z"
             id="path19914"
             style="fill:#2f2f2f;fill-opacity:1;stroke:#2f2f2f;stroke-width:0.20203617;stroke-miterlimit:4;stroke-dasharray:none;stroke-opacity:1"
             sodipodi:nodetypes="ccsccaacccccccccccccc" />
        </g>
        <path
           style="fill:#2f2f2f;fill-opacity:1;fill-rule:evenodd;stroke:#2f2f2f;stroke-width:1;stroke-linecap:butt;stroke-linejoin:miter;stroke-miterlimit:4;stroke-dasharray:none;stroke-opacity:1"
           d="m -886.85402,-43.348508 c 4.90012,-2.578583 10.29812,-9.43217 13.34396,-9.853078 3.04584,-0.420908 9.70971,8.792797 10.56781,14.557516 0.94951,6.378858 -1.01757,9.609071 1.10464,12.031513 l -2.12466,-24.929171 -1.50985,-5.206125 -2.95874,-5.742713 -4.8459,-5.125509 -9.27884,-2.036501 -10.97824,1.347218 -8.52531,3.083959 -7.07785,3.92896 -2.58518,5.703766 -2.36914,8.735094 c 0.79961,5.274234 -2.4128,7.231867 0.48726,7.43345 12.67498,0.839579 19.31735,-1.42756 26.75004,-3.928379 z"
           id="path19942"
           inkscape:connector-curvature="0"
           sodipodi:nodetypes="czsccccccccccccc" />
        <path
           style="fill:none;fill-rule:evenodd;stroke:#2f2f2f;stroke-width:4.5;stroke-linecap:butt;stroke-linejoin:miter;stroke-miterlimit:4;stroke-dasharray:none;stroke-opacity:1"
           d="m -917.57511,3.4658464 c 0,0 3.4954,3.5521228 5.41666,5.131576 1.71096,1.4065696 3.50569,2.7288456 5.41666,3.8486816 2.58557,1.515157 5.32065,2.792036 8.125,3.848681 1.94218,0.731787 3.93447,1.401699 5.98683,1.710524 2.30278,0.346506 4.66306,0.324351 6.98465,0.142544 2.69466,-0.211022 5.39394,-0.647401 7.98245,-1.425436 2.52739,-0.759666 4.95387,-1.870415 7.26973,-3.135963 2.31285,-1.263906 4.50483,-2.764988 6.55701,-4.418858 2.40729,-1.9400509 6.69956,-6.414468 6.69956,-6.414468"
           id="path19946"
           inkscape:connector-curvature="0"
           sodipodi:nodetypes="caaaaaaaac" />
      </g>
    </g>
  </g>
</svg>
