<?xml version="1.0" encoding="UTF-8" standalone="no"?>
<!-- Created with Inkscape (http://www.inkscape.org/) -->

<svg
   xmlns:dc="http://purl.org/dc/elements/1.1/"
   xmlns:cc="http://creativecommons.org/ns#"
   xmlns:rdf="http://www.w3.org/1999/02/22-rdf-syntax-ns#"
   xmlns:svg="http://www.w3.org/2000/svg"
   xmlns="http://www.w3.org/2000/svg"
   xmlns:sodipodi="http://sodipodi.sourceforge.net/DTD/sodipodi-0.dtd"
   xmlns:inkscape="http://www.inkscape.org/namespaces/inkscape"
   width="104.42101mm"
   height="172.43634mm"
   viewBox="0 0 369.99569 610.99491"
   id="svg4409"
   version="1.1"
   inkscape:version="0.91 r13725"
   sodipodi:docname="location-marker-to.svg">
  <defs
     id="defs4411">
    <filter
       inkscape:collect="always"
       style="color-interpolation-filters:sRGB"
       id="filter4828-3"
       x="-0.02887154"
       width="1.0577431"
       y="-0.020535083"
       height="1.0410702">
      <feGaussianBlur
         inkscape:collect="always"
         stdDeviation="1.2363641"
         id="feGaussianBlur4830-6" />
    </filter>
  </defs>
  <sodipodi:namedview
     id="base"
     pagecolor="#ffffff"
     bordercolor="#666666"
     borderopacity="1.0"
     inkscape:pageopacity="0.0"
     inkscape:pageshadow="2"
     inkscape:zoom="0.35"
     inkscape:cx="18.854974"
     inkscape:cy="321.49747"
     inkscape:document-units="px"
     inkscape:current-layer="layer1"
     showgrid="false"
     fit-margin-top="0"
     fit-margin-left="0"
     fit-margin-right="0"
     fit-margin-bottom="0"
     inkscape:window-width="1366"
     inkscape:window-height="705"
     inkscape:window-x="0"
     inkscape:window-y="30"
     inkscape:window-maximized="1" />
  <metadata
     id="metadata4414">
    <rdf:RDF>
      <cc:Work
         rdf:about="">
        <dc:format>image/svg+xml</dc:format>
        <dc:type
           rdf:resource="http://purl.org/dc/dcmitype/StillImage" />
        <dc:title></dc:title>
      </cc:Work>
    </rdf:RDF>
  </metadata>
  <g
     inkscape:label="Layer 1"
     inkscape:groupmode="layer"
     id="layer1"
     transform="translate(489.56926,-242.86472)">
    <g
       transform="translate(-679.57136,-33.497467)"
       id="g4184"
       inkscape:export-filename="/media/chinna/Work/Organizing Matrix/2-Communities/4 Cooperative/3 - Repo/uauto/uauto-interaction-design/Assets/bitmap/location-marker-to.png"
       inkscape:export-xdpi="90"
       inkscape:export-ydpi="90">
      <path
         d="m 353.05362,867.64018 a 110,10 0 0 1 132.72002,7.29793 110,10 0 0 1 -79.50276,12.10776 110,10 0 0 1 -133.64623,-7.15687 110,10 0 0 1 77.94578,-12.19114"
         sodipodi:open="true"
         sodipodi:end="4.4505896"
         sodipodi:start="4.4738897"
         sodipodi:ry="10"
         sodipodi:rx="110"
         sodipodi:cy="877.35712"
         sodipodi:cx="379.04053"
         sodipodi:type="arc"
         id="path4161"
         style="opacity:1;fill:#a2a2a2;fill-opacity:1;stroke:none;stroke-width:3.5;stroke-linecap:round;stroke-linejoin:round;stroke-miterlimit:4;stroke-dasharray:3.5, 7;stroke-dashoffset:0;stroke-opacity:1" />
      <g
         transform="matrix(3.4035236,0,0,3.4035236,-1434.545,480.84819)"
         id="g4851-5">
        <path
           sodipodi:nodetypes="sscss"
           id="path4832-6"
           style="opacity:1;fill:#808080;fill-opacity:1;stroke:none;stroke-width:2;stroke-linecap:butt;stroke-linejoin:miter;stroke-miterlimit:4;stroke-dasharray:none;stroke-dashoffset:0;stroke-opacity:1;filter:url(#filter4828-3)"
           d="m 531.66776,-57.113403 c -28.38066,6.9e-5 -51.38697,23.007266 -51.38718,51.3878056 0,28.3804564 52.95174,93.1099724 52.95174,93.1099724 0,0 49.82331,-64.729516 49.82331,-93.1099724 0,-28.3805396 -23.00749,-51.3877366 -51.38787,-51.3878056 z"
           inkscape:connector-curvature="0" />
        <g
           id="g4612-2"
           transform="matrix(0.6907538,0,0,0.6907538,302.25385,27.023287)">
          <g
             id="g4614-9"
             transform="matrix(0.55357143,0,0,0.55357143,727.404,-304.02832)"
             inkscape:export-filename="/media/chinna/Work/Organizing Matrix/2-Communities/4 Cooperative/2 - SIGs/coop-transport/2 - Digital Mockups/Assets/auto.png"
             inkscape:export-xdpi="90"
             inkscape:export-ydpi="90">
            <g
               transform="matrix(2.8062593,0,0,2.8062593,-1237.8386,162.03237)"
               id="g4616-1">
              <rect
                 style="opacity:1;fill:#231f20;fill-opacity:1;stroke:#231f20;stroke-width:0.27260011;stroke-linecap:round;stroke-linejoin:round;stroke-miterlimit:4;stroke-dasharray:none;stroke-dashoffset:0;stroke-opacity:1"
                 id="rect4618-2"
                 width="4.9824758"
                 height="9.3111629"
                 x="200.69505"
                 y="123.30774"
                 ry="1.6361768"
                 rx="1.8077935" />
              <rect
                 rx="1.8077935"
                 ry="1.6361768"
                 y="123.30774"
                 x="169.52861"
                 height="9.3111629"
                 width="4.9824758"
                 id="rect4620-7"
                 style="opacity:1;fill:#231f20;fill-opacity:1;stroke:#231f20;stroke-width:0.27260011;stroke-linecap:round;stroke-linejoin:round;stroke-miterlimit:4;stroke-dasharray:none;stroke-dashoffset:0;stroke-opacity:1" />
              <rect
                 style="opacity:1;fill:#231f20;fill-opacity:1;stroke:#231f20;stroke-width:0.27084017;stroke-linecap:round;stroke-linejoin:round;stroke-miterlimit:4;stroke-dasharray:none;stroke-dashoffset:0;stroke-opacity:1"
                 id="rect4622-0"
                 width="4.917418"
                 height="9.3129225"
                 x="185.22961"
                 y="125.95271"
                 ry="1.4361477"
                 rx="1.3190845" />
              <rect
                 rx="2.0011637"
                 ry="2.0011637"
                 y="119.5355"
                 x="168.92049"
                 height="8.3275442"
                 width="6.2032561"
                 id="rect4624-9"
                 style="opacity:1;fill:#49494a;fill-opacity:1;stroke:#49494a;stroke-width:0.28765363;stroke-linecap:round;stroke-linejoin:round;stroke-miterlimit:4;stroke-dasharray:none;stroke-dashoffset:0;stroke-opacity:1" />
              <rect
                 style="opacity:1;fill:#49494a;fill-opacity:1;stroke:#49494a;stroke-width:0.28765363;stroke-linecap:round;stroke-linejoin:round;stroke-miterlimit:4;stroke-dasharray:none;stroke-dashoffset:0;stroke-opacity:1"
                 id="rect4626-3"
                 width="6.2032561"
                 height="8.3275442"
                 x="200.08466"
                 y="119.5355"
                 ry="2.0011637"
                 rx="2.0011637" />
              <path
                 sodipodi:nodetypes="csszcczssc"
                 inkscape:connector-curvature="0"
                 id="path4628-6"
                 d="m 175.07542,84.086501 25.06741,0 c 1.5878,0 3.67907,1.691013 4.00193,3.537599 0,0 2.86727,16.39906 2.94595,16.84911 0.0787,0.45004 -0.002,0.0119 -0.002,3.41633 l -38.82367,0.0398 c 0,-3.45575 -0.0553,-2.99578 0.0209,-3.45615 0.0761,-0.46037 2.78751,-16.84909 2.78751,-16.84909 0.30605,-1.850145 2.41416,-3.537599 4.00195,-3.537599 z"
                 style="opacity:1;fill:#eab839;fill-opacity:1;stroke:#eab839;stroke-width:0.35337758;stroke-linecap:round;stroke-linejoin:round;stroke-miterlimit:4;stroke-dasharray:none;stroke-dashoffset:0;stroke-opacity:1" />
              <path
                 style="opacity:1;fill:#eeeeef;fill-opacity:1;stroke:#eeeeef;stroke-width:0.2710737;stroke-linecap:round;stroke-linejoin:round;stroke-miterlimit:4;stroke-dasharray:none;stroke-dashoffset:0;stroke-opacity:1"
                 d="m 177.0801,87.583154 21.08686,0 c 1.31179,0 2.63027,1.109229 2.89701,2.424445 l 2.43384,12.000641 c 0.26674,1.31523 -0.52689,2.42445 -1.83867,2.42445 l -27.94006,0 c -1.3118,0 -2.09154,-1.1067 -1.83869,-2.42445 l 2.3027,-12.000641 c 0.25285,-1.317751 1.58522,-2.424445 2.89701,-2.424445 z"
                 id="path4630-0"
                 inkscape:connector-curvature="0"
                 sodipodi:nodetypes="sssssssss" />
              <path
                 style="opacity:1;fill:#404041;fill-opacity:1;stroke:#404041;stroke-width:0.35337758;stroke-linecap:round;stroke-linejoin:round;stroke-miterlimit:4;stroke-dasharray:none;stroke-dashoffset:0;stroke-opacity:1"
                 d="m 175.07542,127.51995 25.06741,0 c 1.5878,0 3.657,-1.69501 4.00193,-3.5376 l 2.94595,-15.7373 -38.80477,2e-5 2.78751,15.73728 c 0.32708,1.84655 2.41416,3.5376 4.00195,3.5376 z"
                 id="path4632-6"
                 inkscape:connector-curvature="0"
                 sodipodi:nodetypes="cssccssc" />
              <path
                 style="opacity:1;fill:#e6e7e8;fill-opacity:1;stroke:#e6e7e8;stroke-width:0.25113726;stroke-linecap:round;stroke-linejoin:round;stroke-miterlimit:4;stroke-dasharray:none;stroke-dashoffset:0;stroke-opacity:1"
                 id="path4634-2"
                 sodipodi:type="arc"
                 sodipodi:cx="187.68832"
                 sodipodi:cy="121.90407"
                 sodipodi:rx="3.1392143"
                 sodipodi:ry="3.1392143"
                 sodipodi:start="4.4738897"
                 sodipodi:end="4.4505896"
                 sodipodi:open="true"
                 d="m 186.9467,118.85371 a 3.1392143,3.1392143 0 0 1 3.78761,2.29098 3.1392143,3.1392143 0 0 1 -2.26888,3.80089 3.1392143,3.1392143 0 0 1 -3.81404,-2.2467 3.1392143,3.1392143 0 0 1 2.22445,-3.82706" />
              <rect
                 style="opacity:1;fill:#ebb637;fill-opacity:1;stroke:#ebb637;stroke-width:0.12036303;stroke-linecap:round;stroke-linejoin:round;stroke-miterlimit:4;stroke-dasharray:none;stroke-dashoffset:0;stroke-opacity:1"
                 id="rect4636-6"
                 width="4.3827295"
                 height="2.0636621"
                 x="172.1284"
                 y="110.57023"
                 ry="1.031831"
                 rx="0.98844171" />
              <rect
                 rx="0.98844171"
                 ry="1.031831"
                 y="110.57023"
                 x="198.58676"
                 height="2.0636621"
                 width="4.3827295"
                 id="rect4638-1"
                 style="opacity:1;fill:#ebb637;fill-opacity:1;stroke:#ebb637;stroke-width:0.12036303;stroke-linecap:round;stroke-linejoin:round;stroke-miterlimit:4;stroke-dasharray:none;stroke-dashoffset:0;stroke-opacity:1" />
            </g>
            <rect
               y="397.50507"
               x="-783.39423"
               height="144.49777"
               width="144.49777"
               id="rect4640-8"
               style="opacity:1;fill:#808080;fill-opacity:0;stroke:none;stroke-width:0.92000002;stroke-linecap:round;stroke-linejoin:round;stroke-miterlimit:4;stroke-dasharray:none;stroke-opacity:1" />
          </g>
          <path
             sodipodi:nodetypes="sscsssssss"
             id="path4642-7"
             style="opacity:1;fill:#ff0000;fill-opacity:1;stroke:#000000;stroke-width:2;stroke-linecap:butt;stroke-linejoin:miter;stroke-miterlimit:4;stroke-dasharray:none;stroke-dashoffset:0;stroke-opacity:1"
             d="m 332.12109,-121.80416 c -41.0865,10e-5 -74.3929,33.307477 -74.3929,74.393809 0,66.866403 76.6579,177.329881 76.6579,177.329881 0,0 74.70692,-109.604138 72.1289,-177.329881 -1.56284,-41.056598 -33.3078,-74.393709 -74.3939,-74.393809 z m 0,15.10071 c 32.74671,-1e-5 59.29319,26.54639 59.2933,59.293099 -1.4e-4,32.746686 -26.54661,59.293046 -59.2933,59.29304 -32.74657,-1.6e-4 -59.29286,-26.546471 -59.293,-59.29304 1.1e-4,-32.746592 26.54641,-59.292939 59.293,-59.293099 z"
             inkscape:connector-curvature="0" />
        </g>
      </g>
    </g>
  </g>
</svg>
