<?xml version="1.0" encoding="UTF-8" standalone="no"?>
<!-- Created with Inkscape (http://www.inkscape.org/) -->

<svg
   xmlns:dc="http://purl.org/dc/elements/1.1/"
   xmlns:cc="http://creativecommons.org/ns#"
   xmlns:rdf="http://www.w3.org/1999/02/22-rdf-syntax-ns#"
   xmlns:svg="http://www.w3.org/2000/svg"
   xmlns="http://www.w3.org/2000/svg"
   xmlns:sodipodi="http://sodipodi.sourceforge.net/DTD/sodipodi-0.dtd"
   xmlns:inkscape="http://www.inkscape.org/namespaces/inkscape"
   width="128"
   height="128"
   viewBox="0 0 33.866666 33.866668"
   version="1.1"
   id="svg8462"
   inkscape:version="0.92.5 (0.92.5+68)"
   sodipodi:docname="icon_union_auto.svg">
  <defs
     id="defs8456">
    <filter
       style="color-interpolation-filters:sRGB"
       inkscape:label="Drop Shadow"
       id="filter3894-6">
      <feFlood
         flood-opacity="0.498039"
         flood-color="rgb(0,0,0)"
         result="flood"
         id="feFlood3884-29" />
      <feComposite
         in="flood"
         in2="SourceGraphic"
         operator="in"
         result="composite1"
         id="feComposite3886-12" />
      <feGaussianBlur
         in="composite1"
         stdDeviation="1"
         result="blur"
         id="feGaussianBlur3888-7" />
      <feOffset
         dx="1"
         dy="1"
         result="offset"
         id="feOffset3890-0" />
      <feComposite
         in="SourceGraphic"
         in2="offset"
         operator="over"
         result="composite2"
         id="feComposite3892-9" />
    </filter>
  </defs>
  <sodipodi:namedview
     id="base"
     pagecolor="#ffffff"
     bordercolor="#666666"
     borderopacity="1.0"
     inkscape:pageopacity="0.0"
     inkscape:pageshadow="2"
     inkscape:zoom="5.6"
     inkscape:cx="61.886785"
     inkscape:cy="62.422869"
     inkscape:document-units="mm"
     inkscape:current-layer="layer1"
     showgrid="false"
     units="px"
     inkscape:window-width="1920"
     inkscape:window-height="1017"
     inkscape:window-x="0"
     inkscape:window-y="30"
     inkscape:window-maximized="1" />
  <metadata
     id="metadata8459">
    <rdf:RDF>
      <cc:Work
         rdf:about="">
        <dc:format>image/svg+xml</dc:format>
        <dc:type
           rdf:resource="http://purl.org/dc/dcmitype/StillImage" />
        <dc:title />
      </cc:Work>
    </rdf:RDF>
  </metadata>
  <g
     inkscape:label="Layer 1"
     inkscape:groupmode="layer"
     id="layer1"
     transform="translate(0,-263.13332)">
    <g
       id="g9635"
       transform="matrix(1.3333334,0,0,1.3333334,-5.6444444,-93.355566)"
       inkscape:export-xdpi="96"
       inkscape:export-ydpi="96">
      <circle
         r="12.7"
         cy="280.06665"
         cx="16.933332"
         id="circle7204"
         style="opacity:1;fill:#90caf9;fill-opacity:1;fill-rule:nonzero;stroke:none;stroke-width:0.91303349;stroke-linecap:square;stroke-linejoin:round;stroke-miterlimit:4;stroke-dasharray:1.82606689, 1.82606689;stroke-dashoffset:0;stroke-opacity:1;paint-order:normal" />
      <g
         style="stroke:none"
         id="g7212"
         transform="matrix(0.03969475,0,0,0.03969475,6.7712316,270.32139)">
        <path
           sodipodi:nodetypes="cccccscccscscccccccccccccccccccccccccccsccccscccccccccccccccsscccccccsssssccccccccccccscccccccccccccczcccccccssscccccccccccc"
           style="fill:#333333;stroke:none"
           inkscape:connector-curvature="0"
           d="m 24.41,362.53 c 1.089036,3.26685 4.146408,5.47026 7.59,5.47 h 16 c 3.443592,2.6e-4 6.500964,-2.20315 7.59,-5.47 l 1.055,-3.164 c 3.61558,20.72104 21.690531,35.78514 42.723885,35.60713 C 120.40224,394.79512 138.21964,379.42726 141.484,358.648 l 3.86,5.79 c 1.48374,2.22532 3.98139,3.56195 6.656,3.562 h 239.732 c 0.118,0 0.234,-0.009 0.351,-0.01 8.83466,22.04645 33.86821,32.75727 55.91513,23.92382 C 470.04504,383.08036 480.75727,358.04741 471.925,336 H 488 c 5.69795,0.003 9.57234,-5.78241 7.4,-11.05 C 484.79507,299.07555 459.95115,281.86976 432,281.042 V 235.71 c 0.01,-8.23379 -2.30391,-16.30325 -6.675,-23.281 -0.19337,-0.39669 -0.41984,-0.77637 -0.677,-1.135 l -1.05,-1.445 -0.018,-0.025 -55.68,-76.567 C 366.47207,112.27536 349.03017,95.988822 328,96 H 103.11 C 72.880577,95.9977 48.538619,120.81221 49.122,151.036 l -24.651,94.134 -5.937,11.873 c -1.662411,3.33425 -2.529754,7.0083 -2.534,10.734 V 336 c 3.65e-4,0.85984 0.138793,1.71405 0.41,2.53 z M 42.234,352 H 37.766 L 35.1,344 h 9.8 z M 99,379 C 80.814939,378.98462 67.834504,361.3755 73.2,344 h 14.32 c -6.478048,9.28081 0.162421,22.0128 11.48,22.0128 11.31758,0 17.95805,-12.73199 11.48,-22.0128 h 14.32 c 5.3655,17.3755 -7.61494,34.98462 -25.8,35 z M 43.358,337.19997 c 9.283345,-19.54474 14.704985,-41.19991 50.6255,-41.19991 35.63485,0 41.34215,21.65517 50.6255,41.19991 z M 264.68573,232 v 8 H 240 v -70.12 c 7.2641,-6.47797 9.87898,-25.91129 6.613,-35.07997 h 18.07273 z M 328,361.19997 H 294.80003 V 326.80003 H 328 Z M 328,320 h -32 c -4.41828,0 -8,3.58172 -8,8 v 33.19997 H 272 V 304 h 56 z m 0,-32 h -56 v -56 c 0,-4.41828 3.58172,-8 8,-8 4.41828,0 8,3.58172 8,8 v 32 c 0,4.41828 3.58172,8 8,8 h 32 z m 0,-21.69833 H 294.70829 V 232 C 294.71329,215.43298 276.50728,213.54198 272,220.08166 v -85.28163 h 56 z M 432,379 c -10.18563,-0.0406 -19.49296,-5.77482 -24.11,-14.854 4.04387,-2.03483 7.66943,-4.81133 10.688,-8.185 3.1338,10.66507 16.84865,13.59953 24.07245,5.15131 7.22379,-8.44821 2.19492,-21.5409 -8.82745,-22.98031 2.40667,-1.38491 5.13233,-2.11965 7.909,-2.132 h 12.016 c 13.11666,17.82928 0.38636,42.99954 -21.748,43 z m 4.59289,-88.57023 c 29.77527,0 40.4488,20.81696 50.76191,35.28347 L 441.732,320 c -10.06649,0.0242 -19.54071,4.76135 -25.6,12.8 l -8.4,11.2 c -3.78738,5.02377 -9.70856,17.18433 -16,17.19997 h -17 v -0.4 c -0.0928,-43.77514 31.52219,-70.65871 61.86089,-70.3702 z M 363.06755,134.80003 c 0,0 49.3185,71.17398 54.6362,80.38451 5.3177,9.21053 4.24806,20.41536 4.24806,20.41536 -13.95365,8.05615 -85.01541,7.75382 -85.01541,-5.7 l -1.77459,-95.09987 z M 160.185,271.26993 152,263.08593 v -92.97741 h 81.90694 V 323.5999 c 0,13.25484 -20.65211,23.99999 -33.90694,23.99999 -13.25483,0 -24,-10.74515 -24,-23.99999 v -4.946 c 0.0391,-14.32927 -5.6556,-37.27871 -15.815,-47.38397 z m -9.3904,-104.75397 c -20.61745,0.74391 -24.36011,-22.28557 -10.73256,-31.57056 28.71512,-9.33867 23.75421,30.52932 10.73256,31.57056 z M 58.172082,141.3144 133.6976,135.228 c -14.32457,14.32457 -2.80182,35.08443 11.59411,34.06559 l 0.40398,95.16403 -117.614796,-1.42831 z"
           id="path7206" />
        <rect
           style="stroke:none"
           x="80"
           y="176"
           width="32"
           height="16"
           id="rect7208" />
        <rect
           style="stroke:none"
           x="80"
           y="208"
           width="32"
           height="16"
           id="rect7210" />
      </g>
    </g>
  </g>
</svg>
