<?xml version="1.0" encoding="UTF-8" standalone="no"?>
<!-- Created with Inkscape (http://www.inkscape.org/) -->

<svg
   xmlns:i="http://ns.adobe.com/AdobeIllustrator/10.0/"
   xmlns:dc="http://purl.org/dc/elements/1.1/"
   xmlns:cc="http://creativecommons.org/ns#"
   xmlns:rdf="http://www.w3.org/1999/02/22-rdf-syntax-ns#"
   xmlns:svg="http://www.w3.org/2000/svg"
   xmlns="http://www.w3.org/2000/svg"
   xmlns:sodipodi="http://sodipodi.sourceforge.net/DTD/sodipodi-0.dtd"
   xmlns:inkscape="http://www.inkscape.org/namespaces/inkscape"
   width="33.866665mm"
   height="33.866665mm"
   viewBox="0 0 33.866665 33.866665"
   version="1.1"
   id="svg14845"
   inkscape:version="0.92.5 (0.92.5+68)"
   sodipodi:docname="icon_union_goods.svg">
  <defs
     id="defs14839">
    <filter
       style="color-interpolation-filters:sRGB"
       inkscape:label="Drop Shadow"
       id="filter3894-6">
      <feFlood
         flood-opacity="0.498039"
         flood-color="rgb(0,0,0)"
         result="flood"
         id="feFlood3884-29" />
      <feComposite
         in="flood"
         in2="SourceGraphic"
         operator="in"
         result="composite1"
         id="feComposite3886-12" />
      <feGaussianBlur
         in="composite1"
         stdDeviation="1"
         result="blur"
         id="feGaussianBlur3888-7" />
      <feOffset
         dx="1"
         dy="1"
         result="offset"
         id="feOffset3890-0" />
      <feComposite
         in="SourceGraphic"
         in2="offset"
         operator="over"
         result="composite2"
         id="feComposite3892-9" />
    </filter>
  </defs>
  <sodipodi:namedview
     id="base"
     pagecolor="#ffffff"
     bordercolor="#666666"
     borderopacity="1.0"
     inkscape:pageopacity="0.0"
     inkscape:pageshadow="2"
     inkscape:zoom="5.128001"
     inkscape:cx="69.357785"
     inkscape:cy="69.552764"
     inkscape:document-units="mm"
     inkscape:current-layer="layer1"
     showgrid="false"
     inkscape:window-width="1920"
     inkscape:window-height="1017"
     inkscape:window-x="0"
     inkscape:window-y="30"
     inkscape:window-maximized="1"
     fit-margin-top="0"
     fit-margin-left="0"
     fit-margin-right="0"
     fit-margin-bottom="0" />
  <metadata
     id="metadata14842">
    <rdf:RDF>
      <cc:Work
         rdf:about="">
        <dc:format>image/svg+xml</dc:format>
        <dc:type
           rdf:resource="http://purl.org/dc/dcmitype/StillImage" />
        <dc:title></dc:title>
      </cc:Work>
    </rdf:RDF>
  </metadata>
  <g
     inkscape:label="Layer 1"
     inkscape:groupmode="layer"
     id="layer1"
     transform="translate(155.98583,-91.035866)">
    <g
       id="g15436"
       transform="matrix(0.92016473,0,0,0.92016473,-12.453171,9.9716275)"
       inkscape:export-xdpi="96"
       inkscape:export-ydpi="96">
      <circle
         style="opacity:1;fill:#90caf9;fill-opacity:1;fill-rule:nonzero;stroke:none;stroke-width:1.32300007;stroke-linecap:square;stroke-linejoin:round;stroke-miterlimit:4;stroke-dasharray:none;stroke-dashoffset:0;stroke-opacity:1;paint-order:normal"
         id="circle7427"
         cx="-137.58333"
         cy="106.50003"
         r="18.402502" />
      <switch
         style="fill:#333333"
         transform="matrix(0.26458333,0,0,0.26458333,-152.00312,91.167427)"
         id="switch7439">
        <foreignObject
           height="1"
           width="1"
           y="0"
           x="0"
           requiredExtensions="http://ns.adobe.com/AdobeIllustrator/10.0/" />
        <g
           style="fill:#333333"
           id="g7437"
           i:extraneous="self">
          <g
             style="fill:#333333"
             id="g7435">
            <path
               style="fill:#333333"
               id="path7429"
               d="M 58.2,66.3 H 13.1 c -0.9,0 -1.6,0.7 -1.6,1.6 v 5 c 0,0.9 0.7,1.6 1.6,1.6 h 3.7 c 0.3,3.8 3.5,6.8 7.3,6.8 3.9,0 7,-3 7.3,-6.8 h 26.8 c 0.9,0 1.6,-0.7 1.6,-1.6 v -5 C 59.9,67 59.1,66.3 58.2,66.3 Z M 24.1,77.8 c -2.1,0 -3.9,-1.7 -3.9,-3.9 0,-2.1 1.7,-3.9 3.9,-3.9 2.2,0 3.9,1.8 3.9,4 0,2.1 -1.7,3.8 -3.9,3.8 z"
               inkscape:connector-curvature="0" />
            <path
               style="fill:#333333"
               id="path7431"
               d="M 94.7,59.4 86.2,58.3 81.3,49.8 C 80,47.5 77.5,46.1 74.9,46.1 h -9.3 c -0.9,0 -1.6,0.7 -1.6,1.6 v 25.2 c 0,0.9 0.7,1.6 1.6,1.6 h 11.8 c 0.3,3.8 3.5,6.8 7.3,6.8 3.9,0 7,-3 7.3,-6.8 h 2.3 c 1.8,0 3.3,-1.5 3.3,-3.3 V 62.6 C 97.5,61.1 96.3,59.7 94.7,59.4 Z M 80.1,58.1 H 69.5 c -0.2,0 -0.3,-0.1 -0.3,-0.3 V 51 c 0,-0.2 0.1,-0.3 0.3,-0.3 h 5.3 c 1,0 1.9,0.5 2.4,1.4 l 3.2,5.5 c 0.1,0.2 0,0.5 -0.3,0.5 z m 4.5,19.7 c -2.1,0 -3.9,-1.7 -3.9,-3.9 0,-2.1 1.7,-3.9 3.9,-3.9 2.1,0 3.9,1.7 3.9,3.9 0,2.2 -1.7,3.9 -3.9,3.9 z"
               inkscape:connector-curvature="0" />
            <path
               style="fill:#333333"
               sodipodi:nodetypes="csssssscccc"
               id="path7433"
               d="m 11.4,50.9 v 9.7 c 0,0.9 0.7,1.6 1.6,1.6 h 45.1 c 0.9,0 1.6,-0.7 1.6,-1.6 V 36.2 c 0,-0.9 -0.7,-1.6 -1.6,-1.6 H 35.3 l -21.842144,0.141231 c -1.691323,-0.01441 -2.046125,0.402794 -2.047318,2.084063 z"
               inkscape:connector-curvature="0" />
          </g>
        </g>
      </switch>
    </g>
  </g>
</svg>
