<?xml version="1.0" encoding="UTF-8" standalone="no"?>
<svg
   xmlns:dc="http://purl.org/dc/elements/1.1/"
   xmlns:cc="http://creativecommons.org/ns#"
   xmlns:rdf="http://www.w3.org/1999/02/22-rdf-syntax-ns#"
   xmlns:svg="http://www.w3.org/2000/svg"
   xmlns="http://www.w3.org/2000/svg"
   xmlns:xlink="http://www.w3.org/1999/xlink"
   xmlns:sodipodi="http://sodipodi.sourceforge.net/DTD/sodipodi-0.dtd"
   xmlns:inkscape="http://www.inkscape.org/namespaces/inkscape"
   sodipodi:docname="intro - 9.svg"
   inkscape:version="1.0 (1.0+r73+1)"
   id="svg33777"
   version="1.1"
   viewBox="0 0 285.75 507.99997"
   height="507.99997mm"
   width="285.75mm">
  <defs
     id="defs33771">
    <linearGradient
       y2="126.56914"
       x2="549.23401"
       y1="734.77228"
       x1="549.23401"
       gradientTransform="matrix(1.3150602,0.41497545,-0.40862172,1.3354973,27541.526,10791.775)"
       gradientUnits="userSpaceOnUse"
       id="linearGradient52527"
       xlink:href="#b5076013-d6c0-4649-8f63-d536232108ef"
       inkscape:collect="always" />
    <linearGradient
       id="b5076013-d6c0-4649-8f63-d536232108ef"
       x1="549.23401"
       y1="734.77228"
       x2="549.23401"
       y2="126.56914"
       gradientTransform="matrix(0.97485,0.30762,-0.30291,0.99,144.20301,-171.28919)"
       gradientUnits="userSpaceOnUse">
      <stop
         offset="0"
         stop-color="gray"
         stop-opacity="0.25"
         id="stop52437" />
      <stop
         offset="0.53514"
         stop-color="gray"
         stop-opacity="0.12"
         id="stop52439" />
      <stop
         offset="1"
         stop-color="gray"
         stop-opacity="0.1"
         id="stop52441" />
    </linearGradient>
    <linearGradient
       id="be72c466-93ff-4e9c-a64c-30b94918ee69-7-5"
       x1="549.32281"
       y1="679.27606"
       x2="549.32281"
       y2="233.83601"
       gradientTransform="matrix(1.3489872,0,0,1.3489872,29471.035,2386.5935)"
       xlink:href="#b5076013-d6c0-4649-8f63-d536232108ef" />
    <filter
       id="filter73038"
       inkscape:label="Drop Shadow"
       style="color-interpolation-filters:sRGB">
      <feFlood
         id="feFlood73028"
         result="flood"
         flood-color="rgb(0,0,0)"
         flood-opacity="0.498039" />
      <feComposite
         id="feComposite73030"
         result="composite1"
         operator="in"
         in2="SourceGraphic"
         in="flood" />
      <feGaussianBlur
         id="feGaussianBlur73032"
         result="blur"
         stdDeviation="1"
         in="composite1" />
      <feOffset
         id="feOffset73034"
         result="offset"
         dy="1"
         dx="1" />
      <feComposite
         id="feComposite73036"
         result="composite2"
         operator="over"
         in2="offset"
         in="SourceGraphic" />
    </filter>
    <linearGradient
       y2="501.26001"
       x2="635.65002"
       y1="790.5"
       x1="635.65002"
       gradientTransform="matrix(1.2188711,0,0,1.2163156,28297.206,844.83504)"
       gradientUnits="userSpaceOnUse"
       id="linearGradient53659"
       xlink:href="#5b7f6937-2584-49b6-9aba-f63379afcef9"
       inkscape:collect="always" />
    <linearGradient
       id="5b7f6937-2584-49b6-9aba-f63379afcef9"
       x1="635.65002"
       y1="790.5"
       x2="635.65002"
       y2="501.26001"
       gradientTransform="translate(0.01,-0.01)"
       gradientUnits="userSpaceOnUse">
      <stop
         offset="0"
         stop-color="gray"
         stop-opacity="0.25"
         id="stop53543" />
      <stop
         offset="0.54"
         stop-color="gray"
         stop-opacity="0.12"
         id="stop53545" />
      <stop
         offset="1"
         stop-color="gray"
         stop-opacity="0.1"
         id="stop53547" />
    </linearGradient>
    <linearGradient
       gradientTransform="matrix(1.2188711,0,0,1.2163156,28297.193,844.84704)"
       id="726273e3-a105-41c9-bd30-f21c7a222b39-1-7"
       x1="457.34"
       y1="294.82999"
       x2="457.34"
       y2="145.49001"
       xlink:href="#5b7f6937-2584-49b6-9aba-f63379afcef9" />
    <linearGradient
       id="053cf442-696d-42d1-9951-f8212c309ade-2-6"
       x1="591.52002"
       y1="654.17999"
       x2="591.52002"
       y2="72.220001"
       gradientTransform="matrix(1.2188711,0,0,1.2163156,28058.206,772.61304)"
       xlink:href="#5b7f6937-2584-49b6-9aba-f63379afcef9" />
    <linearGradient
       gradientTransform="matrix(1.2188711,0,0,1.2163156,28297.193,844.84704)"
       id="47e4505a-9403-4d31-a565-d5fd2c78f1d2-4-8"
       x1="771.88"
       y1="599.90997"
       x2="771.88"
       y2="322.64999"
       xlink:href="#5b7f6937-2584-49b6-9aba-f63379afcef9" />
    <linearGradient
       id="8513435b-806a-4f93-81b8-e2b88811f111-7-1"
       x1="683.94"
       y1="827.35999"
       x2="683.94"
       y2="758.35999"
       gradientTransform="matrix(1.2188711,0,0,1.2163156,28058.206,772.61304)"
       xlink:href="#5b7f6937-2584-49b6-9aba-f63379afcef9" />
    <linearGradient
       gradientTransform="matrix(1.2188711,0,0,1.2163156,28297.193,844.84704)"
       id="6ed55049-a466-4083-93ca-5129091d0639-8-3"
       x1="432.87"
       y1="501.19"
       x2="432.87"
       y2="377.79001"
       xlink:href="#5b7f6937-2584-49b6-9aba-f63379afcef9" />
    <linearGradient
       gradientTransform="matrix(1.2188711,0,0,1.2163156,28297.193,844.84704)"
       id="c0dc0d70-89dc-4268-b32c-aeecea91ae40-6-6"
       x1="428.07001"
       y1="603.47998"
       x2="428.07001"
       y2="493.95001"
       xlink:href="#5b7f6937-2584-49b6-9aba-f63379afcef9" />
    <linearGradient
       id="484e0702-271c-4dc9-aca2-bd1f83d5b37c-3-4"
       x1="352.51999"
       y1="380.92999"
       x2="352.51999"
       y2="201.03999"
       gradientTransform="matrix(1.2188711,0,0,1.2163156,28349.504,860.46704)"
       xlink:href="#5b7f6937-2584-49b6-9aba-f63379afcef9" />
    <linearGradient
       gradientTransform="matrix(1.2188711,0,0,1.2163156,28297.193,844.84704)"
       id="ad7c6dc9-0e1b-446d-83eb-be41b53bfd0d-7-0"
       x1="442.04999"
       y1="399.64999"
       x2="442.04999"
       y2="262.62"
       xlink:href="#5b7f6937-2584-49b6-9aba-f63379afcef9" />
    <linearGradient
       y2="126.56914"
       x2="549.23401"
       y1="734.77228"
       x1="549.23401"
       gradientTransform="matrix(1.3150602,0.41497545,-0.40862172,1.3354973,30086.797,11582.663)"
       gradientUnits="userSpaceOnUse"
       id="linearGradient34640"
       xlink:href="#b5076013-d6c0-4649-8f63-d536232108ef"
       inkscape:collect="always" />
    <linearGradient
       y2="233.83601"
       x2="549.32281"
       y1="679.27606"
       x1="549.32281"
       gradientTransform="matrix(1.3489872,0,0,1.3489872,32136.351,2386.5935)"
       id="linearGradient34642"
       xlink:href="#b5076013-d6c0-4649-8f63-d536232108ef"
       inkscape:collect="always" />
    <linearGradient
       y2="501.26001"
       x2="635.65002"
       y1="790.5"
       x1="635.65002"
       gradientTransform="matrix(1.2188711,0,0,1.2163156,30705.439,844.83504)"
       gradientUnits="userSpaceOnUse"
       id="linearGradient34644"
       xlink:href="#5b7f6937-2584-49b6-9aba-f63379afcef9"
       inkscape:collect="always" />
    <linearGradient
       y2="145.49001"
       x2="457.34"
       y1="294.82999"
       x1="457.34"
       gradientTransform="matrix(1.2188711,0,0,1.2163156,30705.426,844.84704)"
       id="linearGradient34646"
       xlink:href="#5b7f6937-2584-49b6-9aba-f63379afcef9"
       inkscape:collect="always" />
    <linearGradient
       y2="72.220001"
       x2="591.52002"
       y1="654.17999"
       x1="591.52002"
       gradientTransform="matrix(1.2188711,0,0,1.2163156,30466.439,772.61304)"
       id="linearGradient34648"
       xlink:href="#5b7f6937-2584-49b6-9aba-f63379afcef9"
       inkscape:collect="always" />
    <linearGradient
       y2="322.64999"
       x2="771.88"
       y1="599.90997"
       x1="771.88"
       gradientTransform="matrix(1.2188711,0,0,1.2163156,30705.426,844.84704)"
       id="linearGradient34650"
       xlink:href="#5b7f6937-2584-49b6-9aba-f63379afcef9"
       inkscape:collect="always" />
    <linearGradient
       y2="758.35999"
       x2="683.94"
       y1="827.35999"
       x1="683.94"
       gradientTransform="matrix(1.2188711,0,0,1.2163156,30466.439,772.61304)"
       id="linearGradient34652"
       xlink:href="#5b7f6937-2584-49b6-9aba-f63379afcef9"
       inkscape:collect="always" />
    <linearGradient
       y2="377.79001"
       x2="432.87"
       y1="501.19"
       x1="432.87"
       gradientTransform="matrix(1.2188711,0,0,1.2163156,30705.426,844.84704)"
       id="linearGradient34654"
       xlink:href="#5b7f6937-2584-49b6-9aba-f63379afcef9"
       inkscape:collect="always" />
    <linearGradient
       y2="493.95001"
       x2="428.07001"
       y1="603.47998"
       x1="428.07001"
       gradientTransform="matrix(1.2188711,0,0,1.2163156,30705.426,844.84704)"
       id="linearGradient34656"
       xlink:href="#5b7f6937-2584-49b6-9aba-f63379afcef9"
       inkscape:collect="always" />
    <linearGradient
       y2="201.03999"
       x2="352.51999"
       y1="380.92999"
       x1="352.51999"
       gradientTransform="matrix(1.2188711,0,0,1.2163156,30757.737,860.46704)"
       id="linearGradient34658"
       xlink:href="#5b7f6937-2584-49b6-9aba-f63379afcef9"
       inkscape:collect="always" />
    <linearGradient
       y2="262.62"
       x2="442.04999"
       y1="399.64999"
       x1="442.04999"
       gradientTransform="matrix(1.2188711,0,0,1.2163156,30705.426,844.84704)"
       id="linearGradient34660"
       xlink:href="#5b7f6937-2584-49b6-9aba-f63379afcef9"
       inkscape:collect="always" />
    <clipPath
       id="clipPath34662"
       clipPathUnits="userSpaceOnUse">
      <rect
         inkscape:export-ydpi="96"
         inkscape:export-xdpi="96"
         inkscape:export-filename="/media/cosmobird/Work/Cooperative/3 - Repo/uauto/uauto-interaction-design/V 0.0.2/mock/Rasters/Intro-6.png"
         x="6775.1284"
         y="-2.0135846"
         width="285.75"
         height="507.99997"
         ry="0"
         style="display:inline;fill:#f9f9f9;fill-opacity:1;stroke-width:0.264583"
         id="rect34664" />
    </clipPath>
  </defs>
  <sodipodi:namedview
     inkscape:window-maximized="1"
     inkscape:window-y="30"
     inkscape:window-x="0"
     inkscape:window-height="1017"
     inkscape:window-width="1920"
     fit-margin-bottom="0"
     fit-margin-right="0"
     fit-margin-left="0"
     fit-margin-top="0"
     showgrid="false"
     inkscape:document-rotation="0"
     inkscape:current-layer="layer1"
     inkscape:document-units="mm"
     inkscape:cy="1088.5714"
     inkscape:cx="-798.48874"
     inkscape:zoom="0.35"
     inkscape:pageshadow="2"
     inkscape:pageopacity="0.0"
     borderopacity="1.0"
     bordercolor="#666666"
     pagecolor="#ffffff"
     id="base" />
  <metadata
     id="metadata33774">
    <rdf:RDF>
      <cc:Work
         rdf:about="">
        <dc:format>image/svg+xml</dc:format>
        <dc:type
           rdf:resource="http://purl.org/dc/dcmitype/StillImage" />
        <dc:title></dc:title>
      </cc:Work>
    </rdf:RDF>
  </metadata>
  <g
     transform="translate(-117.15074,321.27975)"
     id="layer1"
     inkscape:groupmode="layer"
     inkscape:label="Layer 1">
    <rect
       id="rect72145"
       style="display:inline;fill:#f9f9f9;fill-opacity:1;stroke-width:0.264583"
       ry="0"
       height="507.99997"
       width="285.75"
       y="-321.27975"
       x="117.15074"
       inkscape:export-filename="/media/cosmobird/Work/Cooperative/3 - Repo/uauto/uauto-interaction-design/V 0.0.2/mock/Rasters/Intro-6.png"
       inkscape:export-xdpi="96"
       inkscape:export-ydpi="96" />
    <g
       transform="translate(-6657.9776,-319.26617)"
       style="display:inline"
       id="g33612">
      <g
         style="display:inline;stroke-width:1.34899"
         id="g52525"
         transform="matrix(0.1961348,0,0,0.1961348,6776.4292,164.88887)">
        <rect
           id="rect52449"
           transform="rotate(-17.2615,114.54247,837.13144)"
           rx="37.097149"
           height="445.00177"
           width="728.62201"
           y="201.52959"
           x="184.85689"
           style="fill:url(#linearGradient52527);stroke-width:1.34899"
           ry="37.097149" />
        <rect
           id="rect52451"
           transform="rotate(-17.2615,115.9725,833.28711)"
           rx="37.097149"
           height="429.2518"
           width="713.75592"
           y="205.56023"
           x="193.71997"
           style="fill:#706d98;fill-opacity:1;stroke-width:1.34899"
           ry="37.097149" />
        <rect
           id="rect52453"
           transform="rotate(-17.2615,78.204821,711.74151)"
           height="61.559368"
           width="713.75592"
           y="267.86084"
           x="155.9523"
           style="fill:#f9a826;stroke-width:1.34899" />
        <rect
           id="rect52455"
           transform="rotate(-17.2615,-40.281396,1036.8988)"
           height="26.62027"
           width="181.35057"
           y="610.48755"
           x="303.66876"
           style="fill:#bdbdbd;stroke-width:1.34899" />
        <rect
           id="rect52457"
           transform="rotate(-17.2615,9.9420727,974.25248)"
           height="26.62027"
           width="314.4519"
           y="547.84131"
           x="287.34158"
           style="fill:#e0e0e0;stroke-width:1.34899" />
        <rect
           id="rect52459"
           rx="37.097149"
           height="445.44006"
           width="732.72986"
           y="233.83601"
           x="182.9579"
           style="fill:url(#be72c466-93ff-4e9c-a64c-30b94918ee69-7-5);stroke-width:1.34899"
           ry="37.097149" />
        <rect
           id="rect52461"
           rx="37.097149"
           height="429.2518"
           width="713.75592"
           y="238.37788"
           x="191.27673"
           style="fill:#ffffff;stroke-width:1.34899"
           ry="37.097149" />
        <rect
           id="rect52463"
           height="59.063721"
           width="20.797079"
           y="446.76044"
           x="361.01291"
           style="fill:#e0e0e0;stroke-width:1.34899" />
        <rect
           id="rect52465"
           height="59.063721"
           width="20.797079"
           y="446.76044"
           x="387.63318"
           style="fill:#e0e0e0;stroke-width:1.34899" />
        <rect
           id="rect52467"
           height="59.063721"
           width="20.797079"
           y="446.76044"
           x="414.25345"
           style="fill:#e0e0e0;stroke-width:1.34899" />
        <rect
           id="rect52469"
           height="59.063721"
           width="20.797079"
           y="446.76044"
           x="460.83893"
           style="fill:#e0e0e0;stroke-width:1.34899" />
        <rect
           id="rect52471"
           height="59.063721"
           width="20.797079"
           y="446.76044"
           x="487.4592"
           style="fill:#e0e0e0;stroke-width:1.34899" />
        <rect
           id="rect52473"
           height="59.063721"
           width="20.797079"
           y="446.76044"
           x="514.07947"
           style="fill:#e0e0e0;stroke-width:1.34899" />
        <rect
           id="rect52475"
           height="59.063721"
           width="20.797079"
           y="446.76044"
           x="560.66492"
           style="fill:#e0e0e0;stroke-width:1.34899" />
        <rect
           id="rect52477"
           height="59.063721"
           width="20.797079"
           y="446.76044"
           x="587.28522"
           style="fill:#e0e0e0;stroke-width:1.34899" />
        <rect
           id="rect52479"
           height="59.063721"
           width="20.797079"
           y="446.76044"
           x="613.90546"
           style="fill:#e0e0e0;stroke-width:1.34899" />
        <rect
           id="rect52481"
           height="59.063721"
           width="20.797079"
           y="446.76044"
           x="660.49091"
           style="fill:#e0e0e0;stroke-width:1.34899" />
        <rect
           id="rect52483"
           height="59.063721"
           width="20.797079"
           y="446.76044"
           x="687.11121"
           style="fill:#e0e0e0;stroke-width:1.34899" />
        <rect
           id="rect52485"
           height="59.063721"
           width="20.797079"
           y="446.76044"
           x="713.73145"
           style="fill:#e0e0e0;stroke-width:1.34899" />
        <rect
           id="rect52487"
           height="68"
           width="124"
           y="350.83603"
           x="236.68773"
           style="fill:#f9a826;stroke-width:1.34899" />
        <rect
           id="rect52489"
           height="76"
           width="76"
           y="573.836"
           x="718.68774"
           style="opacity:0.1;fill:#f9a826;stroke-width:1.34899" />
        <rect
           id="rect52491"
           height="76"
           width="76"
           y="573.836"
           x="756.68774"
           style="opacity:0.1;fill:#f9a826;stroke-width:1.34899" />
      </g>
      <g
         style="display:inline;stroke-width:1.21759;filter:url(#filter73038)"
         id="g53657"
         transform="matrix(0.21707246,0,0,0.21752853,6896.3431,172.99175)">
        <circle
           id="circle53562"
           stroke-miterlimit="10"
           r="297"
           cy="395.57001"
           cx="361"
           style="fill:none;stroke:#3ad29f;stroke-width:2.43519;stroke-miterlimit:10;stroke-dasharray:14.6111" />
        <circle
           id="circle53564"
           stroke-miterlimit="10"
           r="360"
           cy="395.57001"
           cx="361"
           style="fill:none;stroke:#3ad29f;stroke-width:2.43519;stroke-miterlimit:10;stroke-dasharray:14.6111" />
        <path
           id="path53566"
           transform="translate(-239,-72.21)"
           d="m 840.94,582.47 a 81.21,81.21 0 0 0 -161,-15.14 l -249.59,-6.77 2.74,42.88 c 0,0 -35.59,82.12 151.46,104 v 83 h 216.24 v -138 a 81.16,81.16 0 0 0 40.15,-69.97 z"
           inkscape:connector-curvature="0"
           style="fill:url(#linearGradient53659);stroke-width:1.21759" />
        <path
           id="path53568"
           transform="translate(-239,-72.21)"
           d="m 441.66,605.24 c 0,0 -34.08,78.64 145.05,99.62 v 79.52 H 793.8 V 573.79 L 439,564.17 Z"
           inkscape:connector-curvature="0"
           style="fill:#be7c5e;stroke-width:1.21759" />
        <path
           id="path53570"
           transform="translate(-239,-72.21)"
           d="m 545.16,277.07 v 0 A 38.18,38.18 0 0 1 492.66,289 L 381.47,215.73 a 38.18,38.18 0 0 1 -11.93,-52.5 v 0 A 38.18,38.18 0 0 1 422,151.3 l 111.19,73.27 a 38.18,38.18 0 0 1 11.97,52.5 z"
           inkscape:connector-curvature="0"
           style="fill:url(#726273e3-a105-41c9-bd30-f21c7a222b39-1-7);stroke-width:1.21759" />
        <path
           id="path53572"
           transform="translate(-239,-72.21)"
           d="m 539,273.07 v 0 a 35.49,35.49 0 0 1 -48.8,11.09 L 386.81,216 a 35.49,35.49 0 0 1 -11.09,-48.8 v 0 a 35.49,35.49 0 0 1 48.8,-11.09 l 103.37,68.12 A 35.49,35.49 0 0 1 539,273.07 Z"
           inkscape:connector-curvature="0"
           style="fill:#be7c5e;stroke-width:1.21759" />
        <circle
           id="circle53574"
           r="77.769997"
           cy="512.94"
           cx="515.48999"
           style="fill:#be7c5e;stroke-width:1.21759" />
        <rect
           id="rect53576"
           ry="14.899865"
           rx="14.93117"
           height="581.96002"
           width="322.42001"
           x="191.32001"
           y="0"
           style="fill:url(#053cf442-696d-42d1-9951-f8212c309ade-2-6);stroke-width:1.21759" />
        <rect
           id="rect53578"
           ry="16.590544"
           rx="16.625402"
           height="566.23999"
           width="313.70001"
           y="7.8699999"
           x="195.67"
           style="fill:#ffffff;stroke-width:1.21759" />
        <path
           id="path53580"
           transform="translate(-239,-72.21)"
           d="m 670.33,94.28 a 25.43,25.43 0 0 1 -25.07,21.63 H 536.92 A 25.43,25.43 0 0 1 511.86,94.28 h -57.4 a 11.91,11.91 0 0 0 -11.92,11.91 v 514 a 11.91,11.91 0 0 0 11.91,11.92 h 274.14 a 11.91,11.91 0 0 0 11.92,-11.91 v -514 A 11.91,11.91 0 0 0 728.6,94.28 Z"
           inkscape:connector-curvature="0"
           style="fill:#f9a826;stroke-width:1.21759" />
        <rect
           id="rect53582"
           ry="2.432631"
           rx="2.4377422"
           height="4.3699999"
           width="69.910004"
           y="28.84"
           x="318.01001"
           style="fill:#dbdbdb;stroke-width:1.21759" />
        <circle
           id="circle53584"
           r="2.6199999"
           cy="30.59"
           cx="402.76999"
           style="fill:#dbdbdb;stroke-width:1.21759" />
        <path
           id="path53586"
           transform="translate(-239,-72.21)"
           d="m 804.76,598.87 v 0 c -22.57,5.22 -38.06,-9.5 -43.28,-32.06 L 709.62,374.24 a 42.24,42.24 0 0 1 31.55,-50.51 v 0 a 42.24,42.24 0 0 1 50.51,31.55 L 834,552.82 c 5.22,22.57 -6.68,40.83 -29.24,46.05 z"
           inkscape:connector-curvature="0"
           style="fill:url(#47e4505a-9403-4d31-a565-d5fd2c78f1d2-4-8);stroke-width:1.21759" />
        <rect
           id="rect53588"
           transform="rotate(-13.01,339.36569,1483.1628)"
           ry="43.049976"
           rx="43.131248"
           height="282.60999"
           width="70.779999"
           y="329.79001"
           x="739.85999"
           style="fill:#be7c5e;stroke-width:1.21759" />
        <rect
           id="rect53590"
           height="69"
           width="296"
           y="686.15002"
           x="296.92999"
           style="fill:url(#8513435b-806a-4f93-81b8-e2b88811f111-7-1);stroke-width:1.21759" />
        <rect
           id="rect53592"
           height="54"
           width="280"
           y="694.15002"
           x="304.92999"
           style="fill:#3f3d56;fill-opacity:1;stroke-width:1.21759" />
        <path
           id="path53594"
           transform="translate(-239,-72.21)"
           d="m 502,483.65 v 0 a 37.72,37.72 0 0 1 -51.87,11.79 l -74.57,-48.25 a 37.72,37.72 0 0 1 -11.79,-51.87 v 0 a 37.72,37.72 0 0 1 51.87,-11.79 l 74.57,48.25 A 37.72,37.72 0 0 1 502,483.65 Z"
           inkscape:connector-curvature="0"
           style="fill:url(#6ed55049-a466-4083-93ca-5129091d0639-8-3);stroke-width:1.21759" />
        <path
           id="path53596"
           transform="translate(-239,-72.21)"
           d="m 483.28,585.78 v 0 a 38.06,38.06 0 0 1 -52.34,11.9 L 384.75,564 a 38.06,38.06 0 0 1 -11.9,-52.34 v 0 a 38.06,38.06 0 0 1 52.34,-11.9 l 46.19,33.69 a 38.06,38.06 0 0 1 11.9,52.33 z"
           inkscape:connector-curvature="0"
           style="fill:url(#c0dc0d70-89dc-4268-b32c-aeecea91ae40-6-6);stroke-width:1.21759" />
        <g
           id="g53600"
           style="opacity:0.5;stroke-width:1.21759">
          <circle
             id="circle53598"
             r="89.940002"
             cy="290.98999"
             cx="352.51999"
             style="fill:url(#484e0702-271c-4dc9-aca2-bd1f83d5b37c-3-4);stroke-width:1.21759" />
        </g>
        <circle
           id="circle53602"
           r="84.650002"
           cy="290.98999"
           cx="352.51999"
           style="fill:#69f0ae;stroke-width:1.21759" />
        <polygon
           id="polygon53604"
           points="392.49,242.66 408.37,255.89 347.52,335.25 302.55,284.99 315.78,279.69 347.52,308.79 "
           style="fill:#ffffff;stroke-width:1.21759" />
        <path
           id="path53606"
           transform="translate(-239,-72.21)"
           d="m 479.55,583.27 v 0 a 35.49,35.49 0 0 1 -48.8,11.09 L 387.67,563 a 35.49,35.49 0 0 1 -11.09,-48.8 v 0 a 35.49,35.49 0 0 1 48.8,-11.09 l 43.07,31.42 a 35.49,35.49 0 0 1 11.1,48.74 z"
           inkscape:connector-curvature="0"
           style="fill:#be7c5e;stroke-width:1.21759" />
        <path
           id="path53608"
           transform="translate(-239,-72.21)"
           d="m 497.9,481 v 0 a 35.49,35.49 0 0 1 -48.8,11.09 l -70.16,-45.4 a 35.49,35.49 0 0 1 -11.09,-48.8 v 0 a 35.49,35.49 0 0 1 48.8,-11.09 l 70.16,45.4 A 35.49,35.49 0 0 1 497.9,481 Z"
           inkscape:connector-curvature="0"
           style="fill:#be7c5e;stroke-width:1.21759" />
        <path
           id="path53610"
           transform="translate(-239,-72.21)"
           d="m 521.28,382 v 0 a 37.9,37.9 0 0 1 -52.11,11.84 l -94.5,-61.53 A 37.9,37.9 0 0 1 362.83,280.2 v 0 a 37.9,37.9 0 0 1 52.11,-11.84 l 94.5,61.53 A 37.9,37.9 0 0 1 521.28,382 Z"
           inkscape:connector-curvature="0"
           style="fill:url(#ad7c6dc9-0e1b-446d-83eb-be41b53bfd0d-7-0);stroke-width:1.21759" />
        <path
           id="path53612"
           transform="translate(-239,-72.21)"
           d="m 516.26,378.8 v 0 a 35.49,35.49 0 0 1 -48.8,11.09 l -88.51,-57.63 a 35.49,35.49 0 0 1 -11.09,-48.8 v 0 a 35.49,35.49 0 0 1 48.8,-11.09 l 88.5,57.63 a 35.49,35.49 0 0 1 11.1,48.8 z"
           inkscape:connector-curvature="0"
           style="fill:#be7c5e;stroke-width:1.21759" />
      </g>
    </g>
    <g
       inkscape:export-ydpi="96"
       inkscape:export-xdpi="96"
       inkscape:export-filename="/media/cosmobird/Work/Cooperative/3 - Repo/uauto/uauto-interaction-design/V 0.0.2/mock/Rasters/Intro-9.png"
       id="g34720">
      <rect
         id="rect34666"
         style="display:inline;fill:none;fill-opacity:1;stroke-width:0.24266"
         ry="0"
         height="427.30209"
         width="285.75"
         y="-321.27975"
         x="-404.72446"
         inkscape:export-filename="/media/cosmobird/Work/Cooperative/3 - Repo/uauto/uauto-interaction-design/V 0.0.2/mock/Rasters/Intro-6.png"
         inkscape:export-xdpi="96"
         inkscape:export-ydpi="96" />
      <g
         transform="translate(-7180.7387,-319.26617)"
         style="display:inline"
         id="g34638"
         clip-path="url(#clipPath34662)">
        <g
           style="display:inline;stroke-width:1.34899"
           id="g34582"
           transform="matrix(0.1961348,0,0,0.1961348,6776.4292,164.88887)">
          <rect
             id="rect34538"
             transform="rotate(-17.2615,114.54247,837.13144)"
             rx="37.097149"
             height="445.00177"
             width="728.62201"
             y="201.52959"
             x="184.85689"
             style="fill:url(#linearGradient34640);stroke-width:1.34899"
             ry="37.097149" />
          <rect
             id="rect34540"
             transform="rotate(-17.2615,115.9725,833.28711)"
             rx="37.097149"
             height="429.2518"
             width="713.75592"
             y="205.56023"
             x="193.71997"
             style="fill:#706d98;fill-opacity:1;stroke-width:1.34899"
             ry="37.097149" />
          <rect
             id="rect34542"
             transform="rotate(-17.2615,78.204821,711.74151)"
             height="61.559368"
             width="713.75592"
             y="267.86084"
             x="155.9523"
             style="fill:#f9a826;stroke-width:1.34899" />
          <rect
             id="rect34544"
             transform="rotate(-17.2615,-40.281396,1036.8988)"
             height="26.62027"
             width="181.35057"
             y="610.48755"
             x="303.66876"
             style="fill:#bdbdbd;stroke-width:1.34899" />
          <rect
             id="rect34546"
             transform="rotate(-17.2615,9.9420727,974.25248)"
             height="26.62027"
             width="314.4519"
             y="547.84131"
             x="287.34158"
             style="fill:#e0e0e0;stroke-width:1.34899" />
          <rect
             id="rect34548"
             rx="37.097149"
             height="445.44006"
             width="732.72986"
             y="233.83601"
             x="182.9579"
             style="fill:url(#linearGradient34642);stroke-width:1.34899"
             ry="37.097149" />
          <rect
             id="rect34550"
             rx="37.097149"
             height="429.2518"
             width="713.75592"
             y="238.37788"
             x="191.27673"
             style="fill:#ffffff;stroke-width:1.34899"
             ry="37.097149" />
          <rect
             id="rect34552"
             height="59.063721"
             width="20.797079"
             y="446.76044"
             x="361.01291"
             style="fill:#e0e0e0;stroke-width:1.34899" />
          <rect
             id="rect34554"
             height="59.063721"
             width="20.797079"
             y="446.76044"
             x="387.63318"
             style="fill:#e0e0e0;stroke-width:1.34899" />
          <rect
             id="rect34556"
             height="59.063721"
             width="20.797079"
             y="446.76044"
             x="414.25345"
             style="fill:#e0e0e0;stroke-width:1.34899" />
          <rect
             id="rect34558"
             height="59.063721"
             width="20.797079"
             y="446.76044"
             x="460.83893"
             style="fill:#e0e0e0;stroke-width:1.34899" />
          <rect
             id="rect34560"
             height="59.063721"
             width="20.797079"
             y="446.76044"
             x="487.4592"
             style="fill:#e0e0e0;stroke-width:1.34899" />
          <rect
             id="rect34562"
             height="59.063721"
             width="20.797079"
             y="446.76044"
             x="514.07947"
             style="fill:#e0e0e0;stroke-width:1.34899" />
          <rect
             id="rect34564"
             height="59.063721"
             width="20.797079"
             y="446.76044"
             x="560.66492"
             style="fill:#e0e0e0;stroke-width:1.34899" />
          <rect
             id="rect34566"
             height="59.063721"
             width="20.797079"
             y="446.76044"
             x="587.28522"
             style="fill:#e0e0e0;stroke-width:1.34899" />
          <rect
             id="rect34568"
             height="59.063721"
             width="20.797079"
             y="446.76044"
             x="613.90546"
             style="fill:#e0e0e0;stroke-width:1.34899" />
          <rect
             id="rect34570"
             height="59.063721"
             width="20.797079"
             y="446.76044"
             x="660.49091"
             style="fill:#e0e0e0;stroke-width:1.34899" />
          <rect
             id="rect34572"
             height="59.063721"
             width="20.797079"
             y="446.76044"
             x="687.11121"
             style="fill:#e0e0e0;stroke-width:1.34899" />
          <rect
             id="rect34574"
             height="59.063721"
             width="20.797079"
             y="446.76044"
             x="713.73145"
             style="fill:#e0e0e0;stroke-width:1.34899" />
          <rect
             id="rect34576"
             height="68"
             width="124"
             y="350.83603"
             x="236.68773"
             style="fill:#f9a826;stroke-width:1.34899" />
          <rect
             id="rect34578"
             height="76"
             width="76"
             y="573.836"
             x="718.68774"
             style="opacity:0.1;fill:#f9a826;stroke-width:1.34899" />
          <rect
             id="rect34580"
             height="76"
             width="76"
             y="573.836"
             x="756.68774"
             style="opacity:0.1;fill:#f9a826;stroke-width:1.34899" />
        </g>
        <g
           style="display:inline;stroke-width:1.21759;filter:url(#filter73038)"
           id="g34636"
           transform="matrix(0.21707246,0,0,0.21752853,6896.3431,172.99175)">
          <circle
             id="circle34584"
             stroke-miterlimit="10"
             r="297"
             cy="395.57001"
             cx="361"
             style="fill:none;stroke:#3ad29f;stroke-width:2.43519;stroke-miterlimit:10;stroke-dasharray:14.6111" />
          <circle
             id="circle34586"
             stroke-miterlimit="10"
             r="360"
             cy="395.57001"
             cx="361"
             style="fill:none;stroke:#3ad29f;stroke-width:2.43519;stroke-miterlimit:10;stroke-dasharray:14.6111" />
          <path
             id="path34588"
             transform="translate(-239,-72.21)"
             d="m 840.94,582.47 a 81.21,81.21 0 0 0 -161,-15.14 l -249.59,-6.77 2.74,42.88 c 0,0 -35.59,82.12 151.46,104 v 83 h 216.24 v -138 a 81.16,81.16 0 0 0 40.15,-69.97 z"
             inkscape:connector-curvature="0"
             style="fill:url(#linearGradient34644);stroke-width:1.21759" />
          <path
             id="path34590"
             transform="translate(-239,-72.21)"
             d="m 441.66,605.24 c 0,0 -34.08,78.64 145.05,99.62 v 79.52 H 793.8 V 573.79 L 439,564.17 Z"
             inkscape:connector-curvature="0"
             style="fill:#be7c5e;stroke-width:1.21759" />
          <path
             id="path34592"
             transform="translate(-239,-72.21)"
             d="m 545.16,277.07 v 0 A 38.18,38.18 0 0 1 492.66,289 L 381.47,215.73 a 38.18,38.18 0 0 1 -11.93,-52.5 v 0 A 38.18,38.18 0 0 1 422,151.3 l 111.19,73.27 a 38.18,38.18 0 0 1 11.97,52.5 z"
             inkscape:connector-curvature="0"
             style="fill:url(#linearGradient34646);stroke-width:1.21759" />
          <path
             id="path34594"
             transform="translate(-239,-72.21)"
             d="m 539,273.07 v 0 a 35.49,35.49 0 0 1 -48.8,11.09 L 386.81,216 a 35.49,35.49 0 0 1 -11.09,-48.8 v 0 a 35.49,35.49 0 0 1 48.8,-11.09 l 103.37,68.12 A 35.49,35.49 0 0 1 539,273.07 Z"
             inkscape:connector-curvature="0"
             style="fill:#be7c5e;stroke-width:1.21759" />
          <circle
             id="circle34596"
             r="77.769997"
             cy="512.94"
             cx="515.48999"
             style="fill:#be7c5e;stroke-width:1.21759" />
          <rect
             id="rect34598"
             ry="14.899865"
             rx="14.93117"
             height="581.96002"
             width="322.42001"
             x="191.32001"
             y="0"
             style="fill:url(#linearGradient34648);stroke-width:1.21759" />
          <rect
             id="rect34600"
             ry="16.590544"
             rx="16.625402"
             height="566.23999"
             width="313.70001"
             y="7.8699999"
             x="195.67"
             style="fill:#ffffff;stroke-width:1.21759" />
          <path
             id="path34602"
             transform="translate(-239,-72.21)"
             d="m 670.33,94.28 a 25.43,25.43 0 0 1 -25.07,21.63 H 536.92 A 25.43,25.43 0 0 1 511.86,94.28 h -57.4 a 11.91,11.91 0 0 0 -11.92,11.91 v 514 a 11.91,11.91 0 0 0 11.91,11.92 h 274.14 a 11.91,11.91 0 0 0 11.92,-11.91 v -514 A 11.91,11.91 0 0 0 728.6,94.28 Z"
             inkscape:connector-curvature="0"
             style="fill:#f9a826;stroke-width:1.21759" />
          <rect
             id="rect34604"
             ry="2.432631"
             rx="2.4377422"
             height="4.3699999"
             width="69.910004"
             y="28.84"
             x="318.01001"
             style="fill:#dbdbdb;stroke-width:1.21759" />
          <circle
             id="circle34606"
             r="2.6199999"
             cy="30.59"
             cx="402.76999"
             style="fill:#dbdbdb;stroke-width:1.21759" />
          <path
             id="path34608"
             transform="translate(-239,-72.21)"
             d="m 804.76,598.87 v 0 c -22.57,5.22 -38.06,-9.5 -43.28,-32.06 L 709.62,374.24 a 42.24,42.24 0 0 1 31.55,-50.51 v 0 a 42.24,42.24 0 0 1 50.51,31.55 L 834,552.82 c 5.22,22.57 -6.68,40.83 -29.24,46.05 z"
             inkscape:connector-curvature="0"
             style="fill:url(#linearGradient34650);stroke-width:1.21759" />
          <rect
             id="rect34610"
             transform="rotate(-13.01,339.36569,1483.1628)"
             ry="43.049976"
             rx="43.131248"
             height="282.60999"
             width="70.779999"
             y="329.79001"
             x="739.85999"
             style="fill:#be7c5e;stroke-width:1.21759" />
          <rect
             id="rect34612"
             height="69"
             width="296"
             y="686.15002"
             x="296.92999"
             style="fill:url(#linearGradient34652);stroke-width:1.21759" />
          <rect
             id="rect34614"
             height="54"
             width="280"
             y="694.15002"
             x="304.92999"
             style="fill:#3f3d56;fill-opacity:1;stroke-width:1.21759" />
          <path
             id="path34616"
             transform="translate(-239,-72.21)"
             d="m 502,483.65 v 0 a 37.72,37.72 0 0 1 -51.87,11.79 l -74.57,-48.25 a 37.72,37.72 0 0 1 -11.79,-51.87 v 0 a 37.72,37.72 0 0 1 51.87,-11.79 l 74.57,48.25 A 37.72,37.72 0 0 1 502,483.65 Z"
             inkscape:connector-curvature="0"
             style="fill:url(#linearGradient34654);stroke-width:1.21759" />
          <path
             id="path34618"
             transform="translate(-239,-72.21)"
             d="m 483.28,585.78 v 0 a 38.06,38.06 0 0 1 -52.34,11.9 L 384.75,564 a 38.06,38.06 0 0 1 -11.9,-52.34 v 0 a 38.06,38.06 0 0 1 52.34,-11.9 l 46.19,33.69 a 38.06,38.06 0 0 1 11.9,52.33 z"
             inkscape:connector-curvature="0"
             style="fill:url(#linearGradient34656);stroke-width:1.21759" />
          <g
             id="g34622"
             style="opacity:0.5;stroke-width:1.21759">
            <circle
               id="circle34620"
               r="89.940002"
               cy="290.98999"
               cx="352.51999"
               style="fill:url(#linearGradient34658);stroke-width:1.21759" />
          </g>
          <circle
             id="circle34624"
             r="84.650002"
             cy="290.98999"
             cx="352.51999"
             style="fill:#69f0ae;stroke-width:1.21759" />
          <polygon
             id="polygon34626"
             points="408.37,255.89 347.52,335.25 302.55,284.99 315.78,279.69 347.52,308.79 392.49,242.66 "
             style="fill:#ffffff;stroke-width:1.21759" />
          <path
             id="path34628"
             transform="translate(-239,-72.21)"
             d="m 479.55,583.27 v 0 a 35.49,35.49 0 0 1 -48.8,11.09 L 387.67,563 a 35.49,35.49 0 0 1 -11.09,-48.8 v 0 a 35.49,35.49 0 0 1 48.8,-11.09 l 43.07,31.42 a 35.49,35.49 0 0 1 11.1,48.74 z"
             inkscape:connector-curvature="0"
             style="fill:#be7c5e;stroke-width:1.21759" />
          <path
             id="path34630"
             transform="translate(-239,-72.21)"
             d="m 497.9,481 v 0 a 35.49,35.49 0 0 1 -48.8,11.09 l -70.16,-45.4 a 35.49,35.49 0 0 1 -11.09,-48.8 v 0 a 35.49,35.49 0 0 1 48.8,-11.09 l 70.16,45.4 A 35.49,35.49 0 0 1 497.9,481 Z"
             inkscape:connector-curvature="0"
             style="fill:#be7c5e;stroke-width:1.21759" />
          <path
             id="path34632"
             transform="translate(-239,-72.21)"
             d="m 521.28,382 v 0 a 37.9,37.9 0 0 1 -52.11,11.84 l -94.5,-61.53 A 37.9,37.9 0 0 1 362.83,280.2 v 0 a 37.9,37.9 0 0 1 52.11,-11.84 l 94.5,61.53 A 37.9,37.9 0 0 1 521.28,382 Z"
             inkscape:connector-curvature="0"
             style="fill:url(#linearGradient34660);stroke-width:1.21759" />
          <path
             id="path34634"
             transform="translate(-239,-72.21)"
             d="m 516.26,378.8 v 0 a 35.49,35.49 0 0 1 -48.8,11.09 l -88.51,-57.63 a 35.49,35.49 0 0 1 -11.09,-48.8 v 0 a 35.49,35.49 0 0 1 48.8,-11.09 l 88.5,57.63 a 35.49,35.49 0 0 1 11.1,48.8 z"
             inkscape:connector-curvature="0"
             style="fill:#be7c5e;stroke-width:1.21759" />
        </g>
      </g>
    </g>
  </g>
</svg>
