<?xml version="1.0" encoding="UTF-8" standalone="no"?>
<!-- Created with Inkscape (http://www.inkscape.org/) -->

<svg
   xmlns:dc="http://purl.org/dc/elements/1.1/"
   xmlns:cc="http://creativecommons.org/ns#"
   xmlns:rdf="http://www.w3.org/1999/02/22-rdf-syntax-ns#"
   xmlns:svg="http://www.w3.org/2000/svg"
   xmlns="http://www.w3.org/2000/svg"
   xmlns:sodipodi="http://sodipodi.sourceforge.net/DTD/sodipodi-0.dtd"
   xmlns:inkscape="http://www.inkscape.org/namespaces/inkscape"
   width="150"
   height="150"
   viewBox="0 0 39.687499 39.687501"
   version="1.1"
   id="svg9623"
   inkscape:version="0.92.3 (2405546, 2018-03-11)"
   sodipodi:docname="icon_baby_weight.svg">
  <defs
     id="defs9617" />
  <sodipodi:namedview
     id="base"
     pagecolor="#ffffff"
     bordercolor="#666666"
     borderopacity="1.0"
     inkscape:pageopacity="0.0"
     inkscape:pageshadow="2"
     inkscape:zoom="2"
     inkscape:cx="75.446789"
     inkscape:cy="57.160299"
     inkscape:document-units="mm"
     inkscape:current-layer="layer1"
     showgrid="false"
     units="px"
     inkscape:window-width="1366"
     inkscape:window-height="705"
     inkscape:window-x="0"
     inkscape:window-y="30"
     inkscape:window-maximized="1" />
  <metadata
     id="metadata9620">
    <rdf:RDF>
      <cc:Work
         rdf:about="">
        <dc:format>image/svg+xml</dc:format>
        <dc:type
           rdf:resource="http://purl.org/dc/dcmitype/StillImage" />
        <dc:title></dc:title>
      </cc:Work>
    </rdf:RDF>
  </metadata>
  <g
     inkscape:label="Layer 1"
     inkscape:groupmode="layer"
     id="layer1"
     transform="translate(0,-257.31248)">
    <g
       id="g9653">
      <rect
         y="257.3334"
         x="0.020938873"
         height="39.645622"
         width="39.645622"
         id="rect9643"
         style="opacity:1;fill:#ffffff;fill-opacity:1;stroke:#000000;stroke-width:0.04187918;stroke-linecap:butt;stroke-linejoin:round;stroke-miterlimit:4;stroke-dasharray:none;stroke-dashoffset:0;stroke-opacity:1" />
      <g
         transform="matrix(1.0079365,0,0,1.0079365,-3040.6878,-1764.3489)"
         id="g7070"
         style="fill:#1a1a1a;fill-opacity:1">
        <path
           style="fill:#1a1a1a;fill-opacity:1;stroke-width:0.93749994"
           inkscape:connector-curvature="0"
           d="m 3045.6147,2026.5876 h -28.7381 v 0.9375 a 0.93749995,0.93749995 0 0 0 0.9375,0.9375 h 37.5 a 0.93749995,0.93749995 0 0 0 0.9375,-0.9375 v -0.9375 z"
           id="path7058" />
        <g
           transform="translate(6.4551681,-0.82031243)"
           id="g7066"
           style="fill:#1a1a1a;fill-opacity:1">
          <circle
             id="circle7060"
             r="0.5322265"
             cy="2036.7244"
             cx="3030.1089"
             style="fill:#1a1a1a;fill-opacity:1;stroke-width:0.5322265" />
          <path
             id="path7062"
             d="m 3030.1089,2030.3376 a 6.3867181,6.3867181 0 1 0 6.3867,6.3867 6.3936373,6.3936373 0 0 0 -6.3867,-6.3867 z m 0,11.709 a 5.3222653,5.3222653 0 1 1 5.3223,-5.3223 5.3281197,5.3281197 0 0 1 -5.3223,5.3223 z"
             inkscape:connector-curvature="0"
             style="fill:#1a1a1a;fill-opacity:1;stroke-width:0.5322265" />
          <path
             id="path7064"
             d="m 3030.1089,2032.4665 a 4.2578122,4.2578122 0 1 0 4.2578,4.2578 4.2626022,4.2626022 0 0 0 -4.2578,-4.2578 z m 2.5052,6.763 a 0.53222653,0.53222653 0 0 1 -0.7526,0 l -1.0687,-1.0682 a 1.5706005,1.5706005 0 0 1 -0.6839,0.1597 1.5966795,1.5966795 0 1 1 1.5967,-1.5967 1.5706005,1.5706005 0 0 1 -0.1597,0.6839 l 1.0687,1.0687 a 0.53222653,0.53222653 0 0 1 -5e-4,0.7526 z"
             inkscape:connector-curvature="0"
             style="fill:#1a1a1a;fill-opacity:1;stroke-width:0.5322265" />
        </g>
        <path
           style="fill:#1a1a1a;fill-opacity:1;stroke-width:0.27972716"
           id="path7068"
           d="m 3046.3317,2014.2795 c 0,0 0.8535,-0.4894 0.4698,-1.9213 -0.3765,-1.4051 -1.4372,-2.3372 -1.4372,-2.3372 0,0 0.2606,-0.649 -0.4965,-0.8805 -0.6615,-0.1992 -1.0408,-0.9663 -1.0408,-0.9663 0,0 -0.3499,-0.225 -0.5944,0.1592 0,0 -0.3913,-0.2717 -0.6485,0.1738 0,0 -0.3374,-0.2862 -0.5944,0.1593 0,0 -0.3585,0.067 -0.2789,0.3642 0,0 -0.5192,-0.2084 -0.3165,0.5481 0.2028,0.7566 1.574,0.7946 1.8564,1.8484 0.2823,1.0538 -2.5012,1.3652 -1.8931,3.6349 0.6082,2.2696 2.6198,2.86 2.6198,2.86 0,0 -1.53,-0.1982 -2.4508,-1.6891 l -0.3512,0.094 c 0,0 0.189,4.3802 -2.1815,5.0442 0.1351,-0.036 1.8012,-0.6273 1.8948,-5.1412 l -0.4706,-1.7562 c 0,0 0.3093,-0.5751 0.1862,-1.0345 -0.1231,-0.4593 -0.6244,-0.8174 -0.1892,-1.571 0.4351,-0.7538 0.042,-1.1407 -0.3412,-0.5168 -0.356,0.6167 -0.6717,0.4117 -0.6717,0.4117 l 0.2837,-0.8869 c 0,0 0.151,-0.3011 -0.1502,-0.4521 0,0 -0.9209,1.3183 -0.8413,1.6155 0,0 -0.2741,-0.1583 0.3067,-1.1247 0,0 -1.6684,0.042 -1.1689,1.906 0.3475,1.2969 0.5768,1.6119 0.5768,1.6119 0,0 -0.5703,0.7899 -0.3531,1.6005 l -1.2929,2.1999 -2.8641,0.7674 c 0,0 0,0 0,0 0,-0.2037 -0.027,-0.4271 -0.078,-0.6162 -0.2462,-0.9186 -1.0433,-1.516 -1.9461,-1.5347 l -0.1159,-0.4323 c -0.036,-0.135 -0.1659,-0.1871 -0.2938,-0.124 l -0.8337,0.4551 v 0 c -1.0785,-0.7825 -2.4609,-1.0781 -3.8118,-0.7161 -2.4048,0.6444 -3.8289,3.111 -3.1846,5.5157 0.6444,2.4047 3.111,3.8288 5.5158,3.1845 0,0 2.493,-0.639 3.2052,-0.2506 0.6853,0.3955 5.327,2.0477 8.7045,1.1427 3.3775,-0.905 6.616,-2.0044 7.8692,-4.1357 1.239,-2.1854 1.1707,-5.034 -2.5978,-7.2098 z"
           inkscape:connector-curvature="0" />
      </g>
    </g>
  </g>
</svg>
