<?xml version="1.0" encoding="UTF-8" standalone="no"?>
<!-- Created with Inkscape (http://www.inkscape.org/) -->

<svg
   xmlns:dc="http://purl.org/dc/elements/1.1/"
   xmlns:cc="http://creativecommons.org/ns#"
   xmlns:rdf="http://www.w3.org/1999/02/22-rdf-syntax-ns#"
   xmlns:svg="http://www.w3.org/2000/svg"
   xmlns="http://www.w3.org/2000/svg"
   xmlns:sodipodi="http://sodipodi.sourceforge.net/DTD/sodipodi-0.dtd"
   xmlns:inkscape="http://www.inkscape.org/namespaces/inkscape"
   width="8.4666662mm"
   height="8.4666662mm"
   viewBox="0 0 8.4666662 8.4666662"
   version="1.1"
   id="svg8626"
   inkscape:version="0.92.3 (2405546, 2018-03-11)"
   sodipodi:docname="icon_fab_email.svg"
   inkscape:export-filename="/media/cosmobird/Work/Organizing Matrix/5-Cooperative/3 - Repo/jipmer/uxui/assets/icon_fab_email.png"
   inkscape:export-xdpi="600"
   inkscape:export-ydpi="600">
  <sodipodi:namedview
     id="base"
     pagecolor="#ffffff"
     bordercolor="#666666"
     borderopacity="1.0"
     inkscape:pageopacity="0.0"
     inkscape:pageshadow="2"
     inkscape:zoom="15.265305"
     inkscape:cx="14.901566"
     inkscape:cy="14.901518"
     inkscape:document-units="mm"
     inkscape:current-layer="layer1"
     showgrid="false"
     fit-margin-top="0"
     fit-margin-left="0"
     fit-margin-right="0"
     fit-margin-bottom="0"
     inkscape:window-width="1366"
     inkscape:window-height="705"
     inkscape:window-x="0"
     inkscape:window-y="30"
     inkscape:window-maximized="1" />
  <metadata
     id="metadata8623">
    <rdf:RDF>
      <cc:Work
         rdf:about="">
        <dc:format>image/svg+xml</dc:format>
        <dc:type
           rdf:resource="http://purl.org/dc/dcmitype/StillImage" />
        <dc:title></dc:title>
      </cc:Work>
    </rdf:RDF>
  </metadata>
  <g
     inkscape:label="Layer 1"
     inkscape:groupmode="layer"
     id="layer1"
     transform="translate(-308.26563,-53.595074)">
    <path
       style="opacity:1;fill:#37c871;fill-opacity:1;stroke:none;stroke-width:1.51190472;stroke-miterlimit:4;stroke-dasharray:none;stroke-opacity:0"
       d="m 316.7323,57.828407 a 4.2333331,4.2333331 0 0 1 -4.23334,4.233333 4.2333331,4.2333331 0 0 1 -4.23333,-4.233333 4.2333331,4.2333331 0 0 1 4.23333,-4.233333 4.2333331,4.2333331 0 0 1 4.23334,4.233333 z"
       id="circle14177-1" />
    <g
       id="g14270-1"
       transform="matrix(0.05222207,0,0,0.05222207,309.88788,55.318113)"
       style="">
      <path
         inkscape:connector-curvature="0"
         d="M 87,25.5 C 87,23 85,21 82.5,21 h -65 C 15,21 13,23 13,25.5 v 0.4 l 36.3,25.5 c 0.1,0 0.1,0.1 0.2,0.1 0.3,0.2 0.7,0.2 1,0 0.1,0 0.1,-0.1 0.2,-0.1 L 87,25.9 Z"
         id="path14266-3"
         style="" />
      <path
         inkscape:connector-curvature="0"
         d="M 44.7,57.8 13,35.6 v 38.9 c 0,2.5 2,4.5 4.5,4.5 h 65 C 85,79 87,77 87,74.5 V 35.6 L 55.3,57.8 c -1.6,1.2 -3.5,1.8 -5.3,1.8 -1.8,0 -3.8,-0.6 -5.3,-1.8 z"
         id="path14268-5"
         style="" />
    </g>
  </g>
</svg>
