<?xml version="1.0" encoding="UTF-8" standalone="no"?>
<!-- Created with Inkscape (http://www.inkscape.org/) -->

<svg
   xmlns:dc="http://purl.org/dc/elements/1.1/"
   xmlns:cc="http://creativecommons.org/ns#"
   xmlns:rdf="http://www.w3.org/1999/02/22-rdf-syntax-ns#"
   xmlns:svg="http://www.w3.org/2000/svg"
   xmlns="http://www.w3.org/2000/svg"
   xmlns:sodipodi="http://sodipodi.sourceforge.net/DTD/sodipodi-0.dtd"
   xmlns:inkscape="http://www.inkscape.org/namespaces/inkscape"
   width="150"
   height="150"
   viewBox="0 0 39.687499 39.687501"
   version="1.1"
   id="svg925"
   inkscape:version="0.92.3 (2405546, 2018-03-11)"
   sodipodi:docname="icon_nav_bar_profile.svg"
   inkscape:export-filename="/media/cosmobird/Work/Organizing Matrix/5-Cooperative/3 - Repo/jipmer/uxui/assets/icon_nav_bar_profile.png"
   inkscape:export-xdpi="96"
   inkscape:export-ydpi="96">
  <defs
     id="defs919" />
  <sodipodi:namedview
     id="base"
     pagecolor="#ffffff"
     bordercolor="#666666"
     borderopacity="1.0"
     inkscape:pageopacity="0.0"
     inkscape:pageshadow="2"
     inkscape:zoom="1.979899"
     inkscape:cx="76.013541"
     inkscape:cy="105.89886"
     inkscape:document-units="mm"
     inkscape:current-layer="layer1"
     showgrid="false"
     units="px"
     inkscape:window-width="1366"
     inkscape:window-height="705"
     inkscape:window-x="0"
     inkscape:window-y="30"
     inkscape:window-maximized="1" />
  <metadata
     id="metadata922">
    <rdf:RDF>
      <cc:Work
         rdf:about="">
        <dc:format>image/svg+xml</dc:format>
        <dc:type
           rdf:resource="http://purl.org/dc/dcmitype/StillImage" />
        <dc:title></dc:title>
      </cc:Work>
    </rdf:RDF>
  </metadata>
  <g
     inkscape:label="Layer 1"
     inkscape:groupmode="layer"
     id="layer1"
     transform="translate(0,-257.31248)">
    <g
       id="g3959"
       transform="matrix(0.10221487,0,0,0.10221487,-2.0148999,250.98285)"
       style="fill:#ececec;fill-opacity:1">
      <path
         inkscape:connector-curvature="0"
         d="m 250.9,227.6 c 0,13.8 -3,27.2 -8.4,39.5 9.5,-12.5 16.9,-25.1 22.3,-37.9 11.9,-28.4 12.5,-58.8 1.7,-85.7 -2,-5.1 -13.3,-30.1 -34.3,-25.1 -4,1 -8.1,-1.3 -9.4,-5.2 l -0.5,-1.5 C 214.1,92.6 200.7,78.1 183.3,69.6 165.8,61.1 146,59.6 126.1,65.4 92.3,75.2 64.4,97.7 49.7,127.3 41,144.5 36.9,164.1 37.7,184 c 1.4,33.6 14,65.5 34.4,90.4 -7.6,-13.8 -11.8,-29.5 -11.8,-45.7 v -15.3 c 0,-5.5 4.4,-10 9.8,-10.2 1.5,-0.1 14.1,-1.5 31.1,-7.8 l 16.4,-7.1 c 30,-14.9 53.6,-37.8 70.1,-68.1 l 2.6,-4.8 5.5,0.8 c 8.9,1.2 17.5,4.5 25.5,9.8 19,12.6 30.1,34.1 29.7,57.4 l -0.1,8.4 z"
         id="path3941"
         style="fill:#ececec;fill-opacity:1" />
      <path
         inkscape:connector-curvature="0"
         d="m 234.9,227.6 v -35.9 l 0.1,-8.4 c 0.3,-17.9 -8.2,-34.3 -22.6,-43.9 -4.3,-2.9 -8.9,-5 -13.6,-6.2 -18,30.7 -43,54.2 -74.3,69.7 l -0.4,0.2 -17.2,7.4 c -13.6,5 -24.6,7.2 -30.6,8.2 v 10.2 c 0,28.3 15.2,54.6 39.8,68.8 12.1,7 26,10.7 40.1,10.5 13.7,-0.1 27.1,-3.8 38.9,-10.7 24.5,-14.6 39.8,-41.3 39.8,-69.9 z"
         id="path3943"
         style="fill:#ececec;fill-opacity:1" />
      <path
         inkscape:connector-curvature="0"
         d="m 127.6,347.5 c 4.8,7.5 13.4,18.1 27.5,28 l 36,-45 v 0 0 0 -13.5 c -11,4.5 -22.8,6.9 -34.8,7 -0.2,0 -0.5,0 -0.7,0 -12.2,0 -24.3,-2.4 -35.5,-6.9 v 13.4 0 0 1.7 c 0.6,2.1 2.7,7.9 7.5,15.3 z"
         id="path3945"
         style="fill:#ececec;fill-opacity:1" />
      <path
         inkscape:connector-curvature="0"
         d="m 386.8,354 c 1.2,-10.5 0.8,-21 -1.2,-31.2 -0.5,-2.6 0.3,-5.4 2.2,-7.3 l 10.1,-9.9 -10,-22.1 -14.1,1.2 c -2.7,0.2 -5.4,-0.9 -7.1,-3.1 -6.4,-8.3 -14,-15.4 -22.7,-21 -2.3,-1.5 -3.7,-4.1 -3.7,-6.8 l 0.2,-14.1 -22.7,-8.4 -9,10.7 c -1.7,2.1 -4.4,3.1 -7,2.8 -9,-1 -18,-0.9 -26.8,0.5 -9.9,19.9 -24.3,39.3 -42.9,58 -7.6,7.5 -14.7,14 -21.5,19.4 h 8.6 c 4,0 8,0.3 11.8,0.9 l 0.2,-1.2 c 0,-0.3 0.1,-0.5 0.2,-0.8 l 0.1,-0.4 c 0.1,-0.3 0.2,-0.5 0.3,-0.8 9,-24 31.4,-39.8 57,-40.2 34.1,-0.5 62.2,26.8 62.6,60.9 0.4,30.8 -21.5,56.6 -51.1,61.7 0,0.3 0,0.6 0,0.9 v 35.5 c 2.8,-0.3 5.7,-0.7 8.4,-1.3 2.6,-0.5 5.4,0.3 7.3,2.2 l 9.9,10.1 22.1,-10 -1.2,-14.1 c -0.2,-2.7 0.9,-5.4 3.1,-7.1 8.3,-6.4 15.4,-14 21,-22.7 1.5,-2.3 4.1,-3.7 6.8,-3.7 l 14.1,0.2 8.4,-22.7 -10.7,-9 c -2,-1.8 -3,-4.4 -2.7,-7.1 z"
         id="path3947"
         style="fill:#ececec;fill-opacity:1" />
      <path
         inkscape:connector-curvature="0"
         d="M 219.2,338.6 H 205.3 L 168.9,384 c 11.9,6.3 25.4,11.2 40.3,14.7 3.6,0.8 6.2,4.1 6.2,7.8 v 35.1 h 10.9 v -23.8 h 16 v 23.8 h 42 V 403.7 C 284.2,367.8 255,338.6 219.2,338.6 Z"
         id="path3949"
         style="fill:#ececec;fill-opacity:1" />
      <path
         inkscape:connector-curvature="0"
         d="m 335.4,341.2 c -0.2,-12.2 -5.1,-23.7 -13.9,-32.2 -8.8,-8.5 -20.3,-13.1 -32.6,-13 -18.8,0.3 -35.3,11.7 -42.1,29.2 l -0.3,2 c 26.1,9.4 46,31.8 51.9,59.4 21.5,-4 37.3,-22.9 37,-45.4 z"
         id="path3951"
         style="fill:#ececec;fill-opacity:1" />
      <path
         inkscape:connector-curvature="0"
         d="M 105.3,338.6 H 92.6 c -35.9,0 -65.1,29.2 -65.1,65.1 v 37.9 h 41.6 v -23.8 h 16 v 23.8 h 114.2 v -5.3 H 175 v -16 h 24.3 v -7.6 C 181.8,408 166,401.5 152.5,393.1 119.7,372.8 108.4,347.5 105.3,338.6 Z"
         id="path3953"
         style="fill:#ececec;fill-opacity:1" />
    </g>
  </g>
</svg>
