<?xml version="1.0" encoding="UTF-8" standalone="no"?>
<!-- Created with Inkscape (http://www.inkscape.org/) -->

<svg
   xmlns:dc="http://purl.org/dc/elements/1.1/"
   xmlns:cc="http://creativecommons.org/ns#"
   xmlns:rdf="http://www.w3.org/1999/02/22-rdf-syntax-ns#"
   xmlns:svg="http://www.w3.org/2000/svg"
   xmlns="http://www.w3.org/2000/svg"
   xmlns:sodipodi="http://sodipodi.sourceforge.net/DTD/sodipodi-0.dtd"
   xmlns:inkscape="http://www.inkscape.org/namespaces/inkscape"
   width="47.625011mm"
   height="47.625057mm"
   viewBox="0 0 47.625011 47.625057"
   version="1.1"
   id="svg5639"
   inkscape:version="0.92.3 (2405546, 2018-03-11)"
   sodipodi:docname="icon_patientrecord_light_pressed.svg">
  <defs
     id="defs5633">
    <filter
       style="color-interpolation-filters:sRGB"
       inkscape:label="Drop Shadow"
       id="filter6005">
      <feFlood
         flood-opacity="0.498039"
         flood-color="rgb(0,0,0)"
         result="flood"
         id="feFlood5995" />
      <feComposite
         in="flood"
         in2="SourceGraphic"
         operator="out"
         result="composite1"
         id="feComposite5997" />
      <feGaussianBlur
         in="composite1"
         stdDeviation="1"
         result="blur"
         id="feGaussianBlur5999" />
      <feOffset
         dx="1"
         dy="1"
         result="offset"
         id="feOffset6001" />
      <feComposite
         in="offset"
         in2="SourceGraphic"
         operator="in"
         result="composite2"
         id="feComposite6003" />
    </filter>
  </defs>
  <sodipodi:namedview
     id="base"
     pagecolor="#ffffff"
     bordercolor="#666666"
     borderopacity="1.0"
     inkscape:pageopacity="0.0"
     inkscape:pageshadow="2"
     inkscape:zoom="1.2303658"
     inkscape:cx="-110.51248"
     inkscape:cy="113.07721"
     inkscape:document-units="mm"
     inkscape:current-layer="layer1"
     showgrid="false"
     inkscape:window-width="1366"
     inkscape:window-height="705"
     inkscape:window-x="0"
     inkscape:window-y="30"
     inkscape:window-maximized="1"
     fit-margin-top="0"
     fit-margin-left="0"
     fit-margin-right="0"
     fit-margin-bottom="0" />
  <metadata
     id="metadata5636">
    <rdf:RDF>
      <cc:Work
         rdf:about="">
        <dc:format>image/svg+xml</dc:format>
        <dc:type
           rdf:resource="http://purl.org/dc/dcmitype/StillImage" />
        <dc:title></dc:title>
      </cc:Work>
    </rdf:RDF>
  </metadata>
  <g
     inkscape:label="Layer 1"
     inkscape:groupmode="layer"
     id="layer1"
     transform="translate(-67.87931,-142.87254)">
    <g
       id="g5687"
       inkscape:export-xdpi="96"
       inkscape:export-ydpi="96">
      <g
         transform="matrix(1.3798251,0,0,1.4111111,-5058.5314,-4613.5601)"
         id="g5580">
        <g
           transform="translate(6.517919,-1.34342e-4)"
           id="g5566">
          <g
             id="g5564"
             transform="translate(2613.451,2701.553)">
            <path
               sodipodi:nodetypes="ssssssssssssss"
               id="path5556"
               d="m 1125.8804,671.95996 h -26.6639 c -0.5729,0 -1.0417,0.46875 -1.0417,1.04167 v 26.04167 c 0,0.57291 0.4688,1.04166 1.0417,1.04166 h 26.6639 c 0.573,0 1.0417,-0.46875 1.0417,-1.04166 v -26.04167 c 0,-0.57292 -0.4687,-1.04167 -1.0417,-1.04167 z m -14.0597,4.6875 c -0.863,0 -1.5625,-0.69948 -1.5625,-1.5625 0,-0.86302 0.6995,-1.5625 1.5625,-1.5625 0.863,0 1.5625,0.69948 1.5625,1.5625 0,0.86302 -0.6995,1.5625 -1.5625,1.5625 z"
               style="fill:#ffffff;stroke-width:0.52083349"
               inkscape:connector-curvature="0" />
            <path
               sodipodi:nodetypes="csssscc"
               id="path5558"
               d="m 1098.1748,690.70996 v 8.33334 c 0,0.57291 0.4688,1.04166 1.0417,1.04166 h 26.6731 c 0.573,0 1.0417,-0.46875 1.0417,-1.04166 v -8.33334 z"
               style="fill:#666666;fill-opacity:1;stroke-width:0.52083349"
               inkscape:connector-curvature="0" />
            <path
               id="path5560"
               d="m 1117.2346,690.70996 c -0.014,-0.63229 -0.3745,-1.20677 -0.9422,-1.49062 l -1.962,-1.00209 c -0.1338,-0.0682 -0.2182,-0.20624 -0.2182,-0.35677 v -0.60052 c 1.0067,-0.43386 1.5854,-1.27656 1.8672,-2.33073 0.4244,-0.13125 0.7369,-0.52396 0.7369,-0.99011 v -0.52083 c 0,-0.39895 -0.2296,-0.74323 -0.5614,-0.91822 -0.2297,-1.95886 -1.5245,-2.75157 -3.6052,-2.75157 -0.099,0 -0.1953,0.004 -0.2901,0.0115 -0.7073,0.0562 -1.4229,-0.0766 -2.0115,-0.47343 -0.2448,-0.16459 -0.4505,-0.34011 -0.5953,-0.52397 -0.066,-0.0838 -0.1979,-0.0302 -0.1859,0.0755 0.021,0.18228 0.052,0.39478 0.098,0.62708 0.1719,0.86458 0.069,0.73854 -0.2651,1.55417 -0.1849,0.45104 -0.3042,0.95156 -0.3594,1.48176 -0.3292,0.17657 -0.5573,0.5198 -0.5573,0.91719 v 0.52083 c 0,0.46615 0.3125,0.85886 0.737,0.99063 0.2818,1.05365 0.8599,1.89688 1.8672,2.33073 v 0.59636 c 0,0.1526 -0.086,0.29166 -0.2235,0.35937 l -2.0109,0.99011 c -0.549,0.29947 -0.8906,0.875 -0.8906,1.5 v 0.004 z"
               style="fill:#37c871;fill-opacity:1;stroke-width:0.52083349"
               inkscape:connector-curvature="0" />
            <path
               sodipodi:nodetypes="ccccc"
               transform="matrix(0.0830793,0,0,0.0830793,956.62386,570.53352)"
               style="color:#000000;font-style:normal;font-variant:normal;font-weight:normal;font-stretch:normal;font-size:medium;line-height:normal;font-family:sans-serif;font-variant-ligatures:normal;font-variant-position:normal;font-variant-caps:normal;font-variant-numeric:normal;font-variant-alternates:normal;font-feature-settings:normal;text-indent:0;text-align:start;text-decoration:none;text-decoration-line:none;text-decoration-style:solid;text-decoration-color:#000000;letter-spacing:normal;word-spacing:normal;text-transform:none;writing-mode:lr-tb;direction:ltr;text-orientation:mixed;dominant-baseline:auto;baseline-shift:baseline;text-anchor:start;white-space:normal;shape-padding:0;clip-rule:nonzero;display:inline;overflow:visible;visibility:visible;opacity:1;isolation:auto;mix-blend-mode:normal;color-interpolation:sRGB;color-interpolation-filters:linearRGB;solid-color:#000000;solid-opacity:1;vector-effect:none;fill:#000000;fill-opacity:1;fill-rule:nonzero;stroke:none;stroke-width:0.9375px;stroke-linecap:butt;stroke-linejoin:miter;stroke-miterlimit:4;stroke-dasharray:none;stroke-dashoffset:0;stroke-opacity:1;color-rendering:auto;image-rendering:auto;shape-rendering:auto;text-rendering:auto;enable-background:accumulate"
               d="m 1703.7305,1445.6167 v 0.9375 h 345.9635 v -0.9375 z"
               id="path5562"
               inkscape:connector-curvature="0" />
          </g>
        </g>
        <g
           id="g5578"
           transform="translate(6.517919,-1.34342e-4)">
          <g
             transform="translate(2613.451,2701.553)"
             id="g5576">
            <path
               inkscape:connector-curvature="0"
               style="fill:#ffffff;stroke-width:0.52083349"
               d="m 1125.8804,671.95996 h -26.6639 c -0.5729,0 -1.0417,0.46875 -1.0417,1.04167 v 26.04167 c 0,0.57291 0.4688,1.04166 1.0417,1.04166 h 26.6639 c 0.573,0 1.0417,-0.46875 1.0417,-1.04166 v -26.04167 c 0,-0.57292 -0.4687,-1.04167 -1.0417,-1.04167 z m -14.0597,4.6875 c -0.863,0 -1.5625,-0.69948 -1.5625,-1.5625 0,-0.86302 0.6995,-1.5625 1.5625,-1.5625 0.863,0 1.5625,0.69948 1.5625,1.5625 0,0.86302 -0.6995,1.5625 -1.5625,1.5625 z"
               id="path5568"
               sodipodi:nodetypes="ssssssssssssss" />
            <path
               inkscape:connector-curvature="0"
               style="fill:#666666;fill-opacity:1;stroke-width:0.52083349"
               d="m 1098.1748,690.70996 v 8.33334 c 0,0.57291 0.4688,1.04166 1.0417,1.04166 h 26.6731 c 0.573,0 1.0417,-0.46875 1.0417,-1.04166 v -8.33334 z"
               id="path5570"
               sodipodi:nodetypes="csssscc" />
            <path
               inkscape:connector-curvature="0"
               style="fill:#37c871;fill-opacity:1;stroke-width:0.52083349"
               d="m 1117.2346,690.70996 c -0.014,-0.63229 -0.3745,-1.20677 -0.9422,-1.49062 l -1.962,-1.00209 c -0.1338,-0.0682 -0.2182,-0.20624 -0.2182,-0.35677 v -0.60052 c 1.0067,-0.43386 1.5854,-1.27656 1.8672,-2.33073 0.4244,-0.13125 0.7369,-0.52396 0.7369,-0.99011 v -0.52083 c 0,-0.39895 -0.2296,-0.74323 -0.5614,-0.91822 -0.2297,-1.95886 -1.5245,-2.75157 -3.6052,-2.75157 -0.099,0 -0.1953,0.004 -0.2901,0.0115 -0.7073,0.0562 -1.4229,-0.0766 -2.0115,-0.47343 -0.2448,-0.16459 -0.4505,-0.34011 -0.5953,-0.52397 -0.066,-0.0838 -0.1979,-0.0302 -0.1859,0.0755 0.021,0.18228 0.052,0.39478 0.098,0.62708 0.1719,0.86458 0.069,0.73854 -0.2651,1.55417 -0.1849,0.45104 -0.3042,0.95156 -0.3594,1.48176 -0.3292,0.17657 -0.5573,0.5198 -0.5573,0.91719 v 0.52083 c 0,0.46615 0.3125,0.85886 0.737,0.99063 0.2818,1.05365 0.8599,1.89688 1.8672,2.33073 v 0.59636 c 0,0.1526 -0.086,0.29166 -0.2235,0.35937 l -2.0109,0.99011 c -0.549,0.29947 -0.8906,0.875 -0.8906,1.5 v 0.004 z"
               id="path5572" />
            <path
               inkscape:connector-curvature="0"
               id="path5574"
               d="m 1703.7305,1445.6167 v 0.9375 h 345.9635 v -0.9375 z"
               style="color:#000000;font-style:normal;font-variant:normal;font-weight:normal;font-stretch:normal;font-size:medium;line-height:normal;font-family:sans-serif;font-variant-ligatures:normal;font-variant-position:normal;font-variant-caps:normal;font-variant-numeric:normal;font-variant-alternates:normal;font-feature-settings:normal;text-indent:0;text-align:start;text-decoration:none;text-decoration-line:none;text-decoration-style:solid;text-decoration-color:#000000;letter-spacing:normal;word-spacing:normal;text-transform:none;writing-mode:lr-tb;direction:ltr;text-orientation:mixed;dominant-baseline:auto;baseline-shift:baseline;text-anchor:start;white-space:normal;shape-padding:0;clip-rule:nonzero;display:inline;overflow:visible;visibility:visible;opacity:1;isolation:auto;mix-blend-mode:normal;color-interpolation:sRGB;color-interpolation-filters:linearRGB;solid-color:#000000;solid-opacity:1;vector-effect:none;fill:#000000;fill-opacity:1;fill-rule:nonzero;stroke:none;stroke-width:0.9375px;stroke-linecap:butt;stroke-linejoin:miter;stroke-miterlimit:4;stroke-dasharray:none;stroke-dashoffset:0;stroke-opacity:1;color-rendering:auto;image-rendering:auto;shape-rendering:auto;text-rendering:auto;enable-background:accumulate"
               transform="matrix(0.0830793,0,0,0.0830793,956.62386,570.53352)"
               sodipodi:nodetypes="ccccc" />
          </g>
        </g>
      </g>
      <rect
         y="146.84134"
         x="71.848061"
         height="39.6875"
         width="39.6875"
         id="rect5671"
         style="opacity:1;fill:none;fill-opacity:1;stroke:none;stroke-width:1.52610493;stroke-linecap:round;stroke-linejoin:round;stroke-miterlimit:4;stroke-dasharray:none;stroke-opacity:1" />
    </g>
    <g
       inkscape:export-ydpi="96"
       inkscape:export-xdpi="96"
       id="g5993"
       style="filter:url(#filter6005)">
      <g
         id="g5989"
         transform="matrix(1.3798251,0,0,1.4111111,-5058.5314,-4613.5601)">
        <g
           id="g5975"
           transform="translate(6.517919,-1.34342e-4)">
          <g
             transform="translate(2613.451,2701.553)"
             id="g5973">
            <path
               inkscape:connector-curvature="0"
               style="fill:#ffffff;stroke-width:0.52083349"
               d="m 1125.8804,671.95996 h -26.6639 c -0.5729,0 -1.0417,0.46875 -1.0417,1.04167 v 26.04167 c 0,0.57291 0.4688,1.04166 1.0417,1.04166 h 26.6639 c 0.573,0 1.0417,-0.46875 1.0417,-1.04166 v -26.04167 c 0,-0.57292 -0.4687,-1.04167 -1.0417,-1.04167 z m -14.0597,4.6875 c -0.863,0 -1.5625,-0.69948 -1.5625,-1.5625 0,-0.86302 0.6995,-1.5625 1.5625,-1.5625 0.863,0 1.5625,0.69948 1.5625,1.5625 0,0.86302 -0.6995,1.5625 -1.5625,1.5625 z"
               id="path5965"
               sodipodi:nodetypes="ssssssssssssss" />
            <path
               inkscape:connector-curvature="0"
               style="fill:#666666;fill-opacity:1;stroke-width:0.52083349"
               d="m 1098.1748,690.70996 v 8.33334 c 0,0.57291 0.4688,1.04166 1.0417,1.04166 h 26.6731 c 0.573,0 1.0417,-0.46875 1.0417,-1.04166 v -8.33334 z"
               id="path5967"
               sodipodi:nodetypes="csssscc" />
            <path
               inkscape:connector-curvature="0"
               style="fill:#37c871;fill-opacity:1;stroke-width:0.52083349"
               d="m 1117.2346,690.70996 c -0.014,-0.63229 -0.3745,-1.20677 -0.9422,-1.49062 l -1.962,-1.00209 c -0.1338,-0.0682 -0.2182,-0.20624 -0.2182,-0.35677 v -0.60052 c 1.0067,-0.43386 1.5854,-1.27656 1.8672,-2.33073 0.4244,-0.13125 0.7369,-0.52396 0.7369,-0.99011 v -0.52083 c 0,-0.39895 -0.2296,-0.74323 -0.5614,-0.91822 -0.2297,-1.95886 -1.5245,-2.75157 -3.6052,-2.75157 -0.099,0 -0.1953,0.004 -0.2901,0.0115 -0.7073,0.0562 -1.4229,-0.0766 -2.0115,-0.47343 -0.2448,-0.16459 -0.4505,-0.34011 -0.5953,-0.52397 -0.066,-0.0838 -0.1979,-0.0302 -0.1859,0.0755 0.021,0.18228 0.052,0.39478 0.098,0.62708 0.1719,0.86458 0.069,0.73854 -0.2651,1.55417 -0.1849,0.45104 -0.3042,0.95156 -0.3594,1.48176 -0.3292,0.17657 -0.5573,0.5198 -0.5573,0.91719 v 0.52083 c 0,0.46615 0.3125,0.85886 0.737,0.99063 0.2818,1.05365 0.8599,1.89688 1.8672,2.33073 v 0.59636 c 0,0.1526 -0.086,0.29166 -0.2235,0.35937 l -2.0109,0.99011 c -0.549,0.29947 -0.8906,0.875 -0.8906,1.5 v 0.004 z"
               id="path5969" />
            <path
               inkscape:connector-curvature="0"
               id="path5971"
               d="m 1703.7305,1445.6167 v 0.9375 h 345.9635 v -0.9375 z"
               style="color:#000000;font-style:normal;font-variant:normal;font-weight:normal;font-stretch:normal;font-size:medium;line-height:normal;font-family:sans-serif;font-variant-ligatures:normal;font-variant-position:normal;font-variant-caps:normal;font-variant-numeric:normal;font-variant-alternates:normal;font-feature-settings:normal;text-indent:0;text-align:start;text-decoration:none;text-decoration-line:none;text-decoration-style:solid;text-decoration-color:#000000;letter-spacing:normal;word-spacing:normal;text-transform:none;writing-mode:lr-tb;direction:ltr;text-orientation:mixed;dominant-baseline:auto;baseline-shift:baseline;text-anchor:start;white-space:normal;shape-padding:0;clip-rule:nonzero;display:inline;overflow:visible;visibility:visible;opacity:1;isolation:auto;mix-blend-mode:normal;color-interpolation:sRGB;color-interpolation-filters:linearRGB;solid-color:#000000;solid-opacity:1;vector-effect:none;fill:#000000;fill-opacity:1;fill-rule:nonzero;stroke:none;stroke-width:0.9375px;stroke-linecap:butt;stroke-linejoin:miter;stroke-miterlimit:4;stroke-dasharray:none;stroke-dashoffset:0;stroke-opacity:1;color-rendering:auto;image-rendering:auto;shape-rendering:auto;text-rendering:auto;enable-background:accumulate"
               transform="matrix(0.0830793,0,0,0.0830793,956.62386,570.53352)"
               sodipodi:nodetypes="ccccc" />
          </g>
        </g>
        <g
           transform="translate(6.517919,-1.34342e-4)"
           id="g5987">
          <g
             id="g5985"
             transform="translate(2613.451,2701.553)">
            <path
               sodipodi:nodetypes="ssssssssssssss"
               id="path5977"
               d="m 1125.8804,671.95996 h -26.6639 c -0.5729,0 -1.0417,0.46875 -1.0417,1.04167 v 26.04167 c 0,0.57291 0.4688,1.04166 1.0417,1.04166 h 26.6639 c 0.573,0 1.0417,-0.46875 1.0417,-1.04166 v -26.04167 c 0,-0.57292 -0.4687,-1.04167 -1.0417,-1.04167 z m -14.0597,4.6875 c -0.863,0 -1.5625,-0.69948 -1.5625,-1.5625 0,-0.86302 0.6995,-1.5625 1.5625,-1.5625 0.863,0 1.5625,0.69948 1.5625,1.5625 0,0.86302 -0.6995,1.5625 -1.5625,1.5625 z"
               style="fill:#ffffff;stroke-width:0.52083349"
               inkscape:connector-curvature="0" />
            <path
               sodipodi:nodetypes="csssscc"
               id="path5979"
               d="m 1098.1748,690.70996 v 8.33334 c 0,0.57291 0.4688,1.04166 1.0417,1.04166 h 26.6731 c 0.573,0 1.0417,-0.46875 1.0417,-1.04166 v -8.33334 z"
               style="fill:#666666;fill-opacity:1;stroke-width:0.52083349"
               inkscape:connector-curvature="0" />
            <path
               id="path5981"
               d="m 1117.2346,690.70996 c -0.014,-0.63229 -0.3745,-1.20677 -0.9422,-1.49062 l -1.962,-1.00209 c -0.1338,-0.0682 -0.2182,-0.20624 -0.2182,-0.35677 v -0.60052 c 1.0067,-0.43386 1.5854,-1.27656 1.8672,-2.33073 0.4244,-0.13125 0.7369,-0.52396 0.7369,-0.99011 v -0.52083 c 0,-0.39895 -0.2296,-0.74323 -0.5614,-0.91822 -0.2297,-1.95886 -1.5245,-2.75157 -3.6052,-2.75157 -0.099,0 -0.1953,0.004 -0.2901,0.0115 -0.7073,0.0562 -1.4229,-0.0766 -2.0115,-0.47343 -0.2448,-0.16459 -0.4505,-0.34011 -0.5953,-0.52397 -0.066,-0.0838 -0.1979,-0.0302 -0.1859,0.0755 0.021,0.18228 0.052,0.39478 0.098,0.62708 0.1719,0.86458 0.069,0.73854 -0.2651,1.55417 -0.1849,0.45104 -0.3042,0.95156 -0.3594,1.48176 -0.3292,0.17657 -0.5573,0.5198 -0.5573,0.91719 v 0.52083 c 0,0.46615 0.3125,0.85886 0.737,0.99063 0.2818,1.05365 0.8599,1.89688 1.8672,2.33073 v 0.59636 c 0,0.1526 -0.086,0.29166 -0.2235,0.35937 l -2.0109,0.99011 c -0.549,0.29947 -0.8906,0.875 -0.8906,1.5 v 0.004 z"
               style="fill:#37c871;fill-opacity:1;stroke-width:0.52083349"
               inkscape:connector-curvature="0" />
            <path
               sodipodi:nodetypes="ccccc"
               transform="matrix(0.0830793,0,0,0.0830793,956.62386,570.53352)"
               style="color:#000000;font-style:normal;font-variant:normal;font-weight:normal;font-stretch:normal;font-size:medium;line-height:normal;font-family:sans-serif;font-variant-ligatures:normal;font-variant-position:normal;font-variant-caps:normal;font-variant-numeric:normal;font-variant-alternates:normal;font-feature-settings:normal;text-indent:0;text-align:start;text-decoration:none;text-decoration-line:none;text-decoration-style:solid;text-decoration-color:#000000;letter-spacing:normal;word-spacing:normal;text-transform:none;writing-mode:lr-tb;direction:ltr;text-orientation:mixed;dominant-baseline:auto;baseline-shift:baseline;text-anchor:start;white-space:normal;shape-padding:0;clip-rule:nonzero;display:inline;overflow:visible;visibility:visible;opacity:1;isolation:auto;mix-blend-mode:normal;color-interpolation:sRGB;color-interpolation-filters:linearRGB;solid-color:#000000;solid-opacity:1;vector-effect:none;fill:#000000;fill-opacity:1;fill-rule:nonzero;stroke:none;stroke-width:0.9375px;stroke-linecap:butt;stroke-linejoin:miter;stroke-miterlimit:4;stroke-dasharray:none;stroke-dashoffset:0;stroke-opacity:1;color-rendering:auto;image-rendering:auto;shape-rendering:auto;text-rendering:auto;enable-background:accumulate"
               d="m 1703.7305,1445.6167 v 0.9375 h 345.9635 v -0.9375 z"
               id="path5983"
               inkscape:connector-curvature="0" />
          </g>
        </g>
      </g>
      <rect
         style="opacity:1;fill:none;fill-opacity:1;stroke:none;stroke-width:1.52610493;stroke-linecap:round;stroke-linejoin:round;stroke-miterlimit:4;stroke-dasharray:none;stroke-opacity:1"
         id="rect5991"
         width="39.6875"
         height="39.6875"
         x="71.848061"
         y="146.84134" />
    </g>
  </g>
</svg>
