<?xml version="1.0" encoding="UTF-8" standalone="no"?>
<svg
   xmlns:osb="http://www.openswatchbook.org/uri/2009/osb"
   xmlns:dc="http://purl.org/dc/elements/1.1/"
   xmlns:cc="http://creativecommons.org/ns#"
   xmlns:rdf="http://www.w3.org/1999/02/22-rdf-syntax-ns#"
   xmlns:svg="http://www.w3.org/2000/svg"
   xmlns="http://www.w3.org/2000/svg"
   xmlns:sodipodi="http://sodipodi.sourceforge.net/DTD/sodipodi-0.dtd"
   xmlns:inkscape="http://www.inkscape.org/namespaces/inkscape"
   enable-background="new"
   sodipodi:docname="Adaptive Icon.svg"
   inkscape:version="1.0 (1.0+r73+1)"
   id="SVGRoot"
   version="1.1"
   viewBox="0 0 108 108"
   height="108px"
   width="108px">
  <defs
     id="defs1433">
    <linearGradient
       osb:paint="solid"
       id="linearGradient2309">
      <stop
         id="stop2307"
         offset="0"
         style="stop-color:#ff5555;stop-opacity:1;" />
    </linearGradient>
    <inkscape:perspective
       id="perspective2069"
       inkscape:persp3d-origin="54 : 36 : 1"
       inkscape:vp_z="108 : 54 : 1"
       inkscape:vp_y="0 : 1000 : 0"
       inkscape:vp_x="0 : 54 : 1"
       sodipodi:type="inkscape:persp3d" />
    <filter
       id="filter2387"
       style="color-interpolation-filters:sRGB"
       inkscape:collect="always">
      <feBlend
         id="feBlend2389"
         in2="BackgroundImage"
         mode="multiply"
         inkscape:collect="always" />
    </filter>
    <filter
       id="filter4147"
       inkscape:label="Drop Shadow"
       style="color-interpolation-filters:sRGB;">
      <feFlood
         id="feFlood4137"
         result="flood"
         flood-color="rgb(0,0,0)"
         flood-opacity="0.498039" />
      <feComposite
         id="feComposite4139"
         result="composite1"
         operator="in"
         in2="SourceGraphic"
         in="flood" />
      <feGaussianBlur
         id="feGaussianBlur4141"
         result="blur"
         stdDeviation="2.5"
         in="composite1" />
      <feOffset
         id="feOffset4143"
         result="offset"
         dy="0.5"
         dx="0.5" />
      <feComposite
         id="feComposite4145"
         result="composite2"
         operator="over"
         in2="offset"
         in="SourceGraphic" />
    </filter>
    <filter
       id="filter4255"
       inkscape:label="Drop Shadow"
       style="color-interpolation-filters:sRGB;">
      <feFlood
         id="feFlood4245"
         result="flood"
         flood-color="rgb(0,0,0)"
         flood-opacity="0.498039" />
      <feComposite
         id="feComposite4247"
         result="composite1"
         operator="in"
         in2="SourceGraphic"
         in="flood" />
      <feGaussianBlur
         id="feGaussianBlur4249"
         result="blur"
         stdDeviation="1.2"
         in="composite1" />
      <feOffset
         id="feOffset4251"
         result="offset"
         dy="0.5"
         dx="0.5" />
      <feComposite
         id="feComposite4253"
         result="composite2"
         operator="over"
         in2="offset"
         in="SourceGraphic" />
    </filter>
    <filter
       id="filter4267"
       inkscape:label="Drop Shadow"
       style="color-interpolation-filters:sRGB;">
      <feFlood
         id="feFlood4257"
         result="flood"
         flood-color="rgb(0,0,0)"
         flood-opacity="0.498039" />
      <feComposite
         id="feComposite4259"
         result="composite1"
         operator="in"
         in2="SourceGraphic"
         in="flood" />
      <feGaussianBlur
         id="feGaussianBlur4261"
         result="blur"
         stdDeviation="1.2"
         in="composite1" />
      <feOffset
         id="feOffset4263"
         result="offset"
         dy="0.5"
         dx="0.5" />
      <feComposite
         id="feComposite4265"
         result="composite2"
         operator="over"
         in2="offset"
         in="SourceGraphic" />
    </filter>
    <filter
       id="filter939"
       inkscape:label="Drop Shadow"
       style="color-interpolation-filters:sRGB;">
      <feFlood
         id="feFlood929"
         result="flood"
         flood-color="rgb(0,0,0)"
         flood-opacity="0.498039" />
      <feComposite
         id="feComposite931"
         result="composite1"
         operator="in"
         in2="SourceGraphic"
         in="flood" />
      <feGaussianBlur
         id="feGaussianBlur933"
         result="blur"
         stdDeviation="1.2"
         in="composite1" />
      <feOffset
         id="feOffset935"
         result="offset"
         dy="0.5"
         dx="0.5" />
      <feComposite
         id="feComposite937"
         result="composite2"
         operator="over"
         in2="offset"
         in="SourceGraphic" />
    </filter>
  </defs>
  <sodipodi:namedview
     inkscape:guide-bbox="true"
     showguides="true"
     inkscape:document-rotation="0"
     inkscape:bbox-nodes="true"
     inkscape:bbox-paths="false"
     inkscape:snap-bbox="true"
     inkscape:grid-bbox="true"
     inkscape:window-maximized="1"
     inkscape:window-y="30"
     inkscape:window-x="0"
     inkscape:window-height="1017"
     inkscape:window-width="1920"
     showgrid="false"
     inkscape:current-layer="layer4"
     inkscape:document-units="px"
     inkscape:cy="65.613092"
     inkscape:cx="51.142741"
     inkscape:zoom="11.313709"
     inkscape:pageshadow="2"
     inkscape:pageopacity="0.0"
     borderopacity="1.0"
     bordercolor="#666666"
     pagecolor="#ffffff"
     id="base">
    <sodipodi:guide
       id="guide1328"
       orientation="0,-1"
       position="111.04367,90.945799" />
    <sodipodi:guide
       id="guide1330"
       orientation="1,0"
       position="90.537567,15.740032" />
    <sodipodi:guide
       id="guide1332"
       orientation="1,0"
       position="17.279922,93.990447" />
    <sodipodi:guide
       id="guide1334"
       orientation="0,-1"
       position="54.4375,17.687501" />
  </sodipodi:namedview>
  <metadata
     id="metadata1436">
    <rdf:RDF>
      <cc:Work
         rdf:about="">
        <dc:format>image/svg+xml</dc:format>
        <dc:type
           rdf:resource="http://purl.org/dc/dcmitype/StillImage" />
        <dc:title />
      </cc:Work>
    </rdf:RDF>
  </metadata>
  <g
     style="display:inline"
     inkscape:label="Background"
     id="layer7"
     inkscape:groupmode="layer">
    <circle
       r="0"
       cy="53.625"
       cx="54.125"
       id="path2407"
       style="display:inline;opacity:1;fill:#ffeb3b;fill-opacity:1;stroke:#000000;stroke-width:0;stroke-linejoin:round;stroke-miterlimit:0;stroke-dasharray:none;stroke-dashoffset:0;stroke-opacity:1;filter:url(#filter4147)" />
    <rect
       y="17.054201"
       x="17.279922"
       height="73.258301"
       width="73.258301"
       id="rect1336"
       style="display:inline;fill:#dd2c00;fill-opacity:1;stroke:none;stroke-width:0;stroke-linecap:round;stroke-linejoin:round;stroke-miterlimit:4;stroke-dasharray:none" />
  </g>
  <g
     style="display:inline"
     inkscape:label="Foreground"
     id="layer5"
     inkscape:groupmode="layer">
    <g
       id="g29373"
       transform="matrix(0.44469308,0,0,0.44177135,146.13939,-120.42942)"
       style="display:inline;fill:#ffffff;fill-opacity:1;stroke:#ffffff;stroke-width:1;stroke-miterlimit:4;stroke-dasharray:none;stroke-opacity:1"
       inkscape:export-filename="/media/cosmobird/Work/Organizing Matrix/5-Cooperative/3 - Repo/jipmer/uxui/mock-png's/drawing-v-2.0/splash - login.png"
       inkscape:export-xdpi="600"
       inkscape:export-ydpi="600">
      <g
         id="g29347"
         style="fill:#ffffff;fill-opacity:1;stroke:#ffffff;stroke-width:1;stroke-miterlimit:4;stroke-dasharray:none;stroke-opacity:1">
        <g
           id="g29341"
           style="fill:#ffffff;fill-opacity:1;stroke:#ffffff;stroke-width:1;stroke-miterlimit:4;stroke-dasharray:none;stroke-opacity:1">
          <path
             sodipodi:nodetypes="ccscccccccccccc"
             inkscape:connector-curvature="0"
             d="m -198.6,379.2 c -3.71341,-10.28552 -10.05335,-19.72326 -21.23919,-21.24098 -4.99384,-0.59421 -9.44933,1.03625 -12.70913,4.00703 -6.5196,5.94157 -8.25643,17.24446 0.0483,26.83395 4.9,5.6 10.9,10.3 16.3,15.5 11.19573,9.51382 10.74099,29.20277 4.40971,38.2 0.5,-1.9 0.7,-3.1 1.1,-4.3 3.2,-10.2 2.09029,-22.6 -6.00971,-29.4 -4.1,-3.4 -8.4,-6.5 -12.6,-9.9 -4.31004,-3.03286 -8.04837,-6.49671 -10.92529,-10.18247 -9.11587,-11.33422 -5.65106,-25.76376 4.88336,-32.9777 6.61864,-4.35549 15.18756,-5.4403 22.34193,-1.83983 7.2,3.9 10.6,10.6 12.9,18.1 0.6,2.1 0.9,4.2 1.5,7.2 z"
             id="path29339"
             style="fill:#ffffff;fill-opacity:1;stroke:#ffffff;stroke-width:1;stroke-miterlimit:4;stroke-dasharray:none;stroke-opacity:1" />
        </g>
        <g
           id="g29345"
           style="fill:#ffffff;fill-opacity:1;stroke:#ffffff;stroke-width:1;stroke-miterlimit:4;stroke-dasharray:none;stroke-opacity:1">
          <path
             sodipodi:nodetypes="cccsssccccc"
             inkscape:connector-curvature="0"
             d="m -201.91682,427.9 c -2.9,-7.1 2.11682,-13.5 8.81682,-16.9 5.9,-3 12.2,-5.2 18.1,-8.2 4.3,-2.15 7.05,-5.475 8.1125,-9.3 1.0625,-3.825 0.51446,-9.00235 -2.0125,-12.3 -1.98819,-2.59456 -5.02598,-5.76438 -13.72225,-4.84183 -4.73694,0.50252 -9.36222,3.3778 -13.54025,5.85433 7.425,-7.85 20.9625,-12.7125 27.9625,-6.1125 9.8,9.3 6.2,24.9 -7.3,30.5 -3.4,1.4 -7,2.4 -10.5,3.6 -9.5,3.3 -15.41682,7.3 -15.91682,17.7 z"
             id="path29343"
             style="fill:#ffffff;fill-opacity:1;stroke:#ffffff;stroke-width:1;stroke-miterlimit:4;stroke-dasharray:none;stroke-opacity:1" />
        </g>
      </g>
      <g
         id="g29351"
         style="fill:#ffffff;fill-opacity:1;stroke:#ffffff;stroke-width:1;stroke-miterlimit:4;stroke-dasharray:none;stroke-opacity:1">
        <path
           inkscape:connector-curvature="0"
           d="m -219.3,369.5 c -1,0 -1.9,-0.3 -2,-0.4 -0.3,-0.1 -0.4,-0.4 -0.3,-0.6 0.1,-0.3 0.4,-0.4 0.6,-0.3 0,0 1.7,0.6 2.7,0 0.5,-0.3 0.8,-0.7 0.9,-1.4 0.1,-0.3 0.3,-0.4 0.6,-0.4 0.3,0.1 0.4,0.3 0.4,0.6 -0.2,1 -0.7,1.7 -1.4,2.1 -0.4,0.3 -0.9,0.4 -1.5,0.4 z"
           id="path29349"
           style="fill:#ffffff;fill-opacity:1;stroke:#ffffff;stroke-width:0.603098;stroke-miterlimit:4;stroke-dasharray:none;stroke-opacity:1" />
      </g>
      <g
         id="g29355"
         style="fill:#ffffff;fill-opacity:1;stroke:#ffffff;stroke-width:1;stroke-miterlimit:4;stroke-dasharray:none;stroke-opacity:1">
        <path
           inkscape:connector-curvature="0"
           d="m -187.7,392.4 c 0,0 -0.1,0 -0.1,0 -1,-0.3 -1.6,-0.8 -2,-1.5 -0.7,-1.5 0.1,-3.5 0.2,-3.6 0.1,-0.3 0.4,-0.4 0.7,-0.2 0.3,0.1 0.4,0.4 0.3,0.7 0,0 -0.7,1.6 -0.2,2.7 0.2,0.5 0.7,0.8 1.4,1 0.3,0.1 0.4,0.3 0.4,0.6 -0.3,0.1 -0.5,0.3 -0.7,0.3 z"
           id="path29353"
           style="fill:#ffffff;fill-opacity:1;stroke:#ffffff;stroke-width:0.603098;stroke-miterlimit:4;stroke-dasharray:none;stroke-opacity:1" />
      </g>
      <g
         id="g29359"
         style="fill:#ffffff;fill-opacity:1;stroke:#ffffff;stroke-width:1;stroke-miterlimit:4;stroke-dasharray:none;stroke-opacity:1">
        <path
           inkscape:connector-curvature="0"
           d="m -229.7,375.7 c -1,0 -1.9,-0.3 -2,-0.4 -0.3,-0.1 -0.4,-0.4 -0.3,-0.6 0.1,-0.3 0.4,-0.4 0.6,-0.3 0,0 1.7,0.6 2.7,0 0.5,-0.3 0.8,-0.7 0.9,-1.4 0.1,-0.3 0.3,-0.4 0.6,-0.4 0.3,0.1 0.4,0.3 0.4,0.6 -0.2,1 -0.7,1.7 -1.4,2.1 -0.4,0.3 -0.9,0.4 -1.5,0.4 z"
           id="path29357"
           style="fill:#ffffff;fill-opacity:1;stroke:#ffffff;stroke-width:0.603098;stroke-miterlimit:4;stroke-dasharray:none;stroke-opacity:1" />
      </g>
      <g
         id="g29363"
         style="fill:#ffffff;fill-opacity:1;stroke:#ffffff;stroke-width:1;stroke-miterlimit:4;stroke-dasharray:none;stroke-opacity:1">
        <path
           inkscape:connector-curvature="0"
           d="m -220.6,382.7 c -1.5,0 -2.7,-0.3 -2.8,-0.3 -0.3,-0.1 -0.4,-0.3 -0.4,-0.6 0.1,-0.3 0.3,-0.4 0.6,-0.4 0,0 3.8,1 6.2,-0.7 1.1,-0.7 1.7,-1.9 1.8,-3.6 0,-0.3 0.3,-0.5 0.5,-0.5 0.3,0 0.5,0.3 0.5,0.5 -0.2,1.9 -0.9,3.4 -2.2,4.3 -1.2,1 -2.8,1.3 -4.2,1.3 z"
           id="path29361"
           style="fill:#ffffff;fill-opacity:1;stroke:#ffffff;stroke-width:0.603098;stroke-miterlimit:4;stroke-dasharray:none;stroke-opacity:1" />
      </g>
      <g
         id="g29367"
         style="fill:#ffffff;fill-opacity:1;stroke:#ffffff;stroke-width:1;stroke-miterlimit:4;stroke-dasharray:none;stroke-opacity:1">
        <path
           style="fill:#ffffff;fill-opacity:1;stroke:#ffffff;stroke-width:0.603098;stroke-miterlimit:4;stroke-dasharray:none;stroke-opacity:1"
           d="m -182.5,383.89999 a 1.3,1.6 0 0 1 -1.3,1.6 1.3,1.6 0 0 1 -1.3,-1.6 1.3,1.6 0 0 1 1.3,-1.6 1.3,1.6 0 0 1 1.3,1.6 z"
           id="ellipse29365"
           inkscape:connector-curvature="0" />
      </g>
      <g
         id="g29371"
         style="fill:#ffffff;fill-opacity:1;stroke:#ffffff;stroke-width:1;stroke-miterlimit:4;stroke-dasharray:none;stroke-opacity:1">
        <path
           style="fill:#ffffff;fill-opacity:1;stroke:#ffffff;stroke-width:0.603098;stroke-miterlimit:4;stroke-dasharray:none;stroke-opacity:1"
           d="m -178.9,391.29999 a 1.3,1.6 0 0 1 -1.3,1.6 1.3,1.6 0 0 1 -1.3,-1.6 1.3,1.6 0 0 1 1.3,-1.6 1.3,1.6 0 0 1 1.3,1.6 z"
           id="ellipse29369"
           inkscape:connector-curvature="0" />
      </g>
    </g>
  </g>
  <g
     style="display:inline;filter:url(#filter2387)"
     inkscape:label="Mask"
     id="layer4"
     inkscape:groupmode="layer">
    <rect
       rx="7.5435399e-15"
       y="56.530945"
       x="51.869072"
       height="0.5333581"
       width="0.5333581"
       id="rect2097"
       style="opacity:1;fill:#000000;fill-opacity:1;stroke:#000000;stroke-width:0.133333;stroke-linejoin:round;stroke-miterlimit:4;stroke-dasharray:none;stroke-dashoffset:0;stroke-opacity:1" />
    <rect
       ry="7.5435399e-15"
       rx="7.5435399e-15"
       y="0.021774802"
       x="-0.19172646"
       height="108.18983"
       width="108.19863"
       id="rect2099"
       style="opacity:0.551;fill:#000000;fill-opacity:1;stroke:#000000;stroke-width:0.133333;stroke-linejoin:round;stroke-miterlimit:4;stroke-dasharray:none;stroke-dashoffset:0;stroke-opacity:1" />
    <rect
       rx="10.773518"
       y="17.089233"
       x="17.268608"
       height="73.254875"
       width="73.268959"
       id="rect2101"
       style="opacity:1;fill:#fbffff;fill-opacity:0.952255;stroke:#000000;stroke-width:0.133333;stroke-linejoin:round;stroke-miterlimit:4;stroke-dasharray:none;stroke-dashoffset:0;stroke-opacity:1" />
  </g>
  <g
     style="display:inline;opacity:0.75"
     inkscape:label="Guidelines"
     id="layer2"
     inkscape:groupmode="layer">
    <g
       style="stroke-width:0.250527;stroke-miterlimit:4;stroke-dasharray:none"
       transform="matrix(0.53221206,0,0,0.53221206,25.504296,25.19726)"
       id="g2044">
      <rect
         style="opacity:1;fill:none;fill-opacity:1;stroke:#000000;stroke-width:0.250527;stroke-linejoin:round;stroke-miterlimit:4;stroke-dasharray:none;stroke-dashoffset:0;stroke-opacity:1"
         id="rect2001"
         width="99.039146"
         height="71.743713"
         x="4.6238155"
         y="18.059332"
         rx="6" />
      <rect
         rx="6"
         y="-90.015495"
         x="4.411365"
         height="71.744209"
         width="98.741333"
         id="rect2004"
         style="opacity:1;fill:none;fill-opacity:1;stroke:#000000;stroke-width:0.250527;stroke-linejoin:round;stroke-miterlimit:4;stroke-dasharray:none;stroke-dashoffset:0;stroke-opacity:1"
         transform="rotate(90)" />
      <rect
         transform="rotate(90)"
         style="opacity:1;fill:none;fill-opacity:1;stroke:#000000;stroke-width:0.250527;stroke-linejoin:round;stroke-miterlimit:4;stroke-dasharray:none;stroke-dashoffset:0;stroke-opacity:1"
         id="rect2006"
         width="85.313995"
         height="84.717079"
         x="11.124886"
         y="-96.576508"
         rx="6" />
      <circle
         style="display:inline;opacity:1;fill:none;fill-opacity:1;stroke:#000000;stroke-width:0.250527;stroke-linejoin:round;stroke-miterlimit:4;stroke-dasharray:none;stroke-dashoffset:0;stroke-opacity:1"
         id="path2008"
         cx="54.143387"
         cy="54.005768"
         r="22.671612" />
      <circle
         r="49.175579"
         cy="54.005768"
         cx="54.143387"
         id="circle2011"
         style="display:inline;opacity:1;fill:none;fill-opacity:1;stroke:#000000;stroke-width:0.250527;stroke-linejoin:round;stroke-miterlimit:4;stroke-dasharray:none;stroke-dashoffset:0;stroke-opacity:1" />
      <path
         sodipodi:nodetypes="cc"
         style="display:inline;opacity:1;fill:#000000;stroke:#000000;stroke-width:0.250527;stroke-linecap:butt;stroke-linejoin:miter;stroke-miterlimit:4;stroke-dasharray:none;stroke-opacity:1"
         d="M -47.793892,-47.303485 155.50595,155.97983"
         id="path2013"
         inkscape:connector-curvature="0" />
      <path
         sodipodi:nodetypes="cc"
         style="fill:none;stroke:#000000;stroke-width:0.250527;stroke-linecap:butt;stroke-linejoin:miter;stroke-miterlimit:4;stroke-dasharray:none;stroke-opacity:1"
         d="M 155.50595,-47.554023 -47.793892,155.47875"
         id="path2016"
         inkscape:connector-curvature="0" />
    </g>
    <ellipse
       ry="33.246918"
       rx="33.655399"
       cy="53.55846"
       cx="54.176975"
       id="path2065"
       style="opacity:1;fill:none;fill-opacity:1;stroke:#000000;stroke-width:0.121074;stroke-linejoin:round;stroke-miterlimit:4;stroke-dasharray:1.45289, 1.45289;stroke-dashoffset:0;stroke-opacity:1" />
    <rect
       rx="7.5435357e-15"
       y="17.089233"
       x="17.268608"
       height="73.223267"
       width="73.268959"
       id="rect2061"
       style="display:inline;opacity:1;fill:none;fill-opacity:1;stroke:#000000;stroke-width:0.133333;stroke-linejoin:round;stroke-miterlimit:4;stroke-dasharray:1.6, 1.6;stroke-dashoffset:0;stroke-opacity:1" />
  </g>
</svg>
