<?xml version="1.0" encoding="UTF-8" standalone="no"?>
<!-- Created with Inkscape (http://www.inkscape.org/) -->

<svg
   xmlns:dc="http://purl.org/dc/elements/1.1/"
   xmlns:cc="http://creativecommons.org/ns#"
   xmlns:rdf="http://www.w3.org/1999/02/22-rdf-syntax-ns#"
   xmlns:svg="http://www.w3.org/2000/svg"
   xmlns="http://www.w3.org/2000/svg"
   xmlns:sodipodi="http://sodipodi.sourceforge.net/DTD/sodipodi-0.dtd"
   xmlns:inkscape="http://www.inkscape.org/namespaces/inkscape"
   width="39.6875mm"
   height="39.6875mm"
   viewBox="0 0 39.6875 39.6875"
   version="1.1"
   id="svg6684"
   inkscape:version="0.92.3 (2405546, 2018-03-11)"
   sodipodi:docname="icon_location_light.svg">
  <defs
     id="defs6678" />
  <sodipodi:namedview
     id="base"
     pagecolor="#ffffff"
     bordercolor="#666666"
     borderopacity="1.0"
     inkscape:pageopacity="0.0"
     inkscape:pageshadow="2"
     inkscape:zoom="2.4607316"
     inkscape:cx="80.685712"
     inkscape:cy="58.851831"
     inkscape:document-units="mm"
     inkscape:current-layer="layer1"
     showgrid="false"
     inkscape:window-width="1366"
     inkscape:window-height="705"
     inkscape:window-x="0"
     inkscape:window-y="30"
     inkscape:window-maximized="1"
     fit-margin-top="0"
     fit-margin-left="0"
     fit-margin-right="0"
     fit-margin-bottom="0" />
  <metadata
     id="metadata6681">
    <rdf:RDF>
      <cc:Work
         rdf:about="">
        <dc:format>image/svg+xml</dc:format>
        <dc:type
           rdf:resource="http://purl.org/dc/dcmitype/StillImage" />
        <dc:title></dc:title>
      </cc:Work>
    </rdf:RDF>
  </metadata>
  <g
     inkscape:label="Layer 1"
     inkscape:groupmode="layer"
     id="layer1"
     transform="translate(138.06992,-89.438941)">
    <g
       id="g7370"
       inkscape:export-xdpi="96"
       inkscape:export-ydpi="96">
      <g
         inkscape:export-ydpi="96"
         inkscape:export-xdpi="96"
         transform="matrix(0.98998306,0,0,0.98998306,-649.84154,-582.56358)"
         id="g6629">
        <path
           id="path6624"
           d="m 536.99441,678.80204 c -7.9285,0 -14.37991,6.45076 -14.37991,14.37993 0,5.24807 1.32783,7.23427 11.66233,22.68909 l 1.63095,2.4399 c 0.24249,0.36243 0.6499,0.58015 1.08663,0.58015 0.43675,0 0.84416,-0.21772 1.08665,-0.58081 l 1.35977,-2.03378 c 10.57504,-15.81791 11.9335,-17.84974 11.9335,-23.09455 0,-7.92917 -6.45141,-14.37993 -14.37992,-14.37993 z m 0,25.84996 c -6.32494,0 -11.47003,-5.1451 -11.47003,-11.47003 0,-6.32496 5.14509,-11.47005 11.47003,-11.47005 6.32495,0 11.47004,5.14509 11.47004,11.47005 0,6.32493 -5.14509,11.47003 -11.47004,11.47003 z"
           inkscape:connector-curvature="0"
           style="fill:#ececec;fill-opacity:1;stroke-width:0.65185475" />
        <path
           inkscape:connector-curvature="0"
           style="fill:#37c871;fill-opacity:1;stroke-width:0.97640675"
           d="m 541.29016,696.92928 -2.25189,-1.15021 c -0.15364,-0.0791 -0.25048,-0.23669 -0.25048,-0.40941 v -0.68925 c 1.15553,-0.49797 1.81968,-1.4652 2.14308,-2.67516 0.48721,-0.15124 0.84587,-0.60194 0.84587,-1.13693 v -0.59784 c 0,-0.45794 -0.26361,-0.85299 -0.64441,-1.05394 -0.26363,-2.24827 -1.74975,-3.15809 -4.13791,-3.15809 -0.113,0 -0.22418,0.01 -0.33298,0.0126 -0.8118,0.0644 -1.63316,-0.0879 -2.30867,-0.54337 -0.28097,-0.18883 -0.51708,-0.39036 -0.68328,-0.60136 -0.0759,-0.0967 -0.22716,-0.0342 -0.21341,0.0868 0.024,0.20935 0.0598,0.45315 0.11238,0.71981 0.19728,0.99232 0.0795,0.84772 -0.30427,1.78379 -0.21222,0.5177 -0.34911,1.09221 -0.41249,1.70081 -0.37781,0.2026 -0.63962,0.59659 -0.63962,1.05266 v 0.59786 c 0,0.53488 0.35867,0.98567 0.84587,1.13692 0.32341,1.20929 0.98696,2.1772 2.14309,2.67516 v 0.68447 c 0,0.17507 -0.0993,0.33471 -0.25646,0.41243 l -2.30808,1.13644 c -0.63008,0.34369 -1.02222,1.00424 -1.02222,1.72161 v 0.54765 c 0,0 0,0.16073 0,0.2444 0,0.67548 2.40851,1.0055 5.38014,1.0055 2.97162,0 5.38012,-0.33002 5.38012,-1.0055 0,-0.0839 0,-0.2444 0,-0.2444 v -0.49982 c 0,-0.74245 -0.41965,-1.42154 -1.08438,-1.75392 z"
           id="path6627" />
      </g>
      <rect
         y="89.438942"
         x="-138.06992"
         height="39.6875"
         width="39.6875"
         id="rect7364"
         style="opacity:1;fill:none;fill-opacity:1;stroke:none;stroke-width:1.494506;stroke-linecap:round;stroke-linejoin:round;stroke-miterlimit:4;stroke-dasharray:none;stroke-opacity:1" />
    </g>
  </g>
</svg>
