<?xml version="1.0" encoding="UTF-8" standalone="no"?>
<!-- Created with Inkscape (http://www.inkscape.org/) -->

<svg
   xmlns:dc="http://purl.org/dc/elements/1.1/"
   xmlns:cc="http://creativecommons.org/ns#"
   xmlns:rdf="http://www.w3.org/1999/02/22-rdf-syntax-ns#"
   xmlns:svg="http://www.w3.org/2000/svg"
   xmlns="http://www.w3.org/2000/svg"
   xmlns:sodipodi="http://sodipodi.sourceforge.net/DTD/sodipodi-0.dtd"
   xmlns:inkscape="http://www.inkscape.org/namespaces/inkscape"
   width="0.62274694mm"
   height="0.53815836mm"
   viewBox="0 0 0.62274694 0.53815836"
   version="1.1"
   id="svg1397"
   inkscape:version="0.92.4 (unknown)"
   sodipodi:docname="ஆர்.svg">
  <defs
     id="defs1391" />
  <sodipodi:namedview
     id="base"
     pagecolor="#ffffff"
     bordercolor="#666666"
     borderopacity="1.0"
     inkscape:pageopacity="0.0"
     inkscape:pageshadow="2"
     inkscape:zoom="256"
     inkscape:cx="1.1768537"
     inkscape:cy="1.017008"
     inkscape:document-units="mm"
     inkscape:current-layer="layer1"
     showgrid="false"
     fit-margin-top="0"
     fit-margin-left="0"
     fit-margin-right="0"
     fit-margin-bottom="0"
     inkscape:window-width="1920"
     inkscape:window-height="1017"
     inkscape:window-x="0"
     inkscape:window-y="30"
     inkscape:window-maximized="1" />
  <metadata
     id="metadata1394">
    <rdf:RDF>
      <cc:Work
         rdf:about="">
        <dc:format>image/svg+xml</dc:format>
        <dc:type
           rdf:resource="http://purl.org/dc/dcmitype/StillImage" />
        <dc:title></dc:title>
      </cc:Work>
    </rdf:RDF>
  </metadata>
  <g
     inkscape:label="Layer 1"
     inkscape:groupmode="layer"
     id="layer1"
     transform="translate(269.43042,-218.86783)">
    <g
       transform="matrix(0.35277777,0,0,0.35277777,-485.93718,156.53393)"
       id="g1707"
       style="fill:#211e1e;fill-opacity:1">
      <g
         id="use1705"
         transform="matrix(0.26458333,0,0,0.26458333,613.71997,178.22)">
        <path
           inkscape:connector-curvature="0"
           id="path1409"
           d="M 6.671875,0 V -5.609375 H 4.125 c -0.453125,0 -0.921875,0.203125 -1.15625,0.421875 C 2.578125,-5.515625 2.21875,-5.765625 1.6875,-5.765625 0.875,-5.765625 0,-5.203125 0,-4.15625 V 0 h 0.96875 v -4.171875 c 0,-0.453125 0.3125,-0.671875 0.6875,-0.671875 0.359375,0 0.5625,0.109375 0.5625,0.578125 V 0 h 1.015625 v -3.828125 c 0,-0.59375 0.375,-0.859375 0.78125,-0.859375 H 5.71875 V 0 Z m 0,0"
           style="stroke:none" />
      </g>
    </g>
  </g>
</svg>
