<?xml version="1.0" encoding="UTF-8" standalone="no"?>
<!-- Created with Inkscape (http://www.inkscape.org/) -->

<svg
   xmlns:dc="http://purl.org/dc/elements/1.1/"
   xmlns:cc="http://creativecommons.org/ns#"
   xmlns:rdf="http://www.w3.org/1999/02/22-rdf-syntax-ns#"
   xmlns:svg="http://www.w3.org/2000/svg"
   xmlns="http://www.w3.org/2000/svg"
   xmlns:sodipodi="http://sodipodi.sourceforge.net/DTD/sodipodi-0.dtd"
   xmlns:inkscape="http://www.inkscape.org/namespaces/inkscape"
   width="0.81817567mm"
   height="0.52357411mm"
   viewBox="0 0 0.81817567 0.52357411"
   version="1.1"
   id="svg1861"
   inkscape:version="0.92.4 (unknown)"
   sodipodi:docname="கலம்.svg">
  <defs
     id="defs1855" />
  <sodipodi:namedview
     id="base"
     pagecolor="#ffffff"
     bordercolor="#666666"
     borderopacity="1.0"
     inkscape:pageopacity="0.0"
     inkscape:pageshadow="2"
     inkscape:zoom="256"
     inkscape:cx="1.5461593"
     inkscape:cy="0.98943323"
     inkscape:document-units="mm"
     inkscape:current-layer="layer1"
     showgrid="false"
     fit-margin-top="0"
     fit-margin-left="0"
     fit-margin-right="0"
     fit-margin-bottom="0"
     inkscape:window-width="1920"
     inkscape:window-height="1017"
     inkscape:window-x="0"
     inkscape:window-y="30"
     inkscape:window-maximized="1" />
  <metadata
     id="metadata1858">
    <rdf:RDF>
      <cc:Work
         rdf:about="">
        <dc:format>image/svg+xml</dc:format>
        <dc:type
           rdf:resource="http://purl.org/dc/dcmitype/StillImage" />
        <dc:title></dc:title>
      </cc:Work>
    </rdf:RDF>
  </metadata>
  <g
     inkscape:label="Layer 1"
     inkscape:groupmode="layer"
     id="layer1"
     transform="translate(-88.793293,-299.76202)">
    <g
       transform="matrix(0.35277777,0,0,0.35277777,9.0407239,242.73441)"
       id="g1035"
       style="fill:#211e1e;fill-opacity:1">
      <g
         id="use1033"
         transform="matrix(0.26458333,0,0,0.26458333,226,163.10001)">
        <path
           inkscape:connector-curvature="0"
           id="path1873"
           d="M 9.03125,-4.578125 V -5.375 H 4.828125 v 0.515625 c -0.421875,-0.46875 -0.84375,-0.609375 -1.5625,-0.609375 -1.84375,0 -3,1.09375 -3,2.78125 0,1.578125 0.578125,2.828125 2.046875,2.828125 1.046875,0 1.890625,-0.671875 1.890625,-1.796875 0,-1.015625 -0.59375,-1.71875 -1.65625,-1.71875 -0.640625,0 -1.078125,0.25 -1.359375,0.671875 0.078125,-1.234375 0.734375,-1.953125 1.953125,-1.953125 0.828125,0 1.421875,0.546875 1.421875,1.359375 V 0 H 5.53125 V -4.578125 H 7.0625 V 0 h 0.953125 v -4.578125 z m -5.75,3.03125 c 0,0.46875 -0.421875,0.890625 -0.921875,0.890625 -0.484375,0 -0.875,-0.421875 -0.875,-0.890625 0,-0.5 0.390625,-0.921875 0.875,-0.921875 0.5,0 0.921875,0.421875 0.921875,0.921875 z m 0,0"
           style="stroke:none" />
      </g>
    </g>
  </g>
</svg>
