<?xml version="1.0" standalone="no"?>
<!DOCTYPE svg PUBLIC "-//W3C//DTD SVG 1.1//EN" "http://www.w3.org/Graphics/SVG/1.1/DTD/svg11.dtd" >
<svg xmlns="http://www.w3.org/2000/svg" xmlns:xlink="http://www.w3.org/1999/xlink" version="1.1" viewBox="0 -410 1608 2048">
  <g transform="matrix(1 0 0 -1 0 1638)">
   <path fill="currentColor"
d="M660 1580q298 0 416 -132q102 -116 102 -250q0 -74 -32 -152q-110 -270 -498 -362q-238 -66 -314 -120q-112 -82 -114 -252q0 -102 104 -162q50 -28 102 -28q74 0 156 56q136 90 168 216q12 44 58 44t58 -44q36 -136 136 -220q62 -52 126 -52q44 0 92 28q114 66 138 188
q6 28 6 56q0 86 -60 154l90 78q88 -102 88 -230q0 -40 -8 -80q-36 -178 -194 -270q-78 -44 -154 -44q-102 0 -200 80q-72 60 -122 152q-62 -92 -154 -154q-116 -78 -224 -78q-82 0 -160 44q-166 96 -166 266q4 232 164 348q94 68 354 138h2q330 80 416 292q22 54 22 106
q0 92 -70 172q-70 78 -236 90q30 -94 30 -186v-34q-8 -94 -46 -158q-48 -80 -134 -106q-44 -14 -82 -14q-112 0 -194 108q-68 90 -68 190q0 48 16 98q38 130 166 186q88 38 220 38zM488 1434q-78 -34 -102 -114q-8 -30 -8 -58q0 -64 44 -122q44 -60 104 -60q20 0 42 6
q42 14 66 54q24 42 28 106q2 16 2 32q0 92 -40 184q-84 -6 -136 -28z" />
  </g>

</svg>
