<?xml version="1.0" encoding="UTF-8" standalone="no"?>
<!-- Created with Inkscape (http://www.inkscape.org/) -->

<svg
   xmlns:dc="http://purl.org/dc/elements/1.1/"
   xmlns:cc="http://creativecommons.org/ns#"
   xmlns:rdf="http://www.w3.org/1999/02/22-rdf-syntax-ns#"
   xmlns:svg="http://www.w3.org/2000/svg"
   xmlns="http://www.w3.org/2000/svg"
   xmlns:sodipodi="http://sodipodi.sourceforge.net/DTD/sodipodi-0.dtd"
   xmlns:inkscape="http://www.inkscape.org/namespaces/inkscape"
   width="35.570312mm"
   height="22.11014mm"
   viewBox="0 0 35.570312 22.11014"
   version="1.1"
   id="svg997"
   inkscape:version="0.92.3 (2405546, 2018-03-11)"
   sodipodi:docname="9.svg">
  <defs
     id="defs991" />
  <sodipodi:namedview
     id="base"
     pagecolor="#ffffff"
     bordercolor="#666666"
     borderopacity="1.0"
     inkscape:pageopacity="0.0"
     inkscape:pageshadow="2"
     inkscape:zoom="2.8"
     inkscape:cx="98.729096"
     inkscape:cy="56.615673"
     inkscape:document-units="mm"
     inkscape:current-layer="layer1"
     showgrid="false"
     fit-margin-top="0"
     fit-margin-left="0"
     fit-margin-right="0"
     fit-margin-bottom="0"
     inkscape:window-width="1366"
     inkscape:window-height="705"
     inkscape:window-x="0"
     inkscape:window-y="30"
     inkscape:window-maximized="1" />
  <metadata
     id="metadata994">
    <rdf:RDF>
      <cc:Work
         rdf:about="">
        <dc:format>image/svg+xml</dc:format>
        <dc:type
           rdf:resource="http://purl.org/dc/dcmitype/StillImage" />
        <dc:title></dc:title>
      </cc:Work>
    </rdf:RDF>
  </metadata>
  <g
     inkscape:label="Layer 1"
     inkscape:groupmode="layer"
     id="layer1"
     transform="translate(166.70778,-87.129453)">
    <path
       style="fill:none;stroke:#000000;stroke-width:0.26458332px;stroke-linecap:butt;stroke-linejoin:miter;stroke-opacity:1"
       d="m -161.93094,87.263938 0.18914,7.346839 c 0,0 -0.96872,0.40145 -1.34669,0.637685 -0.37798,0.236234 -1.63017,1.299147 -2.17351,1.960605 -0.54334,0.661458 -2.55097,5.362393 -0.18862,8.079093 2.36235,2.71671 3.51983,3.37826 6.52001,3.33106 3.00019,-0.0472 4.2453,-1.12469 5.8322,-2.59467 1.58693,-1.46999 1.72031,-4.14238 1.72031,-4.14238 l 0.13384,-4.226619 3.39101,0.167431 c 0,0 -0.53444,0.350695 -0.93534,1.603521 -0.40091,1.252827 -0.56809,2.238187 -0.55139,3.207037 0.0167,0.96885 0.20034,4.39337 2.22157,5.74642 2.02123,1.35305 4.89454,0.5677 5.8968,-0.33435 1.00226,-0.90203 2.30498,-2.7394 2.38848,-5.51232 0.0835,-2.772923 -0.15017,-2.923148 -0.68471,-4.175974 -0.53454,-1.252826 -1.50327,-2.054653 -1.50327,-2.054653 0,0 1.58685,-0.384227 3.04013,-0.100254 1.45328,0.283976 2.37171,1.871158 2.80603,3.007054 0.43431,1.135897 0.16736,3.607867 -0.75138,4.910807 -0.91874,1.30294 -2.48925,1.06919 -2.48925,1.06919 l -0.15038,3.1905 c 0,0 1.52033,0.05 2.1885,-0.35088 0.66818,-0.40091 2.25521,-1.2694 3.79201,-2.7895 1.53681,-1.52009 1.60367,-4.47688 0.81856,-7.032642 -0.7851,-2.555763 -2.50576,-3.624612 -4.35994,-4.393012 -1.85418,-0.7684 -3.575,-0.517798 -4.3434,-0.517798 -0.7684,0 -3.10659,0.667735 -3.64113,0.968415 -0.53454,0.300678 -1.23661,0.83561 -1.23661,0.83561 l -0.26717,-0.401011 -5.61258,-0.03359 -0.0253,-3.905705 6.89829,0.189135 0.0941,-3.401859 z m 3.68556,3.401343 3.44889,0.118338 -0.0475,3.685048 -3.42511,0.02377 z m -1.41748,6.756694 4.65346,0.02325 c 0,0 0.25986,4.606885 -0.33073,6.166035 -0.59059,1.55915 -2.3151,2.0551 -3.80338,1.9606 -1.48828,-0.0945 -3.2836,-0.61443 -3.87418,-2.26807 -0.59059,-1.65365 -0.14138,-2.83476 0.6382,-4.204919 0.77957,-1.370164 2.71663,-1.6769 2.71663,-1.6769 z m 15.166,0.637685 c 0,0 0.59074,0.212392 1.34668,0.87385 0.75595,0.661458 0.96849,1.22864 1.06299,2.26808 0.0945,1.03943 -0.37765,3.09483 -0.44855,3.33106 -0.0709,0.23624 -0.61458,1.51171 -1.63039,1.53531 -1.01582,0.0236 -1.37025,-0.80327 -1.74822,-1.58285 -0.37801,-0.77957 -0.30696,-1.48791 -0.30696,-2.50372 0,-1.01581 0.56697,-2.338955 0.82683,-2.929542 0.25985,-0.59059 0.89762,-0.992188 0.89762,-0.992188 z"
       id="path974"
       inkscape:connector-curvature="0" />
  </g>
</svg>
