<?xml version="1.0" standalone="no"?>
<!DOCTYPE svg PUBLIC "-//W3C//DTD SVG 1.1//EN" "http://www.w3.org/Graphics/SVG/1.1/DTD/svg11.dtd" >
<svg xmlns="http://www.w3.org/2000/svg" xmlns:xlink="http://www.w3.org/1999/xlink" version="1.1" viewBox="0 -410 2364 2048">
  <g transform="matrix(1 0 0 -1 0 1638)">
   <path fill="currentColor"
d="M1182 1970q302 12 544 -166l-56 -78q-250 184 -556 140q-258 -34 -464 -228q-188 -174 -284 -442q-162 -454 28 -846q112 -234 338 -388q216 -146 486 -182q208 -30 392 18q200 52 338 184q122 114 168 264q48 158 0 306q-30 96 -96 164q-66 72 -156 98q-122 34 -236 -26
q-14 -42 -32 -74q-54 -96 -152 -152q-28 -14 -54 6q-24 20 -16 50q42 148 170 234q8 36 6 68q-2 84 -48 154t-122 106q-94 46 -200 24q-102 -20 -180 -98q-150 -146 -108 -350l-94 -18q-52 256 134 438q98 96 228 124q138 26 262 -32q100 -48 160 -140q62 -94 66 -206
q0 8 -2 -20q122 40 244 4q116 -32 202 -124q78 -84 116 -200q56 -178 0 -364q-54 -174 -192 -306q-156 -150 -382 -208q-202 -52 -430 -20q-292 38 -526 198q-248 168 -372 426q-206 428 -30 920q102 290 308 482q228 212 516 252q42 6 82 8z" />
  </g>

</svg>
