<?xml version="1.0" encoding="UTF-8" standalone="no"?>
<!-- Created with Inkscape (http://www.inkscape.org/) -->

<svg
   xmlns:dc="http://purl.org/dc/elements/1.1/"
   xmlns:cc="http://creativecommons.org/ns#"
   xmlns:rdf="http://www.w3.org/1999/02/22-rdf-syntax-ns#"
   xmlns:svg="http://www.w3.org/2000/svg"
   xmlns="http://www.w3.org/2000/svg"
   xmlns:sodipodi="http://sodipodi.sourceforge.net/DTD/sodipodi-0.dtd"
   xmlns:inkscape="http://www.inkscape.org/namespaces/inkscape"
   width="1.0515234mm"
   height="0.75546348mm"
   viewBox="0 0 1.0515234 0.75546348"
   version="1.1"
   id="svg2751"
   inkscape:version="0.92.4 (unknown)"
   sodipodi:docname="துவரை.svg">
  <defs
     id="defs2745" />
  <sodipodi:namedview
     id="base"
     pagecolor="#ffffff"
     bordercolor="#666666"
     borderopacity="1.0"
     inkscape:pageopacity="0.0"
     inkscape:pageshadow="2"
     inkscape:zoom="256"
     inkscape:cx="1.987116"
     inkscape:cy="1.427645"
     inkscape:document-units="mm"
     inkscape:current-layer="layer1"
     showgrid="false"
     fit-margin-top="0"
     fit-margin-left="0"
     fit-margin-right="0"
     fit-margin-bottom="0"
     inkscape:window-width="1920"
     inkscape:window-height="1017"
     inkscape:window-x="0"
     inkscape:window-y="30"
     inkscape:window-maximized="1" />
  <metadata
     id="metadata2748">
    <rdf:RDF>
      <cc:Work
         rdf:about="">
        <dc:format>image/svg+xml</dc:format>
        <dc:type
           rdf:resource="http://purl.org/dc/dcmitype/StillImage" />
        <dc:title></dc:title>
      </cc:Work>
    </rdf:RDF>
  </metadata>
  <g
     inkscape:label="Layer 1"
     inkscape:groupmode="layer"
     id="layer1"
     transform="translate(135.84123,-230.85441)">
    <g
       transform="matrix(0.35277777,0,0,0.35277777,-215.56901,73.924519)"
       id="g1291"
       style="fill:#211e1e;fill-opacity:1">
      <g
         id="use1289"
         transform="matrix(0.26458333,0,0,0.26458333,226,446.29999)">
        <path
           inkscape:connector-curvature="0"
           id="path2763"
           d="M 11.265625,0.0625 9.921875,-1.859375 H 9 L 7.65625,0.171875 H 6.421875 c 0.109375,-0.4375 0.25,-0.828125 0.25,-1.234375 0,-1.09375 -0.59375,-2.34375 -1.796875,-2.34375 H 3.96875 v -1.265625 h 1.734375 v -0.84375 H 1.125 V -3.28125 C 0.453125,-3.03125 0,-2.421875 0,-1.6875 c 0,1.21875 1,1.78125 2.046875,1.78125 0.984375,0 1.921875,-0.671875 1.921875,-1.578125 V -2.59375 h 0.515625 c 0.84375,0 1.265625,0.671875 1.265625,1.46875 0,0.546875 -0.109375,0.90625 -0.265625,1.328125 h -4.09375 c -0.671875,0 -1.375,0.265625 -1.375,0.921875 0,0.984375 1.359375,1.453125 2.34375,1.453125 1.453125,0 2.9375,-0.59375 3.65625,-1.609375 H 8.15625 l 1.328125,-2.03125 0.75,1.125 z M 2.96875,-3.390625 H 2.078125 V -4.65625 H 2.96875 Z M 3,-1.703125 c 0,0.5625 -0.3125,0.96875 -0.9375,0.96875 -0.625,0 -1.078125,-0.390625 -1.078125,-0.921875 0,-0.609375 0.46875,-0.921875 0.921875,-0.921875 H 3 Z m 1.75,2.71875 C 4.109375,1.4375 3.4375,1.75 2.5625,1.75 1.921875,1.75 1.015625,1.578125 1.015625,1.28125 c 0,-0.140625 0.0625,-0.265625 0.203125,-0.265625 z m 0,0"
           style="stroke:none" />
      </g>
    </g>
  </g>
</svg>
