<?xml version="1.0" encoding="UTF-8" standalone="no"?>
<!-- Created with Inkscape (http://www.inkscape.org/) -->

<svg
   xmlns:dc="http://purl.org/dc/elements/1.1/"
   xmlns:cc="http://creativecommons.org/ns#"
   xmlns:rdf="http://www.w3.org/1999/02/22-rdf-syntax-ns#"
   xmlns:svg="http://www.w3.org/2000/svg"
   xmlns="http://www.w3.org/2000/svg"
   xmlns:sodipodi="http://sodipodi.sourceforge.net/DTD/sodipodi-0.dtd"
   xmlns:inkscape="http://www.inkscape.org/namespaces/inkscape"
   width="27.464991mm"
   height="21.323244mm"
   viewBox="0 0 27.464991 21.323244"
   version="1.1"
   id="svg6574"
   inkscape:version="0.92.3 (2405546, 2018-03-11)"
   sodipodi:docname="7.svg">
  <defs
     id="defs6568" />
  <sodipodi:namedview
     id="base"
     pagecolor="#ffffff"
     bordercolor="#666666"
     borderopacity="1.0"
     inkscape:pageopacity="0.0"
     inkscape:pageshadow="2"
     inkscape:zoom="0.35"
     inkscape:cx="1240.4738"
     inkscape:cy="-242.56125"
     inkscape:document-units="mm"
     inkscape:current-layer="layer1"
     showgrid="false"
     fit-margin-top="0"
     fit-margin-left="0"
     fit-margin-right="0"
     fit-margin-bottom="0"
     inkscape:window-width="1366"
     inkscape:window-height="705"
     inkscape:window-x="0"
     inkscape:window-y="30"
     inkscape:window-maximized="1" />
  <metadata
     id="metadata6571">
    <rdf:RDF>
      <cc:Work
         rdf:about="">
        <dc:format>image/svg+xml</dc:format>
        <dc:type
           rdf:resource="http://purl.org/dc/dcmitype/StillImage" />
        <dc:title></dc:title>
      </cc:Work>
    </rdf:RDF>
  </metadata>
  <g
     inkscape:label="Layer 1"
     inkscape:groupmode="layer"
     id="layer1"
     transform="translate(222.37536,-63.332426)">
    <path
       inkscape:connector-curvature="0"
       style="fill:none;stroke:#000000;stroke-width:0.26458332px;stroke-linecap:butt;stroke-linejoin:miter;stroke-opacity:1"
       d="m -212.49471,63.464763 c 0,0 -1.59831,0.06905 -2.77968,0.416512 -1.18136,0.34746 -2.15415,0.764821 -3.68298,2.224154 -1.52882,1.459332 -2.3625,2.709931 -2.98793,5.628596 -0.62543,2.918666 -0.0698,5.906617 -0.0698,5.906617 0,0 0.69479,3.75265 2.08463,4.656046 1.38984,0.903396 3.05805,2.293644 5.00383,2.224154 1.94577,-0.06949 3.82183,-0.347869 5.7676,-2.224154 1.94578,-1.876284 1.73761,-4.308468 1.66812,-5.42034 -0.0695,-1.111873 -0.97294,-4.308147 -3.0577,-5.072559 -2.08476,-0.764413 -4.03055,-0.695217 -5.69836,-0.208773 -1.66781,0.486444 -2.57142,2.501656 -2.57142,2.501656 0,0 -0.13873,-0.764371 -0.0692,-1.181323 0.0695,-0.416952 0.34715,-1.945602 1.11156,-3.265951 0.76441,-1.320348 1.39003,-1.667971 2.43241,-2.2934 1.04238,-0.625428 4.37802,-0.903304 4.37802,-0.903304 l 7.08794,0.06925 -0.41702,17.720883 3.68349,0.208256 0.20826,-17.859375 5.14232,0.208256 0.20877,-3.057695 z m -1.80661,10.979692 a 3.474602,3.613586 0 0 1 3.47472,3.613216 3.474602,3.613586 0 0 1 -3.47472,3.613733 3.474602,3.613586 0 0 1 -3.47472,-3.613733 3.474602,3.613586 0 0 1 3.47472,-3.613216 z"
       id="path5749" />
  </g>
</svg>
