<?xml version="1.0" encoding="UTF-8" standalone="no"?>
<!-- Created with Inkscape (http://www.inkscape.org/) -->

<svg
   xmlns:dc="http://purl.org/dc/elements/1.1/"
   xmlns:cc="http://creativecommons.org/ns#"
   xmlns:rdf="http://www.w3.org/1999/02/22-rdf-syntax-ns#"
   xmlns:svg="http://www.w3.org/2000/svg"
   xmlns="http://www.w3.org/2000/svg"
   xmlns:sodipodi="http://sodipodi.sourceforge.net/DTD/sodipodi-0.dtd"
   xmlns:inkscape="http://www.inkscape.org/namespaces/inkscape"
   width="1.2386729mm"
   height="0.57607734mm"
   viewBox="0 0 1.2386729 0.57607734"
   version="1.1"
   id="svg2622"
   inkscape:version="0.92.4 (unknown)"
   sodipodi:docname="கேழ்வரகு.svg">
  <defs
     id="defs2616" />
  <sodipodi:namedview
     id="base"
     pagecolor="#ffffff"
     bordercolor="#666666"
     borderopacity="1.0"
     inkscape:pageopacity="0.0"
     inkscape:pageshadow="2"
     inkscape:zoom="256"
     inkscape:cx="2.3407993"
     inkscape:cy="1.0886498"
     inkscape:document-units="mm"
     inkscape:current-layer="layer1"
     showgrid="false"
     fit-margin-top="0"
     fit-margin-left="0"
     fit-margin-right="0"
     fit-margin-bottom="0"
     inkscape:window-width="1920"
     inkscape:window-height="1017"
     inkscape:window-x="0"
     inkscape:window-y="30"
     inkscape:window-maximized="1" />
  <metadata
     id="metadata2619">
    <rdf:RDF>
      <cc:Work
         rdf:about="">
        <dc:format>image/svg+xml</dc:format>
        <dc:type
           rdf:resource="http://purl.org/dc/dcmitype/StillImage" />
        <dc:title></dc:title>
      </cc:Work>
    </rdf:RDF>
  </metadata>
  <g
     inkscape:label="Layer 1"
     inkscape:groupmode="layer"
     id="layer1"
     transform="translate(11.958622,-71.438152)">
    <g
       transform="matrix(0.35277777,0,0,0.35277777,-91.68296,-73.639872)"
       id="g1261"
       style="fill:#211e1e;fill-opacity:1">
      <g
         id="use1257"
         transform="matrix(0.26458333,0,0,0.26458333,226,412.70001)">
        <path
           inkscape:connector-curvature="0"
           id="path2638"
           d=""
           style="stroke:none" />
      </g>
      <g
         id="use1259"
         transform="matrix(0.26458333,0,0,0.26458333,225.99159,412.70001)">
        <path
           inkscape:connector-curvature="0"
           id="path2642"
           d="M 13.265625,0.671875 V -0.28125 H 11.53125 c 0.140625,-0.375 0.375,-0.640625 0.375,-1.09375 0,-0.9375 -0.921875,-1.78125 -1.96875,-1.546875 C 9.5,-3.265625 8.90625,-3.5625 8.375,-3.5625 H 7.046875 V -4.640625 H 8.9375 V -5.5 H 4.109375 v 0.953125 C 3.8125,-4.859375 3.4375,-5.109375 2.921875,-5.234375 1.6875,-5.578125 0.40625,-5.3125 0.046875,-3.96875 -0.15625,-3.21875 0.25,-2.546875 1.03125,-2.3125 1.765625,-2.125 2.484375,-2.453125 2.671875,-3.109375 2.828125,-3.71875 2.484375,-4.4375 1.734375,-4.4375 c 0.328125,-0.171875 0.625,-0.078125 0.953125,0 0.671875,0.1875 1.015625,0.59375 1.234375,1.125 -0.59375,0.359375 -0.9375,1.09375 -0.9375,1.625 0,1.234375 0.984375,1.828125 2.0625,1.828125 1.390625,0 2.03125,-0.703125 2.03125,-1.96875 V -2.75 h 1.46875 c 0.1875,0 0.203125,0.109375 0.1875,0.203125 -0.5625,0.109375 -0.90625,0.59375 -0.90625,1.171875 0,0.640625 0.609375,1.0625 1.4375,1.0625 0.875,0 1.171875,-0.796875 1.171875,-1.734375 0.421875,0.09375 0.625,0.484375 0.625,0.921875 0,0.625 -0.671875,0.875 -1.171875,1.03125 V 0.671875 Z M 6.125,-3.578125 H 5.046875 V -4.65625 H 6.125 Z M 1.8125,-3.3125 c -0.078125,0.25 -0.359375,0.421875 -0.59375,0.359375 -0.28125,-0.09375 -0.4375,-0.375 -0.375,-0.625 C 0.9375,-3.84375 1.140625,-4 1.453125,-3.9375 1.734375,-3.875 1.84375,-3.578125 1.8125,-3.3125 Z m 4.265625,1.578125 c 0,0.609375 -0.328125,0.9375 -0.9375,0.9375 -0.5625,0 -1.171875,-0.34375 -1.171875,-0.890625 0,-0.8125 0.59375,-1.0625 1.109375,-1.0625 h 1 z M 9.46875,-2 C 9.734375,-1.53125 9.296875,-0.734375 8.828125,-1.078125 8.1875,-1.5625 9.046875,-2.09375 9.46875,-2 Z m 0,0"
           style="stroke:none" />
      </g>
    </g>
  </g>
</svg>
