<?xml version="1.0" encoding="UTF-8" standalone="no"?>
<!-- Created with Inkscape (http://www.inkscape.org/) -->

<svg
   xmlns:dc="http://purl.org/dc/elements/1.1/"
   xmlns:cc="http://creativecommons.org/ns#"
   xmlns:rdf="http://www.w3.org/1999/02/22-rdf-syntax-ns#"
   xmlns:svg="http://www.w3.org/2000/svg"
   xmlns="http://www.w3.org/2000/svg"
   xmlns:sodipodi="http://sodipodi.sourceforge.net/DTD/sodipodi-0.dtd"
   xmlns:inkscape="http://www.inkscape.org/namespaces/inkscape"
   width="0.97878349mm"
   height="1.181753mm"
   viewBox="0 0 0.97878349 1.181753"
   version="1.1"
   id="svg8"
   inkscape:version="0.92.4 (unknown)"
   sodipodi:docname="கால்வீசம்.svg">
  <defs
     id="defs2" />
  <sodipodi:namedview
     id="base"
     pagecolor="#ffffff"
     bordercolor="#666666"
     borderopacity="1.0"
     inkscape:pageopacity="0.0"
     inkscape:pageshadow="2"
     inkscape:zoom="64"
     inkscape:cx="-3.8246326"
     inkscape:cy="4.0688008"
     inkscape:document-units="mm"
     inkscape:current-layer="layer1"
     showgrid="false"
     fit-margin-top="0"
     fit-margin-left="0"
     fit-margin-right="0"
     fit-margin-bottom="0"
     inkscape:window-width="1920"
     inkscape:window-height="1017"
     inkscape:window-x="0"
     inkscape:window-y="30"
     inkscape:window-maximized="1" />
  <metadata
     id="metadata5">
    <rdf:RDF>
      <cc:Work
         rdf:about="">
        <dc:format>image/svg+xml</dc:format>
        <dc:type
           rdf:resource="http://purl.org/dc/dcmitype/StillImage" />
        <dc:title></dc:title>
      </cc:Work>
    </rdf:RDF>
  </metadata>
  <g
     inkscape:label="Layer 1"
     inkscape:groupmode="layer"
     id="layer1"
     transform="translate(-118.78558,-514.18886)">
    <g
       transform="translate(224.7389,369.8292)"
       id="layer1-5"
       inkscape:label="Layer 1">
      <g
         style="fill:#211e1e;fill-opacity:1"
         id="g779"
         transform="matrix(0.35277777,0,0,0.35277777,-134.07349,22.548974)">
        <g
           transform="matrix(0.26458333,0,0,0.26458333,78.040001,347.89999)"
           id="use777" />
      </g>
      <g
         style="fill:#211e1e;fill-opacity:1"
         id="g783"
         transform="matrix(0.35277777,0,0,0.35277777,-135.72783,22.548974)">
        <g
           transform="matrix(0.26458333,0,0,0.26458333,84.4002,347.89999)"
           id="use781" />
      </g>
    </g>
    <g
       transform="translate(295.10643,246.33362)"
       id="layer1-56"
       inkscape:label="Layer 1">
      <g
         style="fill:#211e1e;fill-opacity:1"
         id="g1205"
         transform="matrix(0.35277777,0,0,0.35277777,-256.65952,146.66619)">
        <g
           transform="matrix(0.26458333,0,0,0.26458333,226,345.5)"
           id="use1203">
          <path
             id="path2429"
             style="stroke:none"
             d="m 11.902928,-6.5 c 0.405512,0 0.987697,0.21875 0.987697,0.9375 0,0.53125 -0.28125,0.875 -0.546875,1.3125 h 4.6875 v -0.90625 h -3.390625 c 0.07813,-0.234375 0.07813,-0.359375 0.07813,-0.59375 0,-0.8125 -0.88755,-1.703125 -1.873155,-1.703125 -1.000916,0 -1.766094,0.5501013 -1.777167,1.7869628 -0.01107,1.2368615 2.445251,4.5613927 2.445251,6.8270177 0,1.546875 -0.515625,3.140625 -1.96875,3.140625 -1.0625004,0 -2.0000004,-0.59375 -2.0000004,-1.59375 0,-1.515625 1.7968754,-2.28125004 1.7968754,-3.859375 0,-1.1875 -0.4531254,-1.984375 -1.9375004,-1.984375 -0.984375,0 -1.859375,0.75 -1.859375,1.71875 0,1.17187496 0.984375,1.82812496 2.140625,1.79687496 -0.546875,0.62500004 -1.140625,1.23437504 -1.140625,2.35937504 0,1.359375 1.296875,2.46875 2.7968754,2.46875 1.84375,0 3.046875,-1.609375 3.046875,-3.671875 -0.12187,-2.33534094 -2.45266,-6.2047192 -2.45266,-7.0470514 C 10.936024,-6.353528 11.401083,-6.5 11.902928,-6.5 Z m -2.4673694,5.0671055 c 0,0.46874996 -0.484375,0.87499996 -0.96875,0.87499996 -0.484375,0 -0.890625,-0.40625 -0.890625,-0.87499996 0,-0.5 0.40625,-0.90625 0.890625,-0.90625 0.484375,0 0.96875,0.40625 0.96875,0.90625 z"
             inkscape:connector-curvature="0"
             sodipodi:nodetypes="ssccccsczsssssscssczssssss" />
        </g>
      </g>
    </g>
  </g>
</svg>
