<?xml version="1.0" encoding="UTF-8" standalone="no"?>
<!-- Created with Inkscape (http://www.inkscape.org/) -->

<svg
   xmlns:dc="http://purl.org/dc/elements/1.1/"
   xmlns:cc="http://creativecommons.org/ns#"
   xmlns:rdf="http://www.w3.org/1999/02/22-rdf-syntax-ns#"
   xmlns:svg="http://www.w3.org/2000/svg"
   xmlns="http://www.w3.org/2000/svg"
   xmlns:sodipodi="http://sodipodi.sourceforge.net/DTD/sodipodi-0.dtd"
   xmlns:inkscape="http://www.inkscape.org/namespaces/inkscape"
   width="0.8385936mm"
   height="0.71316922mm"
   viewBox="0 0 0.8385936 0.71316922"
   version="1.1"
   id="svg1295"
   inkscape:version="0.92.4 (unknown)"
   sodipodi:docname="கம்svg.svg">
  <defs
     id="defs1289" />
  <sodipodi:namedview
     id="base"
     pagecolor="#ffffff"
     bordercolor="#666666"
     borderopacity="1.0"
     inkscape:pageopacity="0.0"
     inkscape:pageshadow="2"
     inkscape:zoom="256"
     inkscape:cx="1.5847455"
     inkscape:cy="1.3477178"
     inkscape:document-units="mm"
     inkscape:current-layer="layer1"
     showgrid="false"
     fit-margin-top="0"
     fit-margin-left="0"
     fit-margin-right="0"
     fit-margin-bottom="0"
     inkscape:window-width="1920"
     inkscape:window-height="1017"
     inkscape:window-x="0"
     inkscape:window-y="30"
     inkscape:window-maximized="1" />
  <metadata
     id="metadata1292">
    <rdf:RDF>
      <cc:Work
         rdf:about="">
        <dc:format>image/svg+xml</dc:format>
        <dc:type
           rdf:resource="http://purl.org/dc/dcmitype/StillImage" />
        <dc:title></dc:title>
      </cc:Work>
    </rdf:RDF>
  </metadata>
  <g
     inkscape:label="Layer 1"
     inkscape:groupmode="layer"
     id="layer1"
     transform="translate(79.794298,-117.4827)">
    <g
       transform="matrix(0.35277777,0,0,0.35277777,-296.30106,66.977345)"
       id="g1679"
       style="fill:#211e1e;fill-opacity:1">
      <g
         id="use1677"
         transform="matrix(0.26458333,0,0,0.26458333,613.71997,144.62)">
        <path
           inkscape:connector-curvature="0"
           id="path1307"
           d="m 8.984375,-1 c 0,-0.84375 -0.328125,-1.890625 -0.65625,-2.515625 h -1.0625 c 0.390625,0.546875 0.75,1.515625 0.75,2.546875 0,1.578125 -0.40625,2.15625 -1.265625,2.15625 -0.421875,0 -0.625,-0.5625 -0.625,-0.984375 0,-0.546875 0.546875,-1.1875 0.546875,-1.953125 0,-0.828125 -0.546875,-1.796875 -1.71875,-1.796875 H 4.109375 V -4.6875 h 1.90625 V -5.5 h -4.875 v 2.109375 C 0.46875,-3.046875 0,-2.5 0,-1.734375 0,-0.515625 0.75,0.0625 2.0625,0.0625 3.359375,0.0625 4.125,-0.46875 4.125,-2 v -0.671875 h 0.71875 c 0.46875,0 0.796875,0.453125 0.796875,0.859375 0,0.71875 -0.4375,1.234375 -0.4375,1.96875 0,1.078125 0.671875,1.984375 1.734375,1.984375 1.4375,0 2.046875,-1.3125 2.046875,-3.140625 z M 3.140625,-3.5 H 2.0625 v -1.1875 h 1.078125 z m 0,1.703125 c 0,0.671875 -0.421875,1.03125 -1.03125,1.03125 C 1.546875,-0.765625 1,-1.140625 1,-1.6875 1,-2.484375 1.546875,-2.671875 2.046875,-2.671875 h 1.09375 z m 0,0"
           style="stroke:none" />
      </g>
    </g>
  </g>
</svg>
