<?xml version="1.0" encoding="UTF-8" standalone="no"?>
<!-- Created with Inkscape (http://www.inkscape.org/) -->

<svg
   xmlns:dc="http://purl.org/dc/elements/1.1/"
   xmlns:cc="http://creativecommons.org/ns#"
   xmlns:rdf="http://www.w3.org/1999/02/22-rdf-syntax-ns#"
   xmlns:svg="http://www.w3.org/2000/svg"
   xmlns="http://www.w3.org/2000/svg"
   xmlns:sodipodi="http://sodipodi.sourceforge.net/DTD/sodipodi-0.dtd"
   xmlns:inkscape="http://www.inkscape.org/namespaces/inkscape"
   width="2.2115748mm"
   height="1.108402mm"
   viewBox="0 0 2.2115748 1.108402"
   version="1.1"
   id="svg3085"
   inkscape:version="0.92.4 (unknown)"
   sodipodi:docname="மானியம்.svg">
  <defs
     id="defs3079" />
  <sodipodi:namedview
     id="base"
     pagecolor="#ffffff"
     bordercolor="#666666"
     borderopacity="1.0"
     inkscape:pageopacity="0.0"
     inkscape:pageshadow="2"
     inkscape:zoom="39.898527"
     inkscape:cx="17.122505"
     inkscape:cy="6.521379"
     inkscape:document-units="mm"
     inkscape:current-layer="layer1"
     showgrid="false"
     fit-margin-top="0"
     fit-margin-left="0"
     fit-margin-right="0"
     fit-margin-bottom="0"
     inkscape:window-width="1920"
     inkscape:window-height="1017"
     inkscape:window-x="0"
     inkscape:window-y="30"
     inkscape:window-maximized="1" />
  <metadata
     id="metadata3082">
    <rdf:RDF>
      <cc:Work
         rdf:about="">
        <dc:format>image/svg+xml</dc:format>
        <dc:type
           rdf:resource="http://purl.org/dc/dcmitype/StillImage" />
        <dc:title></dc:title>
      </cc:Work>
    </rdf:RDF>
  </metadata>
  <g
     inkscape:label="Layer 1"
     inkscape:groupmode="layer"
     id="layer1"
     transform="translate(54.327553,-219.33865)">
    <g
       style="fill:#211e1e;fill-opacity:1"
       transform="matrix(0.09333912,0,0,0.09333912,-54.327553,219.96723)"
       id="use1397">
      <path
         style="stroke:none"
         d="M 13.84375,-3.09375 V -4.0625 h -2.171875 c 0.109375,-1.1875 -0.828125,-2.171875 -2.1875,-1.640625 -0.3125,-0.765625 -1,-1.03125 -1.71875,-1.03125 -0.96875,0 -1.484375,0.421875 -1.890625,1.25 H 3.546875 v 4.5625 H 0.96875 V -5.40625 H 0 V 0 h 4.78125 c 1.8125,0 3.03125,-1.078125 3.03125,-2.78125 0,-1.1875 -0.46875,-2 -1.015625,-2.3125 0.140625,-0.46875 0.53125,-0.703125 0.984375,-0.703125 0.75,0 1,0.75 1.15625,1.53125 0.15625,-0.3125 0.46875,-0.6875 0.9375,-0.6875 0.65625,0 0.875,0.421875 0.875,1.03125 0,0.375 -0.203125,0.578125 -0.421875,0.828125 z M 6.890625,-2.875 c 0,1.265625 -0.71875,1.9375 -1.703125,1.9375 H 4.578125 v -3.640625 h 1 c 0.921875,0 1.3125,0.90625 1.3125,1.703125 z m 0,0"
         id="path3101"
         inkscape:connector-curvature="0" />
    </g>
    <g
       style="fill:#211e1e;fill-opacity:1"
       transform="matrix(0.09333912,0,0,0.09333912,-53.020201,219.96723)"
       id="use1399">
      <path
         style="stroke:none"
         d="M 9.6875,0.203125 V -5.5 h -0.875 v 5.640625 c 0,0.6875 -0.53125,0.953125 -1.265625,1.1875 v -6.78125 H 6.578125 V -0.90625 H 3.28125 v -4.5 H 2.3125 v 2.984375 C 2.3125,-1.84375 1.953125,-0.96875 1.375,-0.96875 1.140625,-0.96875 1,-1.03125 1,-1.4375 V -5.421875 H 0 v 4.75 c 0,0.515625 0.46875,0.890625 0.984375,0.890625 0.5,0 0.8125,-0.21875 1.21875,-0.546875 v 0.375 h 4.375 v 1.5625 C 4.984375,2.09375 3.15625,2.6875 3.15625,4 c 0,0.71875 0.609375,1.140625 1.328125,1.140625 1.46875,0 2.84375,-1.171875 3.03125,-2.8125 C 8.6875,1.953125 9.6875,1.375 9.6875,0.203125 Z M 6.5,2.625 C 6.234375,3.546875 5.328125,4.28125 4.78125,4.28125 c -0.25,0 -0.5,-0.125 -0.5,-0.3125 0,-0.6875 1.046875,-1 2.21875,-1.34375 z m 0,0"
         id="path3105"
         inkscape:connector-curvature="0" />
    </g>
  </g>
</svg>
