<?xml version="1.0" encoding="UTF-8" standalone="no"?>
<!-- Created with Inkscape (http://www.inkscape.org/) -->

<svg
   xmlns:dc="http://purl.org/dc/elements/1.1/"
   xmlns:cc="http://creativecommons.org/ns#"
   xmlns:rdf="http://www.w3.org/1999/02/22-rdf-syntax-ns#"
   xmlns:svg="http://www.w3.org/2000/svg"
   xmlns="http://www.w3.org/2000/svg"
   xmlns:sodipodi="http://sodipodi.sourceforge.net/DTD/sodipodi-0.dtd"
   xmlns:inkscape="http://www.inkscape.org/namespaces/inkscape"
   width="0.83421838mm"
   height="0.52794939mm"
   viewBox="0 0 0.83421838 0.52794939"
   version="1.1"
   id="svg2681"
   inkscape:version="0.92.4 (unknown)"
   sodipodi:docname="எள்ளு.svg">
  <defs
     id="defs2675" />
  <sodipodi:namedview
     id="base"
     pagecolor="#ffffff"
     bordercolor="#666666"
     borderopacity="1.0"
     inkscape:pageopacity="0.0"
     inkscape:pageshadow="2"
     inkscape:zoom="256"
     inkscape:cx="1.5764757"
     inkscape:cy="0.99771073"
     inkscape:document-units="mm"
     inkscape:current-layer="layer1"
     showgrid="false"
     fit-margin-top="0"
     fit-margin-left="0"
     fit-margin-right="0"
     fit-margin-bottom="0"
     inkscape:window-width="1920"
     inkscape:window-height="1017"
     inkscape:window-x="0"
     inkscape:window-y="30"
     inkscape:window-maximized="1" />
  <metadata
     id="metadata2678">
    <rdf:RDF>
      <cc:Work
         rdf:about="">
        <dc:format>image/svg+xml</dc:format>
        <dc:type
           rdf:resource="http://purl.org/dc/dcmitype/StillImage" />
        <dc:title></dc:title>
      </cc:Work>
    </rdf:RDF>
  </metadata>
  <g
     inkscape:label="Layer 1"
     inkscape:groupmode="layer"
     id="layer1"
     transform="translate(-47.963843,-315.63484)">
    <g
       transform="matrix(0.35277777,0,0,0.35277777,-31.763933,164.63015)"
       id="g1279"
       style="fill:#211e1e;fill-opacity:1">
      <g
         id="use1277"
         transform="matrix(0.26458333,0,0,0.26458333,226,429.5)">
        <path
           inkscape:connector-curvature="0"
           id="path2693"
           d="m 8.9375,-1.171875 v -0.9375 c -0.75,0.015625 -1.359375,0.34375 -1.609375,0.890625 -0.15625,-0.59375 -1.09375,-1 -1.625,-0.9375 v -2.5 h 1.03125 V -5.5 H 3.125 C 1.609375,-5.5 0,-4.828125 0,-2.59375 c 0,1.65625 0.734375,2.75 2.046875,2.75 1.09375,0 1.921875,-0.6875 1.921875,-1.84375 0,-0.9375 -0.484375,-1.75 -1.640625,-1.75 -0.59375,0 -0.9375,0.1875 -1.40625,0.609375 C 1.09375,-4.3125 2.0625,-4.625 2.671875,-4.625 H 4.78125 V 0 h 0.875 v -1.28125 c 0.75,-0.046875 1.0625,0.375 1.125,1.328125 H 7.671875 C 7.578125,-0.875 8.328125,-1.171875 8.9375,-1.171875 Z m -5.890625,-0.375 c 0,0.484375 -0.421875,0.890625 -0.90625,0.890625 -0.5,0 -0.921875,-0.40625 -0.921875,-0.890625 0,-0.515625 0.421875,-0.9375 0.921875,-0.9375 0.484375,0 0.90625,0.421875 0.90625,0.9375 z m 0,0"
           style="stroke:none" />
      </g>
    </g>
  </g>
</svg>
