<?xml version="1.0" standalone="no"?>
<!DOCTYPE svg PUBLIC "-//W3C//DTD SVG 1.1//EN" "http://www.w3.org/Graphics/SVG/1.1/DTD/svg11.dtd" >
<svg xmlns="http://www.w3.org/2000/svg" xmlns:xlink="http://www.w3.org/1999/xlink" version="1.1" viewBox="0 -324 725 1024">
  <g transform="matrix(1 0 0 -1 0 700)">
   <path fill="currentColor"
d="M111 344q0 -26 17.5 -43.5t43.5 -17.5t44 17.5t18 43.5q0 31 -18 52.5t-44 21.5t-43.5 -21.5t-17.5 -52.5zM61 356q0 61 61.5 104.5t147.5 43.5q102 0 174 -58t72 -139q0 -76 -61.5 -130t-147.5 -54h-135q-21 0 -35 -11t-14 -26t14 -26t35 -11h492v-49h-492q-45 0 -78 25
t-33 61t33 61t78 25h135q61 0 104.5 39.5t43.5 95.5q0 61 -54 104.5t-131 43.5h-73q39 -14 62.5 -44.5t23.5 -66.5q0 -45 -32.5 -77.5t-78.5 -32.5q-45 0 -78 36t-33 86z" />
  </g>

</svg>
