<?xml version="1.0" standalone="no"?>
<!DOCTYPE svg PUBLIC "-//W3C//DTD SVG 1.1//EN" "http://www.w3.org/Graphics/SVG/1.1/DTD/svg11.dtd" >
<svg xmlns="http://www.w3.org/2000/svg" xmlns:xlink="http://www.w3.org/1999/xlink" version="1.1" viewBox="0 -410 1356 2048">
  <g transform="matrix(1 0 0 -1 0 1638)">
   <path fill="currentColor"
d="M1256 984h-124v-540q0 -140 -94 -240q-94 -98 -228 -98h-264q-134 0 -228 98q-94 100 -94 240v540h-124v-554q0 -178 120 -304q118 -126 288 -126h340q170 0 288 126q120 126 120 304v554z" />
  </g>

</svg>
