<?xml version="1.0" standalone="no"?>
<!DOCTYPE svg PUBLIC "-//W3C//DTD SVG 1.1//EN" "http://www.w3.org/Graphics/SVG/1.1/DTD/svg11.dtd" >
<svg xmlns="http://www.w3.org/2000/svg" xmlns:xlink="http://www.w3.org/1999/xlink" version="1.1" viewBox="0 -324 759 1024">
  <g transform="matrix(1 0 0 -1 0 700)">
   <path fill="currentColor"
d="M219 443v-173h123v173h-123zM96 160q0 -50 39.5 -86.5t95.5 -36.5q45 0 78 29t33 69v86h-185q-26 0 -43.5 -17.5t-17.5 -43.5zM34 160q0 45 36.5 77.5t86.5 32.5v222h418v-49h-172v-173h246v-49h-88v-86q15 17 37.5 27q22.458 10.083 44.497 10.083q2.003 0 4.003 -0.083
q57 -2.5 96 -49t39 -111q0 -71 -68 -121.5t-165 -50.5h-345q-41 0 -69.5 -36t-28.5 -87h-49q0 72.5 43 123q41.76 49.043 100.496 49.043q1.744 0 3.504 -0.043h345q71 0 121.5 36.5t50.5 86.5q0 45 -21.5 78t-52.5 33q-30 0 -54 -19t-32 -49v-55h-62v221h-96v-86
q0 -61 -50.5 -104t-121.5 -43q-81 0 -139 50.5t-58 121.5z" />
  </g>

</svg>
