<?xml version="1.0" encoding="UTF-8" standalone="no"?>
<!-- Created with Inkscape (http://www.inkscape.org/) -->

<svg
   xmlns:dc="http://purl.org/dc/elements/1.1/"
   xmlns:cc="http://creativecommons.org/ns#"
   xmlns:rdf="http://www.w3.org/1999/02/22-rdf-syntax-ns#"
   xmlns:svg="http://www.w3.org/2000/svg"
   xmlns="http://www.w3.org/2000/svg"
   xmlns:sodipodi="http://sodipodi.sourceforge.net/DTD/sodipodi-0.dtd"
   xmlns:inkscape="http://www.inkscape.org/namespaces/inkscape"
   width="0.88234633mm"
   height="0.52065724mm"
   viewBox="0 0 0.88234633 0.52065724"
   version="1.1"
   id="svg2710"
   inkscape:version="0.92.4 (unknown)"
   sodipodi:docname="9.svg">
  <defs
     id="defs2704" />
  <sodipodi:namedview
     id="base"
     pagecolor="#ffffff"
     bordercolor="#666666"
     borderopacity="1.0"
     inkscape:pageopacity="0.0"
     inkscape:pageshadow="2"
     inkscape:zoom="256"
     inkscape:cx="1.6674281"
     inkscape:cy="0.98393077"
     inkscape:document-units="mm"
     inkscape:current-layer="layer1"
     showgrid="false"
     fit-margin-top="0"
     fit-margin-left="0"
     fit-margin-right="0"
     fit-margin-bottom="0"
     inkscape:window-width="1920"
     inkscape:window-height="1017"
     inkscape:window-x="0"
     inkscape:window-y="30"
     inkscape:window-maximized="1" />
  <metadata
     id="metadata2707">
    <rdf:RDF>
      <cc:Work
         rdf:about="">
        <dc:format>image/svg+xml</dc:format>
        <dc:type
           rdf:resource="http://purl.org/dc/dcmitype/StillImage" />
        <dc:title></dc:title>
      </cc:Work>
    </rdf:RDF>
  </metadata>
  <g
     inkscape:label="Layer 1"
     inkscape:groupmode="layer"
     id="layer1"
     transform="translate(-102.36835,-376.11467)">
    <g
       transform="matrix(0.35277777,0,0,0.35277777,74.837573,289.4581)"
       id="g693"
       style="fill:#211e1e;fill-opacity:1">
      <g
         id="use691"
         transform="matrix(0.26458333,0,0,0.26458333,78.040001,247.10001)">
        <path
           inkscape:connector-curvature="0"
           id="path2722"
           d="m 9.453125,-1.90625 c 0,-1.53125 -0.96875,-2.15625 -2.3125,-2.15625 -0.5625,0 -0.90625,0.09375 -1.484375,0.40625 H 4.109375 V -4.671875 H 5.96875 v -0.84375 H 1.171875 v 1.96875 C 0.421875,-3.25 0,-2.46875 0,-1.75 0,-0.75 0.8125,0 2.09375,0 3.25,0 4.078125,-0.578125 4.078125,-1.578125 V -2.84375 H 4.875 c -0.28125,0.421875 -0.40625,0.890625 -0.40625,1.421875 0,0.765625 0.578125,1.484375 1.390625,1.484375 0.9375,0 1.546875,-1.0625 1.546875,-1.96875 0,-0.5 -0.3125,-0.96875 -0.609375,-1.265625 C 6.953125,-3.203125 7.0625,-3.1875 7.234375,-3.1875 7.9375,-3.1875 8.375,-2.671875 8.375,-2 c 0,0.78125 -0.625,1.09375 -0.984375,1.078125 v 0.96875 C 8.625,0.0625 9.453125,-0.75 9.453125,-1.90625 Z m -6.296875,-1.75 H 2.109375 V -4.671875 H 3.15625 Z M 3.125,-1.703125 c 0,0.46875 -0.46875,0.78125 -0.953125,0.828125 C 1.59375,-0.84375 1.03125,-1.28125 1.03125,-1.84375 c 0,-0.515625 0.359375,-1 0.875,-1 H 3.125 Z m 2.828125,0.875 c -0.75,-0.015625 -0.53125,-1.671875 -0.09375,-1.84375 0.671875,0.234375 0.5625,1.859375 0.09375,1.84375 z m 0,0"
           style="stroke:none" />
      </g>
    </g>
  </g>
</svg>
