<?xml version="1.0" encoding="UTF-8" standalone="no"?>
<!-- Created with Inkscape (http://www.inkscape.org/) -->

<svg
   xmlns:dc="http://purl.org/dc/elements/1.1/"
   xmlns:cc="http://creativecommons.org/ns#"
   xmlns:rdf="http://www.w3.org/1999/02/22-rdf-syntax-ns#"
   xmlns:svg="http://www.w3.org/2000/svg"
   xmlns="http://www.w3.org/2000/svg"
   xmlns:sodipodi="http://sodipodi.sourceforge.net/DTD/sodipodi-0.dtd"
   xmlns:inkscape="http://www.inkscape.org/namespaces/inkscape"
   width="1.8008624mm"
   height="0.75254661mm"
   viewBox="0 0 1.8008624 0.75254661"
   version="1.1"
   id="svg3015"
   inkscape:version="0.92.4 (unknown)"
   sodipodi:docname="மேரை.svg">
  <defs
     id="defs3009" />
  <sodipodi:namedview
     id="base"
     pagecolor="#ffffff"
     bordercolor="#666666"
     borderopacity="1.0"
     inkscape:pageopacity="0.0"
     inkscape:pageshadow="2"
     inkscape:zoom="129.73045"
     inkscape:cx="6.7948582"
     inkscape:cy="1.4221354"
     inkscape:document-units="mm"
     inkscape:current-layer="layer1"
     showgrid="false"
     fit-margin-top="0"
     fit-margin-left="0"
     fit-margin-right="0"
     fit-margin-bottom="0"
     inkscape:window-width="1920"
     inkscape:window-height="1017"
     inkscape:window-x="0"
     inkscape:window-y="30"
     inkscape:window-maximized="1" />
  <metadata
     id="metadata3012">
    <rdf:RDF>
      <cc:Work
         rdf:about="">
        <dc:format>image/svg+xml</dc:format>
        <dc:type
           rdf:resource="http://purl.org/dc/dcmitype/StillImage" />
        <dc:title></dc:title>
      </cc:Work>
    </rdf:RDF>
  </metadata>
  <g
     inkscape:label="Layer 1"
     inkscape:groupmode="layer"
     id="layer1"
     transform="translate(57.73828,-72.105869)">
    <g
       id="g1381"
       style="fill:#211e1e;fill-opacity:1"
       transform="matrix(0.35277777,0,0,0.35277777,-222.28451,51.473028)">
      <g
         transform="matrix(0.26458333,0,0,0.26458333,466.35999,60.619999)"
         id="use1379">
        <path
           style="stroke:none"
           d="m 6.34375,0 v -3.96875 c 0,-1.828125 -1.296875,-2.6875 -2.859375,-2.6875 -1.890625,0 -3.21875,1.0625 -3.21875,3.671875 0,1.5625 0.734375,2.9375 2.125,2.9375 1.09375,0 1.890625,-0.71875 1.890625,-1.703125 0,-1.25 -0.71875,-1.734375 -1.734375,-1.734375 -0.625,0 -1.09375,0.328125 -1.25,0.6875 -0.0625,-0.109375 -0.078125,-0.359375 -0.078125,-0.59375 0,-1.625 0.90625,-2.453125 2.21875,-2.453125 1.03125,0 2,0.5 2,1.8125 V 0 Z M 3.390625,-1.703125 c 0,0.46875 -0.40625,0.84375 -0.90625,0.84375 -0.46875,0 -0.875,-0.375 -0.875,-0.84375 0,-0.484375 0.40625,-0.890625 0.875,-0.890625 0.5,0 0.90625,0.40625 0.90625,0.890625 z m 0,0"
           id="path3035"
           inkscape:connector-curvature="0" />
      </g>
    </g>
    <g
       id="g1385"
       style="fill:#211e1e;fill-opacity:1"
       transform="matrix(0.35277777,0,0,0.35277777,-224.07926,51.473028)">
      <g
         transform="matrix(0.26458333,0,0,0.26458333,473.3194,60.619999)"
         id="use1383">
        <path
           style="stroke:none"
           d="m 12.484375,-7.296875 -0.796875,-0.375 c -0.01563,0.53125 -0.53125,1.265625 -0.984375,1.265625 -0.8125,0 -0.703125,-1.40625 -2.375,-1.3125 C 7.96875,-7.9375 7.703125,-8.0625 7.25,-8.0625 c -1.125,0 -1.953125,0.890625 -1.953125,1.984375 0,0.25 0.015625,0.421875 0.15625,0.625 h -2 V -0.875 H 0.921875 V -5.453125 H 0 V 0 h 4.515625 c 2.203125,0 3,-1.28125 3,-2.75 0,-0.890625 -0.1875,-1.8125 -1.078125,-2.4375 -0.171875,-0.265625 -0.203125,-0.484375 -0.203125,-0.796875 0,-0.734375 0.40625,-1.078125 0.90625,-1.078125 -0.3125,0.28125 -0.40625,0.53125 -0.40625,0.9375 0,0.578125 0.421875,1.03125 1.125,1.03125 0.796875,0 1.359375,-0.765625 1.1875,-1.5 0.4375,0.640625 0.828125,1.140625 1.703125,1.140625 0.625,0 1.59375,-0.8125 1.734375,-1.84375 z M 8.0625,-6.75 C 8.328125,-6.53125 8.171875,-5.90625 7.859375,-5.90625 7.453125,-6.078125 7.671875,-6.71875 8.0625,-6.75 Z m -1.40625,4.03125 c 0,1.03125 -0.734375,1.8125 -1.703125,1.8125 h -0.53125 v -3.625 h 0.78125 c 1.1875,0 1.453125,1.015625 1.453125,1.8125 z m 0,0"
           id="path3039"
           inkscape:connector-curvature="0" />
      </g>
    </g>
  </g>
</svg>
