<?xml version="1.0" standalone="no"?>
<!DOCTYPE svg PUBLIC "-//W3C//DTD SVG 1.1//EN" "http://www.w3.org/Graphics/SVG/1.1/DTD/svg11.dtd" >
<svg xmlns="http://www.w3.org/2000/svg" xmlns:xlink="http://www.w3.org/1999/xlink" version="1.1" viewBox="0 -324 780 1024">
  <g transform="matrix(1 0 0 -1 0 700)">
   <path fill="currentColor"
d="M61 0v492h443v-49h-172v-179q17 17 40 27t46 10q66 0 113 -41t47 -100q0 -33 -13 -62t-36 -49h190v-49h-449v49h136q45 0 77.5 32.5t32.5 78.5q0 36 -28.5 61t-69.5 25q-21 0 -43.5 -13t-42.5 -36v-99h-62v345h-147v-443h-62z" />
  </g>

</svg>
