<?xml version="1.0" encoding="UTF-8" standalone="no"?>
<!-- Created with Inkscape (http://www.inkscape.org/) -->

<svg
   xmlns:dc="http://purl.org/dc/elements/1.1/"
   xmlns:cc="http://creativecommons.org/ns#"
   xmlns:rdf="http://www.w3.org/1999/02/22-rdf-syntax-ns#"
   xmlns:svg="http://www.w3.org/2000/svg"
   xmlns="http://www.w3.org/2000/svg"
   xmlns:sodipodi="http://sodipodi.sourceforge.net/DTD/sodipodi-0.dtd"
   xmlns:inkscape="http://www.inkscape.org/namespaces/inkscape"
   width="1.3621677mm"
   height="0.83150983mm"
   viewBox="0 0 1.3621677 0.83150983"
   version="1.1"
   id="svg1620"
   inkscape:version="0.92.4 (unknown)"
   sodipodi:docname="ணம்.svg">
  <defs
     id="defs1614" />
  <sodipodi:namedview
     id="base"
     pagecolor="#ffffff"
     bordercolor="#666666"
     borderopacity="1.0"
     inkscape:pageopacity="0.0"
     inkscape:pageshadow="2"
     inkscape:zoom="256"
     inkscape:cx="2.5741904"
     inkscape:cy="1.571369"
     inkscape:document-units="mm"
     inkscape:current-layer="layer1"
     showgrid="false"
     fit-margin-top="0"
     fit-margin-left="0"
     fit-margin-right="0"
     fit-margin-bottom="0"
     inkscape:window-width="1920"
     inkscape:window-height="1017"
     inkscape:window-x="0"
     inkscape:window-y="30"
     inkscape:window-maximized="1" />
  <metadata
     id="metadata1617">
    <rdf:RDF>
      <cc:Work
         rdf:about="">
        <dc:format>image/svg+xml</dc:format>
        <dc:type
           rdf:resource="http://purl.org/dc/dcmitype/StillImage" />
        <dc:title></dc:title>
      </cc:Work>
    </rdf:RDF>
  </metadata>
  <g
     inkscape:label="Layer 1"
     inkscape:groupmode="layer"
     id="layer1"
     transform="translate(232.00252,-125.73901)">
    <g
       transform="matrix(0.35277777,0,0,0.35277777,-448.50782,39.67386)"
       id="g1767"
       style="fill:#211e1e;fill-opacity:1">
      <g
         id="use1765"
         transform="matrix(0.26458333,0,0,0.26458333,613.71997,245.42)">
        <path
           inkscape:connector-curvature="0"
           id="path1632"
           d="M 14.578125,-1.34375 V -5.5 h -0.84375 v 4.15625 c 0,0.421875 -0.578125,0.71875 -1.34375,1 V -5.484375 H 10.25 c -0.421875,0 -1,0.0625 -1.34375,0.25 C 8.3125,-5.5 7.984375,-5.484375 7.359375,-5.5 6.59375,-5.515625 6.15625,-5.453125 5.40625,-5.1875 c -0.5625,-0.171875 -0.921875,-0.21875 -1.5,-0.21875 -2.109375,0 -3.921875,0.875 -3.921875,3.203125 0,1.171875 0.796875,2.3125 2.15625,2.3125 0.609375,0 1.15625,-0.375 1.4375,-0.984375 0.390625,0.78125 0.953125,0.96875 1.515625,0.96875 0.890625,0 1.4375,-0.296875 1.9375,-1.109375 0.203125,0.671875 0.71875,1.0625 1.625,1.0625 1.125,0 1.90625,-0.921875 1.90625,-2.375 0,-0.953125 -0.171875,-1.625 -0.6875,-2.25 0.46875,-0.0625 0.96875,-0.171875 1.640625,-0.0625 V -0.0625 C 9.96875,0.421875 8.21875,1 8.21875,2.21875 c 0,0.875 0.6875,1.1875 1.390625,1.1875 1.34375,0 2.578125,-1.140625 2.75,-2.78125 1.171875,-0.40625 2.21875,-0.953125 2.21875,-1.96875 z M 7.9375,-4.625 C 7.703125,-4.40625 7.296875,-3.96875 7.0625,-3.5 6.84375,-4.046875 6.71875,-4.28125 6.328125,-4.640625 6.828125,-4.78125 7.65625,-4.734375 7.9375,-4.625 Z m -3.609375,0 c -0.46875,0.453125 -0.8125,1.125 -0.9375,1.796875 -0.421875,-0.40625 -0.734375,-0.453125 -1.25,-0.453125 -0.453125,0 -0.734375,0.109375 -1.109375,0.34375 0.140625,-1.171875 1.390625,-1.6875 2.375,-1.6875 z M 9.625,-2.328125 c 0,0.640625 -0.203125,1.546875 -0.921875,1.546875 -0.71875,0 -0.890625,-0.875 -0.890625,-1.59375 0,-0.859375 0.359375,-1.515625 1.125,-1.890625 0.5625,0.5 0.6875,1.125 0.6875,1.9375 z M 6.3125,-2.09375 c 0,0.671875 -0.34375,1.40625 -1.015625,1.40625 C 4.625,-0.6875 4.25,-1.421875 4.25,-2.078125 4.25,-3 4.53125,-3.734375 5.328125,-4.265625 6,-3.8125 6.3125,-3.046875 6.3125,-2.09375 Z m -3.34375,0.546875 c 0,0.46875 -0.390625,0.828125 -0.859375,0.828125 -0.453125,0 -0.828125,-0.359375 -0.828125,-0.828125 C 1.28125,-2 1.65625,-2.375 2.109375,-2.375 2.578125,-2.375 2.96875,-2 2.96875,-1.546875 Z M 11.375,0.96875 C 11.078125,1.953125 10.25,2.5625 9.6875,2.5625 c -0.21875,0 -0.46875,0 -0.46875,-0.34375 0,-0.578125 1.015625,-0.890625 2.15625,-1.25 z m 0,0"
           style="stroke:none" />
      </g>
    </g>
  </g>
</svg>
