<?xml version="1.0" encoding="UTF-8" standalone="no"?>
<!-- Created with Inkscape (http://www.inkscape.org/) -->

<svg
   xmlns:dc="http://purl.org/dc/elements/1.1/"
   xmlns:cc="http://creativecommons.org/ns#"
   xmlns:rdf="http://www.w3.org/1999/02/22-rdf-syntax-ns#"
   xmlns:svg="http://www.w3.org/2000/svg"
   xmlns="http://www.w3.org/2000/svg"
   xmlns:sodipodi="http://sodipodi.sourceforge.net/DTD/sodipodi-0.dtd"
   xmlns:inkscape="http://www.inkscape.org/namespaces/inkscape"
   width="1.2819544mm"
   height="0.89109689mm"
   viewBox="0 0 1.2819544 0.89109689"
   version="1.1"
   id="svg1466"
   inkscape:version="0.92.4 (unknown)"
   sodipodi:docname="உரி.svg">
  <defs
     id="defs1460" />
  <sodipodi:namedview
     id="base"
     pagecolor="#ffffff"
     bordercolor="#666666"
     borderopacity="1.0"
     inkscape:pageopacity="0.0"
     inkscape:pageshadow="2"
     inkscape:zoom="254.16241"
     inkscape:cx="2.4225906"
     inkscape:cy="1.683962"
     inkscape:document-units="mm"
     inkscape:current-layer="layer1"
     showgrid="false"
     fit-margin-top="0"
     fit-margin-left="0"
     fit-margin-right="0"
     fit-margin-bottom="0"
     inkscape:window-width="1920"
     inkscape:window-height="1017"
     inkscape:window-x="0"
     inkscape:window-y="30"
     inkscape:window-maximized="1" />
  <metadata
     id="metadata1463">
    <rdf:RDF>
      <cc:Work
         rdf:about="">
        <dc:format>image/svg+xml</dc:format>
        <dc:type
           rdf:resource="http://purl.org/dc/dcmitype/StillImage" />
        <dc:title></dc:title>
      </cc:Work>
    </rdf:RDF>
  </metadata>
  <g
     inkscape:label="Layer 1"
     inkscape:groupmode="layer"
     id="layer1"
     transform="translate(-27.329261,-81.108023)">
    <g
       transform="matrix(0.35277777,0,0,0.35277777,-0.20151665,-87.456438)"
       id="g899"
       style="fill:#211e1e;fill-opacity:1">
      <g
         id="use897"
         transform="matrix(0.26458333,0,0,0.26458333,78.040001,479.89999)">
        <path
           inkscape:connector-curvature="0"
           id="path1478"
           d="m 13.734375,-2.875 v -3.109375 c 0,-1 -0.71875,-1.875 -1.75,-1.875 -0.78125,0 -1.703125,0.453125 -1.703125,1.546875 v 0.640625 C 9.90625,-5.75 9.109375,-5.609375 8.75,-5.1875 8.40625,-5.546875 8.0625,-5.71875 7.5625,-5.71875 c -1,0 -1.703125,0.609375 -1.703125,1.5625 v 3.390625 H 4.46875 c 0.625,-0.640625 0.828125,-1.34375 0.828125,-2.125 C 5.296875,-4.4375 4.21875,-5.75 2.53125,-5.75 1.1875,-5.75 0,-4.890625 0,-3.515625 0,-3 0.15625,-2.46875 0.5625,-2.0625 L 1.40625,-2.625 C 1.140625,-2.890625 1.015625,-3.140625 1.015625,-3.515625 1.015625,-4.4375 1.8125,-4.875 2.625,-4.875 c 1.078125,0 1.734375,0.96875 1.734375,1.984375 0,1.125 -0.703125,1.96875 -1.390625,2.0625 V 0 h 3.859375 v -3.953125 c 0,-0.421875 0.203125,-0.78125 0.59375,-0.78125 0.328125,0 0.5,0.375 0.5,0.65625 V -3.34375 H 8.9375 v -0.453125 c 0,-0.78125 0.734375,-1.125 1.34375,-1.09375 V 1.6875 h 0.953125 v -7.953125 c 0,-0.375 0.34375,-0.609375 0.75,-0.609375 0.5,0 0.875,0.34375 0.875,1 v 3 z m 0,0"
           style="stroke:none" />
      </g>
    </g>
  </g>
</svg>
