<?xml version="1.0" standalone="no"?>
<!DOCTYPE svg PUBLIC "-//W3C//DTD SVG 1.1//EN" "http://www.w3.org/Graphics/SVG/1.1/DTD/svg11.dtd" >
<svg xmlns="http://www.w3.org/2000/svg" xmlns:xlink="http://www.w3.org/1999/xlink" version="1.1" viewBox="0 -410 1736 2048">
  <g transform="matrix(1 0 0 -1 0 1638)">
   <path fill="currentColor"
d="M814 540q-78 0 -135 -43t-63 -103v-394h-122v886h-270v-886h-124v984h886v-98h-370v-320q22 44 75 71t123 27q104 0 178 -84q60 -70 82 -176q26 -126 84 -204q58 -76 132 -76q120 6 180 126q64 124 64 318q0 402 -210 646v2q-210 242 -510 242v122q342 0 582 -278
q242 -282 242 -734q0 -228 -78 -378q-94 -182 -266 -190h-2q-120 0 -212 122q-74 98 -106 254q-14 72 -54 118q-42 46 -106 46z" />
  </g>

</svg>
