<?xml version="1.0" standalone="no"?>
<!DOCTYPE svg PUBLIC "-//W3C//DTD SVG 1.1//EN" "http://www.w3.org/Graphics/SVG/1.1/DTD/svg11.dtd" >
<svg xmlns="http://www.w3.org/2000/svg" xmlns:xlink="http://www.w3.org/1999/xlink" version="1.1" viewBox="0 -676 2220 2048">
  <g transform="matrix(1 0 0 -1 0 1638)">
   <path fill="currentColor"
d="M1310 886v-346h246v346h-246zM542 98q62 0 105 58t43 140q0 72 -43 122t-105 50t-105 -51t-43 -121q0 -82 43 -140t105 -58zM1334 74q90 0 156 58t66 138v172h-370q-52 0 -87 -35t-35 -87q0 -100 79 -173t191 -73zM1186 702v282h836v-98h-344v-346h98q142 0 243 -86
t101 -208q0 -204 -136 -348t-330 -144h-1268q-62 0 -104 -50t-42 -122q0 -50 25 -95t73 -77l-74 -86q-68 40 -108 108t-40 150q0 114 79 192t191 78h1268q142 0 243 116t101 278q0 82 -65 139t-157 57h-98v-172q0 -122 -101 -208t-243 -86q-162 0 -278 101t-116 243
q0 90 74 156q44 40 100 56q-10 148 -118 258q-120 120 -358 120q-224 0 -332 -129t-108 -313q0 -94 38 -178t108 -142q-24 42 -36 80t-12 68q0 114 72 192t174 78q100 0 173 -79t73 -191q0 -132 -86 -226t-210 -94q-162 0 -277 144t-115 348q0 224 136 382t402 158
q286 0 438 -148q72 -72 110 -158z" />
  </g>

</svg>
