<?xml version="1.0" encoding="UTF-8" standalone="no"?>
<!-- Created with Inkscape (http://www.inkscape.org/) -->

<svg
   xmlns:dc="http://purl.org/dc/elements/1.1/"
   xmlns:cc="http://creativecommons.org/ns#"
   xmlns:rdf="http://www.w3.org/1999/02/22-rdf-syntax-ns#"
   xmlns:svg="http://www.w3.org/2000/svg"
   xmlns="http://www.w3.org/2000/svg"
   xmlns:sodipodi="http://sodipodi.sourceforge.net/DTD/sodipodi-0.dtd"
   xmlns:inkscape="http://www.inkscape.org/namespaces/inkscape"
   width="0.84588575mm"
   height="0.85026103mm"
   viewBox="0 0 0.84588575 0.85026103"
   version="1.1"
   id="svg1499"
   inkscape:version="0.92.4 (unknown)"
   sodipodi:docname="ராம ஆரம்.svg">
  <defs
     id="defs1493" />
  <sodipodi:namedview
     id="base"
     pagecolor="#ffffff"
     bordercolor="#666666"
     borderopacity="1.0"
     inkscape:pageopacity="0.0"
     inkscape:pageshadow="2"
     inkscape:zoom="256"
     inkscape:cx="1.5985334"
     inkscape:cy="1.6067922"
     inkscape:document-units="mm"
     inkscape:current-layer="layer1"
     showgrid="false"
     fit-margin-top="0"
     fit-margin-left="0"
     fit-margin-right="0"
     fit-margin-bottom="0"
     inkscape:window-width="1920"
     inkscape:window-height="1017"
     inkscape:window-x="0"
     inkscape:window-y="30"
     inkscape:window-maximized="1" />
  <metadata
     id="metadata1496">
    <rdf:RDF>
      <cc:Work
         rdf:about="">
        <dc:format>image/svg+xml</dc:format>
        <dc:type
           rdf:resource="http://purl.org/dc/dcmitype/StillImage" />
        <dc:title></dc:title>
      </cc:Work>
    </rdf:RDF>
  </metadata>
  <g
     inkscape:label="Layer 1"
     inkscape:groupmode="layer"
     id="layer1"
     transform="translate(248.37533,-147.65225)">
    <g
       transform="matrix(0.35277777,0,0,0.35277777,-464.88209,73.448975)"
       id="g1735"
       style="fill:#211e1e;fill-opacity:1">
      <g
         id="use1733"
         transform="matrix(0.26458333,0,0,0.26458333,613.71997,211.82001)">
        <path
           inkscape:connector-curvature="0"
           id="path1511"
           d="M 9.0625,-1.890625 V -5.59375 H 8.125 v 4 c 0,0.9375 -0.65625,1.234375 -1.5,1.453125 V -5.5625 H 4.640625 C 4,-5.5625 3.15625,-5.328125 2.890625,-4.953125 2.5625,-5.3125 2.140625,-5.484375 1.578125,-5.484375 0.75,-5.484375 0,-5.046875 0,-4.125 v 4.109375 h 0.921875 v -4.0625 c 0,-0.296875 0.296875,-0.453125 0.5625,-0.453125 C 1.75,-4.53125 2,-4.4375 2,-4.046875 V 0 h 1 v -3.453125 c 0,-0.625 0.40625,-1.1875 1.421875,-1.1875 H 5.71875 V 0.0625 C 5.609375,0.09375 5.515625,0.109375 5.40625,0.15625 3.921875,0.53125 2.421875,1.125 2.421875,2.359375 c 0,0.828125 0.703125,1.15625 1.390625,1.15625 1.234375,0 2.8125,-1.1875 2.8125,-2.6875 V 0.75 C 7.875,0.40625 9.0625,0.0625 9.0625,-1.890625 Z M 5.703125,1.015625 C 5.515625,1.6875 4.65625,2.59375 3.90625,2.59375 c -0.265625,0 -0.453125,-0.1875 -0.453125,-0.375 0,-0.46875 1.03125,-0.828125 2.25,-1.203125 z m 0,0"
           style="stroke:none" />
      </g>
    </g>
  </g>
</svg>
