<?xml version="1.0" encoding="UTF-8" standalone="no"?>
<!-- Created with Inkscape (http://www.inkscape.org/) -->

<svg
   xmlns:dc="http://purl.org/dc/elements/1.1/"
   xmlns:cc="http://creativecommons.org/ns#"
   xmlns:rdf="http://www.w3.org/1999/02/22-rdf-syntax-ns#"
   xmlns:svg="http://www.w3.org/2000/svg"
   xmlns="http://www.w3.org/2000/svg"
   xmlns:sodipodi="http://sodipodi.sourceforge.net/DTD/sodipodi-0.dtd"
   xmlns:inkscape="http://www.inkscape.org/namespaces/inkscape"
   width="1.5955155mm"
   height="0.85901159mm"
   viewBox="0 0 1.5955155 0.85901159"
   version="1.1"
   id="svg3403"
   inkscape:version="0.92.4 (unknown)"
   sodipodi:docname="ஆக.svg">
  <defs
     id="defs3397" />
  <sodipodi:namedview
     id="base"
     pagecolor="#ffffff"
     bordercolor="#666666"
     borderopacity="1.0"
     inkscape:pageopacity="0.0"
     inkscape:pageshadow="2"
     inkscape:zoom="256"
     inkscape:cx="3.0151372"
     inkscape:cy="1.6233209"
     inkscape:document-units="mm"
     inkscape:current-layer="layer1"
     showgrid="false"
     fit-margin-top="0"
     fit-margin-left="0"
     fit-margin-right="0"
     fit-margin-bottom="0"
     inkscape:window-width="1920"
     inkscape:window-height="1017"
     inkscape:window-x="0"
     inkscape:window-y="30"
     inkscape:window-maximized="1" />
  <metadata
     id="metadata3400">
    <rdf:RDF>
      <cc:Work
         rdf:about="">
        <dc:format>image/svg+xml</dc:format>
        <dc:type
           rdf:resource="http://purl.org/dc/dcmitype/StillImage" />
        <dc:title></dc:title>
      </cc:Work>
    </rdf:RDF>
  </metadata>
  <g
     inkscape:label="Layer 1"
     inkscape:groupmode="layer"
     id="layer1"
     transform="translate(198.10133,-171.83835)">
    <g
       transform="matrix(0.35277777,0,0,0.35277777,-362.62277,110.35987)"
       id="g1501"
       style="fill:#211e1e;fill-opacity:1">
      <g
         id="use1499"
         transform="matrix(0.26458333,0,0,0.26458333,466.35999,175.82001)">
        <path
           inkscape:connector-curvature="0"
           id="path3415"
           d="M 17.09375,3.34375 V 2.484375 H 13.8125 c 0.3125,-0.40625 0.390625,-0.78125 0.390625,-1.296875 0,-1.203125 -0.765625,-2.015625 -2.015625,-2.015625 -0.3125,0 -0.515625,0.09375 -0.8125,0.15625 C 11.109375,-0.8125 10.59375,-1.03125 10.28125,-1.03125 H 9.421875 V -5.546875 H 8.46875 v 2.15625 H 7.75 c -0.140625,-1.515625 -1.34375,-2.46875 -2.828125,-2.46875 -1.4375,0 -2.8125,0.78125 -2.71875,2.5 C 1.09375,-3.515625 0,-3.125 0,-1.703125 0,0.0625 1.859375,1.03125 3.703125,1.03125 c 2.15625,0 4.03125,-1.234375 4.109375,-3.453125 H 8.46875 V -0.75 c -1.078125,0.375 -2.3125,1.515625 -2.3125,2.609375 0,0.65625 0.5625,1.125 1.203125,1.125 1.1875,0 2.109375,-1.34375 2.109375,-2.75 v -0.34375 h 1.015625 C 9.9375,0.359375 9.71875,1.0625 9.71875,1.828125 9.71875,2.453125 10.140625,3 10.734375,3 c 0.953125,0 1.46875,-0.984375 1.46875,-1.921875 0,-0.40625 -0.07813,-0.609375 -0.15625,-1 h 0.25 c 0.71875,0 0.828125,0.65625 0.828125,1.21875 0,0.75 -0.390625,1.171875 -0.78125,1.21875 V 3.34375 Z M 6.78125,-3.390625 h -1.1875 c -0.203125,-0.6875 -0.609375,-1.125 -1.375,-1.125 -0.359375,0 -0.578125,0.046875 -0.875,0.234375 0.109375,-0.546875 0.890625,-0.765625 1.546875,-0.765625 0.984375,0 1.75,0.796875 1.890625,1.65625 z M 4.671875,-3.03125 c 0,0.375 -0.296875,0.671875 -0.703125,0.671875 -0.375,0 -0.671875,-0.296875 -0.671875,-0.671875 0,-0.40625 0.296875,-0.703125 0.671875,-0.703125 0.40625,0 0.703125,0.296875 0.703125,0.703125 z m 2.125,0.59375 c -0.125,1.625 -1.59375,2.609375 -3.1875,2.609375 -1.234375,0 -2.59375,-0.84375 -2.59375,-1.765625 0,-0.578125 0.171875,-0.875 0.671875,-0.875 h 0.625 c 0.203125,0.609375 0.671875,1.046875 1.484375,1.046875 0.765625,0 1.5,-0.4375 1.75,-1.015625 z M 8.46875,0.328125 C 8.546875,1.0625 8.015625,2.265625 7.3125,2.078125 7.046875,1.59375 7.90625,0.40625 8.46875,0.328125 Z m 2.640625,0.140625 c 0.21875,0.40625 0.125,1.34375 -0.21875,1.6875 -0.40625,-0.3125 -0.09375,-1.46875 0.21875,-1.6875 z m 0,0"
           style="stroke:none" />
      </g>
    </g>
  </g>
</svg>
