<?xml version="1.0" standalone="no"?>
<!DOCTYPE svg PUBLIC "-//W3C//DTD SVG 1.1//EN" "http://www.w3.org/Graphics/SVG/1.1/DTD/svg11.dtd" >
<svg xmlns="http://www.w3.org/2000/svg" xmlns:xlink="http://www.w3.org/1999/xlink" version="1.1" viewBox="0 -324 1055 1024">
  <g transform="matrix(1 0 0 -1 0 700)">
   <path fill="currentColor"
d="M214 -158.5q95 -109.5 220 -109.5q148 0 252 114.5t104 278.5q0 57 -34.5 96t-82.5 39q-18 0 -39 -13t-41 -36v-209h-61v443h-148v-443h-61v492h442v-49h-172v-173q10 17 33.5 27t52.5 10q71 0 122 -54t51 -130q0 -183 -122.5 -313t-295.5 -130q-148 0 -259.5 124.5
t-111.5 347.5q0 291 105.5 438.5t358.5 147.5q256 0 375.5 -134t119.5 -358v-246h-62v246q0 200 -102 321t-331 121t-319 -134t-90 -402q1 -203 96 -312.5z" />
  </g>

</svg>
