<?xml version="1.0" encoding="UTF-8" standalone="no"?>
<!-- Created with Inkscape (http://www.inkscape.org/) -->

<svg
   xmlns:dc="http://purl.org/dc/elements/1.1/"
   xmlns:cc="http://creativecommons.org/ns#"
   xmlns:rdf="http://www.w3.org/1999/02/22-rdf-syntax-ns#"
   xmlns:svg="http://www.w3.org/2000/svg"
   xmlns="http://www.w3.org/2000/svg"
   xmlns:sodipodi="http://sodipodi.sourceforge.net/DTD/sodipodi-0.dtd"
   xmlns:inkscape="http://www.inkscape.org/namespaces/inkscape"
   width="24.50416mm"
   height="20.677704mm"
   viewBox="0 0 24.50416 20.677704"
   version="1.1"
   id="svg8"
   inkscape:version="0.92.3 (2405546, 2018-03-11)"
   sodipodi:docname="1.svg">
  <defs
     id="defs2" />
  <sodipodi:namedview
     id="base"
     pagecolor="#ffffff"
     bordercolor="#666666"
     borderopacity="1.0"
     inkscape:pageopacity="0.0"
     inkscape:pageshadow="2"
     inkscape:zoom="5.6"
     inkscape:cx="42.743833"
     inkscape:cy="50.137761"
     inkscape:document-units="mm"
     inkscape:current-layer="layer1"
     showgrid="false"
     inkscape:window-width="1366"
     inkscape:window-height="705"
     inkscape:window-x="0"
     inkscape:window-y="30"
     inkscape:window-maximized="1"
     fit-margin-top="0"
     fit-margin-left="0"
     fit-margin-right="0"
     fit-margin-bottom="0" />
  <metadata
     id="metadata5">
    <rdf:RDF>
      <cc:Work
         rdf:about="">
        <dc:format>image/svg+xml</dc:format>
        <dc:type
           rdf:resource="http://purl.org/dc/dcmitype/StillImage" />
        <dc:title></dc:title>
      </cc:Work>
    </rdf:RDF>
  </metadata>
  <g
     inkscape:label="Layer 1"
     inkscape:groupmode="layer"
     id="layer1"
     transform="translate(-82.595935,-135.753)">
    <path
       style="fill:#e2e2e2;fill-opacity:1;stroke:#000000;stroke-width:0;stroke-linecap:butt;stroke-linejoin:miter;stroke-miterlimit:4;stroke-dasharray:none;stroke-opacity:1"
       d="M 79.791016 0.50976562 L 13.414062 1.7050781 L 13.898438 29.615234 C 13.898438 29.615234 8.6297428 32.651486 4.0761719 36.580078 C -0.47739912 40.508632 -1.6386719 51.580078 -1.6386719 51.580078 C -1.6386719 51.580078 -1.9059673 58.991656 1.5761719 65.777344 C 5.058311 72.56307 15.594031 76.224055 24.076172 76.759766 C 32.558312 77.295476 40.148437 74.527624 43.273438 73.009766 C 46.398437 71.491907 49.611328 67.115234 49.611328 67.115234 C 49.611328 67.115234 53.719855 61.847669 53.898438 56.847656 C 54.076981 51.847681 53.808594 37.205078 53.808594 37.205078 C 53.808594 37.205078 64.34402 36.491907 68.451172 38.009766 C 72.558309 39.527624 76.754566 42.651768 76.576172 51.9375 C 76.576172 61.028209 68.876301 68.523944 51.933594 66.402344 L 52.023438 77.652344 C 52.023438 77.652344 60.862708 77.652326 64.523438 77.027344 C 68.184151 76.402323 71.487985 76.670174 79.255859 71.402344 C 87.023733 66.134476 90.057947 59.169892 89.96875 48.544922 C 89.879478 37.919914 79.076177 27.205469 69.701172 26.9375 C 60.32616 26.669494 53.451172 27.115234 53.451172 27.115234 L 53.09375 11.044922 L 79.96875 10.597656 L 79.791016 0.50976562 z M 27.380859 11.3125 L 43.183594 11.3125 L 43.183594 27.027344 L 27.558594 27.027344 L 27.380859 11.3125 z M 44.166016 37.5625 C 44.166016 37.5625 44.255326 49.705343 44.166016 54.4375 C 44.076705 59.16962 39.700888 66.490511 29.34375 66.222656 C 18.986609 65.954688 13.808028 60.062775 13.09375 52.919922 C 12.379457 45.777068 17.737174 41.936675 20.058594 40.240234 C 22.380025 38.543793 25.326172 38.1875 25.326172 38.1875 L 44.166016 37.5625 z "
       transform="matrix(0.26458333,0,0,0.26458333,82.595935,135.753)"
       id="path111" />
  </g>
</svg>
