{
 "En"               :   "E\\d{n}",
 "Aticaram"         :   "Atic\\={a}ram",
 "Kil"              :   "K\\={i}\\b{l}",
 "Muntiri"          :   "Muntiri",
 "Arai"             :   "Arai",
 "Araiye"           :   "Araiy\\={e}",
 "Arai kani"        :   "Arai k\\={a}\\d{n}i",
 "Araikkani"        :   "Araikk\\={a}\\d{n}i",
 "Araikkaniye"      :   "Araikk\\={a}\\d{n}iy\\={e}",
 "Kani"             :   "K\\={a}\\d{n}i",
 "Kaniye"           :   "K\\={a}\\d{n}iy\\={e}",
 "Mukkani"          :   "Mukk\\={a}\\d{n}i",
 "Mukkaniye"        :   "Mukk\\={a}\\d{n}iMukk\\={a}\\d{n}iy\\={e}",
 "Orukaniye"        :   "Oruk\\={a}\\d{n}iy\\={e}",
 "Makani"           :   "M\\={a}k\\={a}\\d{n}i",
 "Makaniye"         :   "M\\={a}k\\={a}\\d{n}iy\\={e}",
 "Araima"           :   "Araim\\={a}",
 "Ma"               :   "M\\={a}",
 "Oruma"            :   "Orum\\={a}",
 "Iruma"            :   "Irum\\={a}",
 "Rentu ma"         :   "Re\\d{n}\\d{t}u ma",
 "Mumma"            :   "Mumm\\={a}",
 "Nalu ma"          :   "N\\={a}lu m\\={a}",
 "Nankuma"          :   "N\\={a}nkum\\={a}",
 "Mummakani"        :   "Mum\\={a}k\\={a}\\d{n}i",
 "Naluma"           :   "N\\={a}lum\\={a}",
 "Kal"              :   "K\\={a}l",
 "Kale"             :   "K\\={a}l\\={e}",
 "Arai kal"         :   "Arai k\\={a}l",
 "Araikkal"         :   "Araikk\\={a}l",
 "Mukkal"           :   "Mukk\\={a}l",
 "Mukkale"          :   "Mukk\\={a}l\\={e}",
 "Muvicam"          :   "M\\={u}v\\={i}cam",
 "Nutpa muntiri"    :   "Nu\\d{t}pa muntiri",
 "Immi"             :   "Immi",
 "Kil muntirikai"   :   "K\\={i}\\b{l} muntirikai",
 "Mel muntirikai"   :   "M\\={e}l muntirikai",
 "Viral"            :   "Viral",
 "Can"              :   "C\\={a}\\d{n}",
 "Mulam"            :   "Mu\\b{l}am",
 "Ciru kol"         :   "Ci\\b{r}u k\\={o}l",
 "Perunkol"         :   "Peru\\.{n}k\\={o}l",
 "Cemporkol"        :   "Cempork\\={o}l",
 "Kuppitu turam"    :   "K\\={u}ppi\\d{t}u t\\={u}ram",
 "Katam"            :   "K\\={a}tam",
 "Yocanai"          :   "Y\\={o}ca\\b{n}ai",
 "Nel"              :   "Nel",
 "Ellu"             :   "E\\d{l}\\d{l}u",
 "Pilavu"           :   "Pi\\d{l}avu",
 "Kunri"            :   "Ku\\b{n}\\b{r}i",
 "Mancati"          :   "Ma\\~{n}c\\={a}ti",
 "Panavetai"        :   "Pa\\d{n}ave\\d{t}ai",
 "Kalancu"          :   "Ka\\b{l}a\\~{n}cu",
 "Palam"            :   "Palam",
 "Etai"             :   "E\\d{t}ai",
 "Nirai"            :   "Ni\\b{r}ai",
 "Tulam"            :   "Tul\\={a}m",
 "Vay"              :   "V\\={a}y",
 "Kal kalancu"      :   "K\\={a}l ka\\b{l}a\\~{n}cu",
 "Kaica"            :   "Kaic\\={a}",
 "Pencu"            :   "Pen\b{n}cu",
 "Param"            :   "P\\={a}ram",
 "Kutiram"          :   "Kutiram",
 "Lokkiam"          :   "L\\={o}kkiam",
 "Vicai"            :   "V\\={i}cai",
 "Manam"            :   "Manam",
 "Pukai"            :   "Pukai",
 "Pal"              :   "P\\={a}l",
 "Tannir"           :   "Ta\\d{n}\\d{n}\\={i}r",
 "Nei"              :   "Nei",
 "Celam"            :   "Celam",
 "Vintu"            :   "Vintu",
 "Tulli"            :   "Tu\\d{l}\\d{l}i",
 "Turuvam"          :   "Turuvam",
 "Cevitu"           :   "cevi\\d{t}u",
 "Oru cevitu"       :   "Oru cevi\\d{t}u",
 "Iru cevitu"       :   "Iru cevi\\d{t}u",
 "Narcevitu"        :   "Narcevi\\d{t}u", 
 "Alakku"           :   "\\={A}l\\={a}kku",
 "Alakke"           :   "\\={A}l\\={a}kke",
 "Ulakku"           :   "U\\b{l}akku",
 "Ulakke"           :   "\\={U}l\\={a}kke",
 "Muvulakku"        :   "M\\={u}vu\\b{l}akku",
 "Muvulakke"        :   "M\\={u}vu\\b{l}akk\\={e}",
 "Nali"             :   "N\\={a}\\b{l}i",
 "Naliye"           :   "N\\={a}\\b{l}iy\\={e}",
 "Orunali"          :   "Orun\\={a}\\b{l}i",
 "Munnali"          :   "Munn\\={a}\\b{l}i",
 "Munnaliye"        :   "Munn\\={a}\\b{l}iy=\\{e}",
 "Nanali"           :   "N\\={a}\\b{n}\\={a}\\b{l}i",
 "Ainali"           :   "Ai\\b{n}\\={a}\\b{l}i",
 "Arunali"          :   "A\\b{r}u\\b{n}\\={a}\\b{l}i",
 "Elunali"          :   "E\\b{l}u\\b{n}\\={a}\\b{l}i",
 "Kuruni"           :   "Ku\\b{r}u\\d{n}i",
 "Kuruniye"         :   "Ku\\b{r}u\\d{n}iy\\={e}",
 "Tuni"             :   "T\\={u}\\d{n}i",
 "Cumai"            :   "Cumai",
 "Param"            :   "P\\={a}ram",
 "Man"              :   "Ma\\d{n}",
 "Patakku"          :   "Patakku",
 "Patakke"          :   "Patakk\\={e}", 
 "Kannimai"         :   "Ka\\d{n}\\d{n}imai",
 "Kai noti"         :   "Kai no\\d{t}i",
 "Mattirai"         :   "M\\={a}ttirai",
 "Ksanikam"         :   "K\\d{s}a\\d{n}ikam",
 "Vinalikai"        :   "Vin\\={a}\\b{l}ikai",
 "Nalikai"          :   "N\\={a}\\b{l}ikai",
 "Cuspiram"         :   "Cu\\d{s}piram",
 "Cutcanam"         :   "Cu\\d{t}canam",
 "Camam"            :   "Camam",
 "Polutu"           :   "Po\\b{l}utu",
 "Nal"              :   "N\\={a}\\d{l}",
 "Tinkal"           :   "Ti\\.{n}ka\\d{l}",
 "Varusam"          :   "Varu\\d{s}am",
 "Kanam"            :   "Kanam",
 "Kattai"           :   "K\\={a}\\d{t}\\d{t}ai",
 "Mettai"           :   "M\\e\\d{t}\\d{t}ai",
 "Tuti"             :   "Tu\\d{t}i",
 "Rutu"             :   "Rutu",
 "Ayanam"           :   "Aya\\b{n}am",
 "Antu"             :   "\\={a}\\d{n}\\d{t}u",
 "Onru"             :   "O\\b{n}\\b{r}u",
 "Onre"             :   "O\\b{n}\\b{r}\\={e}",
 "Onne"             :   "O\\b{n}\\b{n}\\={e}",
 "Onnarai"          :   "O\\b{n}\\b{n}arai",
 "Onrarai"          :   "O\\b{n}\\b{r}arai",
 "Onnaraiye"        :   "O\\b{n}\\b{n}araiy\\={e}",
 "Irantu"           :   "Ira\\d{n}\\d{t}u",
 "Irante"           :   "Ira\\d{n}\\d{t}\\={e}",
 "Irantarai"        :   "Ira\\d{n}\\d{t}arai",
 "Munru"            :   "M\\={u}\\b{n}\\b{r}u",
 "Munre"            :   "M\\={u}\\b{n}\\b{r}\\={e}",
 "Munrarai"         :   "M\\={u}\\b{n}\\b{r}arai",
 "Nalu"             :   "N\\={a}lu",
 "Nale"             :   "N\\={a}l\\={e}",
 "Nalarai"          :   "N\\={a}larai",
 "Nanku"            :   "N\\={a}nku",
 "Aintu"            :   "Aintu",
 "Aru"              :   "\\={A}\\b{r}u",
 "Elu"              :   "\\={E}\\b{l}u",
 "Ettu"             :   "E\\d{t}\\d{t}u",
 "Onpatu"           :   "O\\b{n}patu",
 "Pattu"            :   "Pattu",
 "avatu"            :   "\\={a}vatu",
 "pankil"           :   "pa\\.{n}kil",
 "Itai"             :   "I\\d{t}ai",
 "Patinonru"        :   "Pati\\b{n}o\\b{n}\\b{r}u",
 "Patinonre"        :   "Pati\\b{n}o\\b{n}\\b{r}\\={e}",
 "Pannirantu"       :   "Pa\\b{n}\\b{n}ira\\d{n}\\d{t}u",
 "Patinmunru"       :   "Pati\\b{n}m\\={u}\\b{n}\\b{r}u",
 "Patimunrarai"     :   "Patim\\={u}\\b{n}\\b{r}arai",
 "Patinanku"        :   "Pati\\b{n}\\={a}\\b{n}ku",
 "Patinaintu"       :   "Pati\\b{n}aintu",
 "Patinaru"         :   "Pati\\b{n}\\={a}\\b{r}u",
 "Patinelu"         :   "Pati\\b{n}\\={e}\\b{l}u",
 "Patinettu"        :   "Patine\\d{t}\\d{t}u",
 "Pattonpatu"       :   "Patto\\b{n}patu",
 "Irupatu"          :   "Irupatu",
 "Irupattonru"      :   "Irupatto\\b{n}\\b{r}u",
 "Irupatti"         :   "Irupatti",
 "Muppattu"         :   "Muppattu",
 "Muppatti"         :   "Muppatti",
 "Narpatu"          :   "N\\={a}\\b{r}patu",
 "Narpatti"         :   "N\\={a}\\b{r}patti",
 "Aimpatu"          :   "Aimpatu",
 "Aimpatti"         :   "Aimpatti",
 "Arupatu"          :   "A\\b{r}upatu",
 "Arupatu onru"     :   "A\\b{r}upatu o\\b{n}\\b{r}u",
 "Arupatti"         :   "A\\b{r}upatti",
 "Arupattu"         :   "A\\b{r}upattu",
 "Elupatu"          :   "E\\b{l}upatu",
 "Elupattu"         :   "E\\b{l}upattu",
 "Enpatu"           :   "E\\d{n}patu",
 "Enpattu"          :   "E\\d{n}pattu",
 "Tonnuru"          :   "To\\d{n}\\d{n}\\={u}\\b{r}u",
 "Tonnurru"         :   "To\\d{n}\\d{n}\\={u}\\b{r}\\b{r}u",
 "Nuru"             :   "N\\={u}\\b{r}u",
 "Nurru"            :   "N\\={u}\\b{r}\\b{r}u",
 "Irunuru"          :   "Irun\\={u}\\b{r}u",
 "Irunurru"         :   "Irun\\={u}\\b{r}\\b{r}u",
 "Irunurril"        :   "Irun\\={u}\\b{r}\\b{r}il",
 "Munnuru"          :   "Munn\\={u}\\b{r}u",
 "Nanuru"           :   "N\\={a}\\b{n}\\={u}\\b{r}u",
 "Nanurril"         :   "N\\={a}n\\={u}\\b{r}\\b{r}il",
 "Ainuru"           :   "Ain\\={u}\\b{r}u",
 "Ainnuru"          :   "Ainn\\={u}\\b{r}u",
 "Ainurru"          :   "Ain\\={u}\\b{r}\\b{r}u",
 "Arunuru"          :   "A\\b{r}un\\={u}\\b{r}u",
 "Arunurru"         :   "A\\b{r}un\\={u}\\b{r}\\b{r}u",
 "Arunurril"        :   "A\\b{r}un\\={u}\\b{r}\\b{r}il",
 "Elunuru"          :   "E\\b{l}un\\={u}\\b{r}u",
 "Elunurril"        :   "E\\b{l}un\\={u}\\b{r}\\b{r}il",
 "Ennuru"           :   "E\\b{n}\\b{n}\\={u}\\b{r}u",
 "Ennurril"         :   "E\\b{n}\\b{n}\\={u}\\b{r}\\b{r}il",
 "Tollayiram"       :   "To\\d{l}\\d{l}\\={a}yiram",
 "Ayiram"           :   "\\={A}yiram",
 "Ayirattu"         :   "\\={A}yirattu",
 "Irantayiram"      :   "Ira\\d{n}\\d{t}ayiram",
 "Irantayirattu"    :   "Ira\\d{n}\\d{t}ayirattu",
 "Muvayiram"        :   "M\\={u}v\\={a}yiram",
 "Muvayirattu"      :   "M\\={u}v\\={a}yirattu",
 "Nankayiram"       :   "N\\={a}\\b{n}k\\={a}yiram",
 "Nankayirattu"     :   "N\\={a}\\b{n}k\\={a}yirattu",
 "Aintayiram"       :   "Aint\\={a}yiram",
 "Aintayirattu"     :   "Aint\\={a}yirattu",
 "Aiyayirattu"      :   "Aiy\\={a}yirattu",
 "Arayiram"         :   "\\={A}\\b{r}\\={a}yiram",
 "Arayirattu"       :   "\\={A}\\b{r}\\={a}yirattu",
 "Elayiram"         :   "\\={E}\\b{l}\\={a}yiram",
 "Elayirattu"       :   "\\={E}\\b{l}\\={a}yirattu",
 "Ettayiram"        :   "E\\d{t}\\d{t}\\={a}yiram",
 "Ettayirattu"      :   "E\\d{t}\\d{t}\\={a}yirattu",
 "Onpatayiram"      :   "O\\b{n}pat\\={a}yiram",
 "Onpatayirattu"    :   "O\\b{n}pat\\={a}yirattu",
 "Pattayiram"       :   "Patt\\={a}yiram",
 "Pattayirattu"     :   "Patt\\={a}yirattu",
 "Patinayiram"      :   "Pati\\b{n}\\={a}yiram",
 "Patinorayiram"    :   "Pati\\b{n}\\={o}r\\={a}yiram",
 "Pannirantarai"    :   "Pa\\b{n}\\b{n}ira\\b{n}\\b{t}arai",
 "Pannirantayiram"  :   "Pa\\b{n}\\b{n}ira\\d{n}\\d{t}\\={a}yiram",
 "Patinmunrayiram"  :   "Pati\\b{n}m\\={u}\\b{n}\\b{r}\\={a}yiram",
 "Patinankayiram"   :   "Patin\\={a}\\b{n}k\\={a}yiram",
 "Patinaintayiram"  :   "Pati\\b{n}aint\\={a}yiram",
 "Patinarayiram"    :   "Pati\\b{n}\\={a}\\b{r}\\={a}yiram",
 "Patinelayiram"    :   "Pati\\b{n}\\={e}\\b{l}\\={a}yiram",
 "Patinettayiram"   :   "Pati\\b{n}e\\d{t}\\d{t}\\={a}yiram",
 "Pattonpatayiram"  :   "Patto\\b{n}pat\\={a}yiram",
 "Irupatayiram"     :   "Irupat\\={a}yiram",
 "Muppatayiram"     :   "Muppat\\={a}yiram",
 "Narpatayiram"     :   "N\\={a}rpat\\={a}yiram",
 "Aimpatayiram"     :   "Aimpat\\={a}yiram",
 "Arupatayiram"     :   "A\\b{r}upat\\={a}yiram",
 "Elupatayiram"     :   "E\\b{l}upat\\={a}yiram",
 "Enpatayiram"      :   "E\\d{n}pat\\{a}yiram",
 "Tonnurayiram"     :   "To\\d{n}\\d{n}\\={u}\\b{r}\\={a}yiram",
 "Nurayiram"        :   "N\\={u}\\b{r}\\={a}yiram",
 "Nurayira"         :   "N\\={u}\\b{r}\\={a}yira",
 "Nurayirattu"      :   "N\\={u}\\b{r}\\={a}yirattu",
 "Irunurayiram"     :   "Irun\\={u}\\b{r}ayiram",
 "Irunurru"         :   "Irun\\={u}\\b{r}\\b{r}u",
 "Munnurayiram"     :   "Mu\\b{n}\\b{n}\\={u}\\b{r}\\={a}yiram",
 "Nanurayiram"      :   "N\\={a}\\b{n}\\={u}\\b{r}\\={a}yiram",
 "Ainurayiram"      :   "Ain\\={u}\\b{r}\\={a}yiram",
 "Arunurayiram"     :   "A\\b{r}un\\={u}\\b{r}\\={a}yiram",
 "Elunurayiram"     :   "E\\b{l}un\\={u}\\b{r}\\={a}yiram",
 "Ennurayiram"      :   "E\\d{n}\\d{n}\\={u}\\b{r}\\={a}yiram",
 "Tollayiramayiram" :   "To\\d{l}\\d{l}\\={a}yiram\\={a}yiram",
 "latcam"           :   "la\\d{t}cam",
 "Koti"             :   "K\\={o}\\d{t}i",
 "Ekam"             :   "\\={E}kam",
 "Maka"             :   "Mak\\={a}",
 "Per"              :   "P\\={e}r",
 "cankam"           :   "ca\\d{n}kam",
 "makacankam"       :   "mak\\={a}ca\\d{n}kam",
 "vintam"           :   "vintam",
 "makavintam"       :   "mak\\={a}vintam",
 "patuman"          :   "patuman",
 "camuttiram"       :   "camuttiram",
 "kumutam"          :   "kumutam",
 "cintu"            :   "cintu",
 "makacintu"        :   "mak\\={a}cintu",
 "vellam"           :   "ve\\d{l}\\d{l}am",
 "makavellam"       :   "mak\\={a}ve\\d{l}\\d{l}am",
 "piralayam"        :   "pira\\d{l}ayam",
 "makapiralayam"    :   "mak\\={a}pira\\d{l}ayam",
 "cancalam"         :   "ca\\~{n}calam",
 "makacancalam"     :   "mak\\={a}ca\\~{n}calam",
 "valampuri"        :   "valampuri",
 "makavalampuri"    :   "mak\\={a}valampuri",
 "tanpanai"         :   "ta\\d{n}pa\\b{n}ai",
 "makatanpanai"     :   "mak\\={a}ta\\d{n}pa\\b{n}ai",
 "kanvalai"         :   "ka\\d{n}valai",
 "makakanvalai"     :   "mak\\={a}ka\\d{n}valai",
 "anantam"          :   "a\\b{n}antam",
 "Murrirru"         :   "Mu\\b{r}\\b{r}i\\b{r}\\b{r}u",
 "Onrukkonru"       :   "O\\b{n}\\b{r}ukko\\b{n}\\b{r}u",
 "panku"            :   "pa\\.{n}ku",
 "atikamakira"      :   "atikam\\={a}ki\\b{r}a",
 "tokaikal"         :   "tokaika\\d{l}",
 "ennitankal"       :   "e\\d{n}\\d{n}i\\d{t}a\\.{n}ka\\d{l}",
 "tacakoti"         :   "tacak\\={o}\\d{t}i",
 "catakoti"         :   "catak\\={o}\\d{t}i",
 "arpputtam"        :   "arpputtam",
 "nirpputtam"       :   "nirpputtam",
 "karvam"           :   "karvam",
 "makakarvam"       :   "mak\\={a}karvam",
 "patmam"           :   "patmam",
 "makapatmam"       :   "mak\\={a}patmam",
 "kshoni"           :   "ksh\\={o}\\d{n}i",
 "cankam"           :   "ca\\.{n}kam",
 "makacankam"       :   "mak\\={a}ca\\.{n}kam",
 "kshiti"           :   "kshiti",
 "makakshiti"       :   "mak\\={a}kshiti",
 "kshopam"          :   "ksh\\={o}pam",
 "makakshopam"      :   "mak\\={a}ksh\\={o}pam",
 "niti"             :   "niti",
 "makaniti"         :   "mak\\={a}niti",
 "paratam"          :   "paratam",
 "parartam"         :   "par\\={a}rtam",
 "anantam"          :   "a\\b{n}antam",
 "cakaram"          :   "c\\={a}karam",
 "avviyam"          :   "avviyam",
 "amirtam"          :   "amirtam",
 "acintiyam"        :   "acintiyam",
 "ameyam"           :   "am\\={e}yam",
 "puri"             :   "p\\={u}ri",
 "makapuri"         :   "mak\\={a} p\\={u}ri",
 "cankyastanams"    :   "Ca\\.{n}ky\\={a}st\\={a}\\u{n}ams",
 "Orucevitu"        :   "Oru cevit\\d{u}",
 "Irucevitu"        :   "Iru cevit\\d{u}",
 "Muccevitu"        :   "Muccevi\\d{t}u",
 "Narcevitu"        :   "N\\={a}\\b{r}cevi\\d{t}u",
 "Alakke"           :   "\\={A}\\b{l}\\={a}kk\\b{e}",
 "Ulakke"           :   "U\\b{l}\\={a}kk\\b{e}",
 "Uri"              :   "Uri",
 "Uriye"            :   "Uriy\\={e}",
 "Muvalakku"        :   "M\\={u}va\\b{l}akku",
 "Muvalakke"        :   "M\\={u}va\\b{l}akke",
 "Naliye"           :   "N\\={a}liy\\={e}",
 "Irunali"          :   "Irun\\={a}\\b{l}i",
 "Munnali"          :   "Munn\\={a}\\b{l}i",
 "Nanali"           :   "N\\={a}\\b{n}\\={a}\\b{l}i",
 "Ainnali"          :   "Ain\\b{n}\\={a}\\b{l}i",
 "Arunali"          :   "Aru\\b{n}\\={a}\\b{l}i",
 "Elunali"          :   "E\\b{l}u\\b{n}\\={a}\\b{l}i",
 "Ettunali"         :   "E\\d{t}\\d{t}u\\b{n}\\={a}\\b{l}i",
 "Kuruniye"         :   "Ku\\b{r}u\\d{n}iy\\={e}",
 "Patakke"          :   "Patakk\\={e}",
 "Mukkuruni"        :   "Mukku\\b{r}u\\d{n}i",
 "Mukkuruniye"      :   "Mukku\\b{r}u\\d{n}iy\\={e}",
 "Tuniye"           :   "T\\={u}\\d{n}iy\\={e}",
 "Kalame"           :   "Kalam\\={e}",
 "OruKalam"         :   "OruKalam",
 "OruKalame"        :   "OruKalam\\={e}",
 "AruKalame"        :   "\\={A}\\b{r}uKalam\\={e}",
 "Elukalame"        :   "\\={e}\\b{l}uKalam\\={e}",
 "Orukkuruni"       :   "Orukku\\b{r}u\\d{n}i",
 "Orukkuruniye"     :   "Orukku\\b{r}u\\d{n}iye\\={e}",
 "Orupatakku"       :   "Orupatakku",
 "Orupatakke"       :   "Orupatakk\\={e}",
 "Orutuni"          :   "Orut\\={u}\\d{n}i",
 "Oruttuniye"       :   "Orutt\\={u}\\d{n}iy\\={e}",
 "kontatu"          :   "ko\\d{n}\\d{t}atu",
 "Kappu"            :   "K\\={a}ppu",
 "Netumal"          :   "Ne\\d{t}um\\={a}l",
 "tirumaruka"       :   "tirumaruk\\={a}",
 "nittan"           :   "nitta\\b{n}",
 "matalay"          :   "matal\\={a}y",
 "Kotumal"          :   "Ko\\d{t}um\\={a}l",
 "vinaiyarukkun"    :   "vi\\b{n}aiya\\b{r}ukku\\.{n}",
 "kunre"            :   "ku\\b{n}\\b{r}\\={e}",
 "tatumara"         :   "ta\\.{t}um\\={a}\\b{r}\\={a}",
 "Tenmuppatu"       :   "Te\\.{n}muppattu",
 "vayu"             :   "v\\={a}yu",
 "mencittat"        :   "me\\b{n}cittat",
 "tenirkap"         :   "t\\={e}ni\\b{r}kap",
 "Pannut"           :   "Pa\\d{n}\\d{n}ut",
 "tamane"           :   "tama\\b{n}\\={e}",
 "parintu"          :   "parintu",
 "Mallikai"         :   "Mallikai",
 "malarnta"         :   "malarnta",
 "Pu"               :   "p\\={u}",
 "Kolluvar"         :   "Ko\\b{l}\\b{l}uv\\={a}r",
 "aivar"            :   "aivar",
 "Alakunilai"       :   "Alakunilai",
 "painkili"         :   "pa.{n}ki\\.{l}i",
 "kural"            :   "kural",
 "mayirun"          :   "m\\={a}yiru\\~{n}",
 "Colai"            :   "C\\={o}lai",
 "maran"            :   "maran",
 "eria"             :   "\\={e}\\b{r}ia",
 "nayiru"           :   "\\~{n}\\={a}yi\\b{r}u",
 "pattan"           :   "pa\\d{t}\\d{t}\\={a}n",
 "karintu"          :   "ka\\b{r}intu",
 "yanai"            :   "y\\={a}\\b{n}ai",
 "kun"              :   "k\\={u}\\b{n}",
 "pakali"           :   "paka\\b{l}i",
 "payum"            :   "p\\={a}yum",
 "pakatu"           :   "paka\\d{t}u",
 "Iruvare"          :   "Iruvar\\={e}",
 "muvarukku"        :   "m\\={u}varukku",
 "initu"            :   "i\\b{n}itu",
 "amarntu"          :   "amarntu",
 "uttil"            :   "\\={u}\\d{t}\\d{t}il",
 "irunal"           :   "irun\\={a}l",
 "Vilankinum"       :   "Vi\\d{l}a\\.{n}ki\\b{n}um",
 "untakuvar"        :   "u\\d{n}\\d{t}\\={a}kuv\\={a}r",
 "Etuttal"          :   "E\\d{t}uttal",
 "Alavai"           :   "A\\d{l}avai",
 "Cer"              :   "C\\={e}r",
 "Rattal"           :   "R\\={a}ttal",
 "Katti"            :   "Ka\\d{t}\\d{t}i",
 "Vicai"            :   "V\\={i}cai",
 "Tukku"            :   "T\\={u}kku",
 "Tatai"            :   "Tatai",
 "Pattitai"         :   "Patti\\d{t}ai",
 "Mananku"          :   "Ma\\d{n}a\\.{n}ku",
 "Taracu"           :   "Tar\\={a}cu",
 "Poti"             :   "Poti",
 "Pikkal"           :   "Pikkal",
 "Marakkal"         :   "Marakk\\={a}l",
 "Varakan"          :   "Var\\={a}ka\\b{n}",
 "Varakanetai"      :   "Var\\={a}ka\\b{n}e\\d{t}ai",
 "Oncai"            :   "O\\~{n}cai",
 "Paccairati"       :   "Paccairati",
 "Muttuccavvukku"   :   "Muttuccavukku",
 "Pavalam"          :   "Pava\\d{l}am",
 "Ravai"            :   "Ravai",
 "Kalacam"          :   "Kalacam",
 "Tankamarru"       :   "Ta\\.{n}kam\\={a}\\b{r}\\b{r}u",
 "Pakku"            :   "P\\={a}kku",
 "Pakka"            :   "Pakk\\={a}",
 "Ammanam"          :   "Amma\\d{n}am",
 "Campu"            :   "C\\={a}mpu",
 "Kattu"            :   "Ka\\d{t}\\d{t}u",
 "Vatam"            :   "Va\\d{t}am",
 "Cilai"            :   "C\\={i}lai",
 "Mati"             :   "Ma\\d{t}i",
 "Cavukkali"        :   "Cavukka\\d{l}i",
 "Putavai"          :   "Pu\\d{t}avai",
 "Karacai"          :   "Karacai",
 "Encuvati"         :   "E\\d{n}cuvati",
 "Melvai"           :   "M\\={e}lvai",
 "Cirrilakkam"      :   "Ci\\b{r}\\b{r}ilakkam",
 "Kuli"             :   "Ku\\b{l}i",
 "Cirukuli"         :   "Ci\\b{r}uku\\b{l}i",
 "Ponnilakkam"      :   "Po\\b{n}\\b{n}ilakkam",
 "Nellilakkam"      :   "Nellilakkam"
 }
