<?xml version="1.0" standalone="no"?>
<!DOCTYPE svg PUBLIC "-//W3C//DTD SVG 1.1//EN" "http://www.w3.org/Graphics/SVG/1.1/DTD/svg11.dtd" >
<svg xmlns="http://www.w3.org/2000/svg" xmlns:xlink="http://www.w3.org/1999/xlink" version="1.1" viewBox="0 -676 2982 2048">
  <g transform="matrix(1 0 0 -1 0 1638)">
   <path fill="currentColor"
d="M2072 886v-346h246v346h-246zM544 70q70 0 117 56t47 132q0 78 -47 133t-117 55q-68 0 -116 -55t-48 -133t49 -133t115 -55zM2096 74q90 0 156 58t66 138v172h-370q-52 0 -87 -35t-35 -87q0 -100 79 -173t191 -73zM1948 788v196h836v-98h-344v-346h98q142 0 243 -86
t101 -208q0 -204 -136 -348t-330 -144h-1268q-62 0 -104 -50t-42 -122q0 -50 25 -95t73 -77l-74 -86q-68 40 -108 108t-40 150q0 114 79 192t191 78h1268q142 0 243 116t101 278q0 82 -65 139t-157 57h-98v-172q0 -122 -101 -208t-243 -86q-162 0 -278 101t-116 243
q0 90 73 155t173 65v46q-178 262 -366 282q-10 0 -20 -2q-36 -6 -62 -38q-34 -42 -34 -102v-726h-616v70q56 70 87 154t31 174q0 214 -102 342t-274 128q-176 0 -281 -128t-105 -342q0 -82 34 -155t94 -127q-22 40 -34 77t-12 65q0 116 75 199t181 83q110 0 185 -82t75 -200
q0 -116 -90 -198t-216 -82q-164 0 -281 123t-117 297q0 256 135 410t357 154q224 0 358 -154t134 -410q0 -70 -24 -147t-70 -157h358v632q0 96 70 166t164 70q8 0 16 -2h4q184 0 346 -172z" />
  </g>

</svg>
