<?xml version="1.0" encoding="UTF-8" standalone="no"?>
<!-- Created with Inkscape (http://www.inkscape.org/) -->

<svg
   xmlns:dc="http://purl.org/dc/elements/1.1/"
   xmlns:cc="http://creativecommons.org/ns#"
   xmlns:rdf="http://www.w3.org/1999/02/22-rdf-syntax-ns#"
   xmlns:svg="http://www.w3.org/2000/svg"
   xmlns="http://www.w3.org/2000/svg"
   xmlns:sodipodi="http://sodipodi.sourceforge.net/DTD/sodipodi-0.dtd"
   xmlns:inkscape="http://www.inkscape.org/namespaces/inkscape"
   version="1.1"
   id="svg2074"
   width="87.823532"
   height="81.888687"
   viewBox="0 0 87.823532 81.888687"
   sodipodi:docname="2.svg"
   inkscape:version="0.92.3 (2405546, 2018-03-11)">
  <metadata
     id="metadata2080">
    <rdf:RDF>
      <cc:Work
         rdf:about="">
        <dc:format>image/svg+xml</dc:format>
        <dc:type
           rdf:resource="http://purl.org/dc/dcmitype/StillImage" />
        <dc:title></dc:title>
      </cc:Work>
    </rdf:RDF>
  </metadata>
  <defs
     id="defs2078" />
  <sodipodi:namedview
     pagecolor="#ffffff"
     bordercolor="#666666"
     borderopacity="1"
     objecttolerance="10"
     gridtolerance="10"
     guidetolerance="10"
     inkscape:pageopacity="0"
     inkscape:pageshadow="2"
     inkscape:window-width="1366"
     inkscape:window-height="705"
     id="namedview2076"
     showgrid="false"
     fit-margin-top="0"
     fit-margin-left="0"
     fit-margin-right="0"
     fit-margin-bottom="0"
     inkscape:zoom="4.25"
     inkscape:cx="17.83181"
     inkscape:cy="47.823802"
     inkscape:window-x="0"
     inkscape:window-y="30"
     inkscape:window-maximized="1"
     inkscape:current-layer="svg2074" />
  <path
     style="fill:none;stroke:#000000;stroke-width:1px;stroke-linecap:butt;stroke-linejoin:miter;stroke-opacity:1"
     d="m 9.55882,43.152691 c 0,0 -2.82353,-5.176471 -4.23529,-11.058824 -1.41177,-5.882353 2.82353,-17.17647 2.82353,-17.17647 0,0 2.11764,-3.882353 6.35294,-6.4705886 4.23529,-2.588235 10.35294,-6.470588 14.58823,-7.411764 4.2353,-0.94117699 16.82353,-0.35294199 16.82353,-0.35294199 0,0 7.29412,0.117647 10.82353,1.29411799 3.52941,1.176471 11.17647,4.470588 13.76471,6.705882 2.58823,2.2352946 7.41176,8.5882356 8.58823,11.8823526 1.17647,3.294118 1.52941,12.82353 -0.11764,16.352942 C 77.32353,40.446808 70.02941,47.97622 67.20588,49.270338 64.38235,50.564455 56.2647,55.152691 56.2647,55.152691 L 43.67647,59.623279 34.38235,62.682102 26.5,64.917397 19.20588,69.035044 c 0,0 -0.77637,0.185896 -0.31883,0.934598 0.45754,0.748701 5.44888,0.37435 5.44888,0.37435 L 48.5,69.623279 h 38.82353 v 11.411767 l -81.76471,0.35294 c 0,0 -5.05882,-3.64706 -5.05882,-10.000001 0,-6.352941 5.7647,-11.647059 5.7647,-11.647059 L 26.5,52.211514 l 19.7647,-7.058823 16,-9.411765 c 0,0 6.47059,-3.529412 5.17647,-10.705882 -1.29411,-7.176471 -8.11764,-11.882353 -25.17647,-12.235295 -17.05882,-0.352941 -12.94117,0.235295 -18,3.764706 -5.05882,3.529412 -4.58823,8.941177 -4.82353,14.705883 -0.23529,5.764706 0.94118,9.764706 0.94118,9.764706 z"
     id="path2084"
     inkscape:connector-curvature="0" />
</svg>
