<?xml version="1.0" encoding="UTF-8" standalone="no"?>
<!-- Created with Inkscape (http://www.inkscape.org/) -->

<svg
   xmlns:dc="http://purl.org/dc/elements/1.1/"
   xmlns:cc="http://creativecommons.org/ns#"
   xmlns:rdf="http://www.w3.org/1999/02/22-rdf-syntax-ns#"
   xmlns:svg="http://www.w3.org/2000/svg"
   xmlns="http://www.w3.org/2000/svg"
   xmlns:sodipodi="http://sodipodi.sourceforge.net/DTD/sodipodi-0.dtd"
   xmlns:inkscape="http://www.inkscape.org/namespaces/inkscape"
   width="1.662603mm"
   height="1.1215278mm"
   viewBox="0 0 1.662603 1.1215278"
   version="1.1"
   id="svg3454"
   inkscape:version="0.92.4 (unknown)"
   sodipodi:docname="ஆறுமுகம் துணை.svg">
  <defs
     id="defs3448" />
  <sodipodi:namedview
     id="base"
     pagecolor="#ffffff"
     bordercolor="#666666"
     borderopacity="1.0"
     inkscape:pageopacity="0.0"
     inkscape:pageshadow="2"
     inkscape:zoom="196.75169"
     inkscape:cx="3.1419167"
     inkscape:cy="2.1194148"
     inkscape:document-units="mm"
     inkscape:current-layer="layer1"
     showgrid="false"
     inkscape:window-width="1920"
     inkscape:window-height="1017"
     inkscape:window-x="0"
     inkscape:window-y="30"
     inkscape:window-maximized="1"
     fit-margin-top="0"
     fit-margin-left="0"
     fit-margin-right="0"
     fit-margin-bottom="0" />
  <metadata
     id="metadata3451">
    <rdf:RDF>
      <cc:Work
         rdf:about="">
        <dc:format>image/svg+xml</dc:format>
        <dc:type
           rdf:resource="http://purl.org/dc/dcmitype/StillImage" />
        <dc:title></dc:title>
      </cc:Work>
    </rdf:RDF>
  </metadata>
  <g
     inkscape:label="Layer 1"
     inkscape:groupmode="layer"
     id="layer1"
     transform="translate(124.80749,-199.67733)">
    <g
       transform="matrix(0.35277777,0,0,0.35277777,-289.32893,132.53762)"
       id="g1511"
       style="fill:#211e1e;fill-opacity:1">
      <g
         id="use1509"
         transform="matrix(0.26458333,0,0,0.26458333,466.35999,192.62)">
        <path
           inkscape:connector-curvature="0"
           id="path3466"
           d="m 16.046875,-7.015625 c 0,-0.984375 -0.640625,-1.6875 -1.8125,-1.6875 -0.953125,0 -1.46875,0.28125 -1.984375,1.203125 l 0.765625,0.546875 C 13.203125,-7.34375 13.6875,-7.8125 14.28125,-7.8125 c 0.453125,0 0.796875,0.25 0.796875,0.8125 0,0.515625 -0.578125,0.828125 -1.03125,0.828125 -0.6875,0 -3.75,-1.484375 -6.53125,-1.484375 C 5.703125,-7.65625 4.25,-7.5 2.96875,-6.890625 1.171875,-6.03125 0,-4.421875 0,-1.953125 0,1.1875 2.53125,3.3125 6.109375,3.3125 c 2.546875,0 5.421875,-1.59375 5.421875,-3.71875 V -5.5 h -0.953125 v 2.140625 H 9.9375 c -0.203125,-1.46875 -1.296875,-2.5 -2.765625,-2.5 C 5.90625,-5.859375 4.84375,-5.5 4.375,-4.21875 l 0.859375,0.375 c 0.3125,-0.859375 0.9375,-1.203125 1.796875,-1.203125 1.25,0 1.65625,0.96875 1.90625,1.6875 H 3.828125 c -0.6875,0 -1.671875,0.46875 -1.671875,1.671875 0,1.6875 1.84375,2.75 3.640625,2.75 2.171875,0 4.125,-1.265625 4.125,-3.484375 h 0.6875 v 1.84375 c 0,1.640625 -1.828125,3 -4.546875,3 -2.453125,0 -5.21875,-1.453125 -5.21875,-4.390625 0,-3.40625 2.65625,-4.875 6.453125,-4.875 3.09375,0 5.1875,1.46875 6.765625,1.46875 1.125,0 1.984375,-0.46875 1.984375,-1.640625 z m 1.765625,3.8125 c 0,-0.625 -0.28125,-1.140625 -1.078125,-1.140625 -0.796875,0 -1.328125,0.515625 -1.109375,1.421875 h -0.859375 v -1 h 0.65625 v -0.875 H 12.5 v 2 c -0.46875,0.328125 -0.65625,0.78125 -0.65625,1.359375 0,0.953125 0.703125,1.578125 1.578125,1.578125 0.71875,0 1.390625,-0.578125 1.390625,-1.25 V -2.0625 h 0.8125 v 2.78125 h 0.921875 V -2.0625 C 17.34375,-2.109375 17.8125,-2.53125 17.8125,-3.203125 Z m -3.875,0.28125 h -0.546875 v -1 H 13.9375 Z m 2.96875,-0.3125 c 0,0.140625 -0.01563,0.25 -0.140625,0.25 h -0.28125 v -0.3125 c 0,-0.109375 0.140625,-0.171875 0.25,-0.171875 0.1875,0 0.171875,0.0625 0.171875,0.234375 z m -2.9375,1.90625 c 0,0.296875 -0.171875,0.546875 -0.5,0.546875 -0.390625,0 -0.640625,-0.203125 -0.640625,-0.703125 0,-0.234375 0.140625,-0.546875 0.390625,-0.546875 h 0.75 z m -5.0625,-1.0625 c -0.109375,1.703125 -1.546875,2.59375 -3.1875,2.59375 -1.40625,0 -2.5625,-1.046875 -2.5625,-1.640625 0,-0.640625 0.078125,-0.953125 0.59375,-0.953125 z m 0,0"
           style="stroke:none" />
      </g>
    </g>
  </g>
</svg>
