<?xml version="1.0" encoding="UTF-8" standalone="no"?>
<svg
   xmlns:dc="http://purl.org/dc/elements/1.1/"
   xmlns:cc="http://creativecommons.org/ns#"
   xmlns:rdf="http://www.w3.org/1999/02/22-rdf-syntax-ns#"
   xmlns:svg="http://www.w3.org/2000/svg"
   xmlns="http://www.w3.org/2000/svg"
   xmlns:sodipodi="http://sodipodi.sourceforge.net/DTD/sodipodi-0.dtd"
   xmlns:inkscape="http://www.inkscape.org/namespaces/inkscape"
   version="1.1"
   viewBox="0 -205 898 1106"
   id="svg6"
   sodipodi:docname="multiply.svg"
   width="898"
   height="1106"
   inkscape:version="0.92.3 (2405546, 2018-03-11)">
  <metadata
     id="metadata12">
    <rdf:RDF>
      <cc:Work
         rdf:about="">
        <dc:format>image/svg+xml</dc:format>
        <dc:type
           rdf:resource="http://purl.org/dc/dcmitype/StillImage" />
        <dc:title></dc:title>
      </cc:Work>
    </rdf:RDF>
  </metadata>
  <defs
     id="defs10" />
  <sodipodi:namedview
     pagecolor="#ffffff"
     bordercolor="#666666"
     borderopacity="1"
     objecttolerance="10"
     gridtolerance="10"
     guidetolerance="10"
     inkscape:pageopacity="0"
     inkscape:pageshadow="2"
     inkscape:window-width="1366"
     inkscape:window-height="705"
     id="namedview8"
     showgrid="false"
     fit-margin-top="0"
     fit-margin-left="0"
     fit-margin-right="0"
     fit-margin-bottom="0"
     showborder="false"
     inkscape:zoom="0.4609375"
     inkscape:cx="530.64624"
     inkscape:cy="544.86334"
     inkscape:window-x="0"
     inkscape:window-y="30"
     inkscape:window-maximized="1"
     inkscape:current-layer="svg6"
     showguides="true"
     inkscape:guide-bbox="true">
    <sodipodi:guide
       position="673.45329,811.51889"
       orientation="0,1"
       id="guide14"
       inkscape:locked="false" />
    <sodipodi:guide
       position="539.22285,757.82671"
       orientation="0,1"
       id="guide16"
       inkscape:locked="false" />
  </sodipodi:namedview>
  <g
     transform="matrix(1,0,0,-1,-7,713)"
     id="g4">
    <path
       d="m 392.97687,424.5 c 0,25.58301 -24.361,119.00608 -82.50161,119.00608 -64.93768,0 -39.16118,-92.83253 -24.6952,-146.82031 l -50.19609,-0.31567 c 0,0 -70.4888,201.27712 80.83899,201.27712 60.34372,0 102.43708,-95.90345 102.43708,-95.90345 0,0 22.92206,95.25623 116.13996,95.25623 161.2876,0 158.2538,-194.91937 142,-315.5 -4,-29 -10,-54.5 -18,-76.5 51.3333,-18.6667 92.8333,-50.5 124.5,-95.5 31.6667,-45 47.5,-95.1667 47.5,-150.5 0,-40.6667 -16.8333,-75.3333 -50.5,-104 -33.6667,-28.6667 -74.1667,-43 -121.5,-43 -46,0 -90.3333,7.33333 -133,22 -42.6667,14.6667 -80.3333,36 -113,64 -32.6667,-28 -72.3333,-49.3333 -119,-64 -46.6667,-14.6667 -97,-22 -151,-22 -38,0 -70.1667,13 -96.5,39 C 20.1667,-123 7,-91 7,-53 7,-13.6667 20.3333,23.6667 47,59 73.6667,94.3333 109.6667,122.6667 155,144 127,193.3333 105.6667,245 91,299 76.3333,353 69,407.667 69,463 69,588.333 112.1667,695.5 198.5,784.5 284.8333,873.5 389,918 511,918 619.667,918 712.5,877.1667 789.5,795.5 866.5,713.8333 905,615.333 905,500 V 119 H 843 V 500 C 843,601.333 810.6667,688.167 746,760.5 681.3333,832.833 603,869 511,869 406.333,869 316.667,829.5 242,750.5 167.333,671.5 130,575.667 130,463 c 0,-50.6667 6.33333,-100 19,-148 12.66667,-48 31,-93 55,-135 35.3333,20.6667 75.6667,36.1667 121,46.5 45.3333,10.3333 95.3333,15.5 150,15.5 22,0 44.5,-2 67.5,-6 23,-4 45.5,-10.3333 67.5,-19 43.18096,201.41766 17.43247,317.44677 -73.45761,326.23068 -46.60318,0 -78.47652,-56.30117 -89.06552,-117.23068 z M 90.5,-114 c 14.3333,-16.6667 31.8333,-25 52.5,-25 38.6667,0 76.3333,5.66667 113,17 36.6667,11.3333 70.6667,28 102,50 -42,29.3333 -78,59 -108,89 -30,30 -53.6667,60 -71,90 C 145.6667,89.6667 119,66.6667 99,38 79,9.3333 69,-21 69,-53 c 0,-24 7.16667,-44.3333 21.5,-61 z m 222,153.5 C 341.5,11.1667 375,-13.6667 413,-35 c 42.6667,30 78.6667,62.3333 108,97 29.3333,34.6667 50.6667,70 64,106 -22,8 -42.5,14.1667 -61.5,18.5 -19,4.3333 -35.1667,6.5 -48.5,6.5 -42,0 -82.6667,-5.16667 -122,-15.5 C 313.6667,167.16667 276.3333,151.6667 241,131 259.6667,98.3333 283.5,67.8333 312.5,39.5 Z M 570,-122 c 33.3333,-11.3333 63,-17 89,-17 30,0 56,9.66667 78,29 22,19.3333 33,42.3333 33,69 0,44 -12.3333,84.1667 -37,120.5 -24.6667,36.3333 -57.6667,61.8333 -99,76.5 -17.3333,-46.6667 -40.5,-89.5 -69.5,-128.5 -29,-39 -63.1667,-72.1667 -102.5,-99.5 38.6667,-22 74.6667,-38.6667 108,-50 z"
       id="path2"
       inkscape:connector-curvature="0"
       style="fill:currentColor"
       sodipodi:nodetypes="ccccsccccssssscssssscssssssccsssssscssscccccsscscsscscscssscsssssscscs" />
  </g>
</svg>
