<?xml version="1.0" encoding="UTF-8" standalone="no"?>
<!-- Created with Inkscape (http://www.inkscape.org/) -->

<svg
   xmlns:dc="http://purl.org/dc/elements/1.1/"
   xmlns:cc="http://creativecommons.org/ns#"
   xmlns:rdf="http://www.w3.org/1999/02/22-rdf-syntax-ns#"
   xmlns:svg="http://www.w3.org/2000/svg"
   xmlns="http://www.w3.org/2000/svg"
   xmlns:sodipodi="http://sodipodi.sourceforge.net/DTD/sodipodi-0.dtd"
   xmlns:inkscape="http://www.inkscape.org/namespaces/inkscape"
   width="1.1856985mm"
   height="0.78754878mm"
   viewBox="0 0 1.1856985 0.78754878"
   version="1.1"
   id="svg3301"
   inkscape:version="0.92.4 (unknown)"
   sodipodi:docname="முதலியார்.svg">
  <defs
     id="defs3295" />
  <sodipodi:namedview
     id="base"
     pagecolor="#ffffff"
     bordercolor="#666666"
     borderopacity="1.0"
     inkscape:pageopacity="0.0"
     inkscape:pageshadow="2"
     inkscape:zoom="256"
     inkscape:cx="2.2406777"
     inkscape:cy="1.4882881"
     inkscape:document-units="mm"
     inkscape:current-layer="layer1"
     showgrid="false"
     fit-margin-top="0"
     fit-margin-left="0"
     fit-margin-right="0"
     fit-margin-bottom="0"
     inkscape:window-width="1920"
     inkscape:window-height="1017"
     inkscape:window-x="0"
     inkscape:window-y="30"
     inkscape:window-maximized="1" />
  <metadata
     id="metadata3298">
    <rdf:RDF>
      <cc:Work
         rdf:about="">
        <dc:format>image/svg+xml</dc:format>
        <dc:type
           rdf:resource="http://purl.org/dc/dcmitype/StillImage" />
        <dc:title></dc:title>
      </cc:Work>
    </rdf:RDF>
  </metadata>
  <g
     inkscape:label="Layer 1"
     inkscape:groupmode="layer"
     id="layer1"
     transform="translate(199.40832,-138.61218)">
    <g
       transform="matrix(0.35277777,0,0,0.35277777,-363.92101,94.037864)"
       id="g1457"
       style="fill:#211e1e;fill-opacity:1">
      <g
         id="use1455"
         transform="matrix(0.26458333,0,0,0.26458333,466.35999,127.82)">
        <path
           inkscape:connector-curvature="0"
           id="path3313"
           d="m 12.609375,-1.796875 v -0.96875 H 8.1875 v 3.21875 H 4.53125 v -0.46875 h 0.625 c 1.375,0 2.609375,-1.0625 2.609375,-2.703125 0,-1.8125 -0.765625,-2.828125 -2.28125,-2.828125 h -1.9375 v 4.625 H 0.96875 v -4.5625 H 0 V 0 H 3.578125 V 0.46875 H 1.21875 c -0.546875,0 -1.3125,0.203125 -1.3125,1.015625 0,1.078125 1.234375,1.40625 2.203125,1.40625 1.4375,0 2.015625,-0.40625 2.421875,-1.59375 H 9.109375 V -1.8125 h 1.734375 v 3.03125 h 1.078125 V -1.796875 Z M 6.890625,-2.78125 c 0,1.09375 -0.765625,1.859375 -1.6875,1.859375 h -0.625 V -4.625 h 1.0625 c 0.859375,0 1.25,0.984375 1.25,1.84375 z m -3.4375,4.078125 C 3.296875,1.90625 2.71875,2 2.078125,2 1.640625,2 0.984375,1.921875 0.984375,1.578125 c 0,-0.140625 0.09375,-0.28125 0.203125,-0.28125 z m 0,0"
           style="stroke:none" />
      </g>
    </g>
  </g>
</svg>
