<?xml version="1.0" standalone="no"?>
<!DOCTYPE svg PUBLIC "-//W3C//DTD SVG 1.1//EN" "http://www.w3.org/Graphics/SVG/1.1/DTD/svg11.dtd" >
<svg xmlns="http://www.w3.org/2000/svg" xmlns:xlink="http://www.w3.org/1999/xlink" version="1.1" viewBox="0 -324 924 1024">
  <g transform="matrix(1 0 0 -1 0 700)">
   <path fill="currentColor"
d="M204 148q0 -41 21.5 -70t52.5 -29t52.5 29t21.5 70q0 36 -21.5 61t-52.5 25t-52.5 -25.5t-21.5 -60.5zM487 492h430v-49h-135v-443h-62v443h-184v-443h-61v246q0 86 -54.5 147.5t-130.5 61.5t-130 -64.5t-54 -156.5q0 -47 19 -89t54 -71q-12 21 -18 40t-6 34q0 57 36 96
t87 39q50 0 86.5 -39.5t36.5 -95.5q0 -66 -43 -113t-105 -47q-81 0 -138.5 72t-57.5 174q0 112 68 191t165 79q65 0 118 -26.5t79 -71.5v86z" />
  </g>

</svg>
