<?xml version="1.0" encoding="UTF-8" standalone="no"?>
<!-- Created with Inkscape (http://www.inkscape.org/) -->

<svg
   xmlns:dc="http://purl.org/dc/elements/1.1/"
   xmlns:cc="http://creativecommons.org/ns#"
   xmlns:rdf="http://www.w3.org/1999/02/22-rdf-syntax-ns#"
   xmlns:svg="http://www.w3.org/2000/svg"
   xmlns="http://www.w3.org/2000/svg"
   xmlns:sodipodi="http://sodipodi.sourceforge.net/DTD/sodipodi-0.dtd"
   xmlns:inkscape="http://www.inkscape.org/namespaces/inkscape"
   width="106.7197mm"
   height="51.325871mm"
   viewBox="0 0 106.7197 51.325871"
   version="1.1"
   id="svg4666"
   inkscape:version="0.91 r13725"
   sodipodi:docname="mukkani - முக்காணி.svg">
  <defs
     id="defs4660" />
  <sodipodi:namedview
     id="base"
     pagecolor="#ffffff"
     bordercolor="#666666"
     borderopacity="1.0"
     inkscape:pageopacity="0.0"
     inkscape:pageshadow="2"
     inkscape:zoom="2.8"
     inkscape:cx="306.0217"
     inkscape:cy="46.274276"
     inkscape:document-units="mm"
     inkscape:current-layer="layer1"
     showgrid="true"
     showguides="true"
     inkscape:guide-bbox="true"
     inkscape:measure-start="412.143,701.964"
     inkscape:measure-end="422.177,701.964"
     inkscape:snap-global="false"
     inkscape:window-width="1366"
     inkscape:window-height="705"
     inkscape:window-x="0"
     inkscape:window-y="30"
     inkscape:window-maximized="1"
     fit-margin-top="0"
     fit-margin-left="0"
     fit-margin-right="0"
     fit-margin-bottom="0"
     showborder="false">
    <sodipodi:guide
       position="57.931833,32.588117"
       orientation="0,1"
       id="guide4685"
       inkscape:locked="false" />
    <sodipodi:guide
       position="52.992944,34.855967"
       orientation="1,0"
       id="guide4691"
       inkscape:locked="false" />
    <sodipodi:guide
       position="78.392939,17.620258"
       orientation="1,0"
       id="guide4703"
       inkscape:locked="false" />
    <sodipodi:guide
       position="80.509609,0.082158685"
       orientation="0,1"
       id="guide3475" />
    <sodipodi:guide
       position="65.692943,22.508748"
       orientation="1,0"
       id="guide3371" />
    <sodipodi:guide
       position="101.09844,16.420558"
       orientation="0,1"
       id="guide3373" />
    <inkscape:grid
       type="xygrid"
       id="grid3352"
       originx="-27.440386"
       originy="-186.1341" />
    <sodipodi:guide
       position="107.15654,17.881628"
       orientation="0,1"
       id="guide3395" />
    <sodipodi:guide
       position="101.18752,18.291448"
       orientation="1,0"
       id="guide4176" />
    <sodipodi:guide
       position="98.728648,20.661238"
       orientation="0,1"
       id="guide4185" />
  </sodipodi:namedview>
  <metadata
     id="metadata4663">
    <rdf:RDF>
      <cc:Work
         rdf:about="">
        <dc:format>image/svg+xml</dc:format>
        <dc:type
           rdf:resource="http://purl.org/dc/dcmitype/StillImage" />
        <dc:title></dc:title>
        <cc:license
           rdf:resource="http://creativecommons.org/publicdomain/zero/1.0/" />
      </cc:Work>
      <cc:License
         rdf:about="http://creativecommons.org/publicdomain/zero/1.0/">
        <cc:permits
           rdf:resource="http://creativecommons.org/ns#Reproduction" />
        <cc:permits
           rdf:resource="http://creativecommons.org/ns#Distribution" />
        <cc:permits
           rdf:resource="http://creativecommons.org/ns#DerivativeWorks" />
      </cc:License>
    </rdf:RDF>
  </metadata>
  <g
     inkscape:label="Layer 1"
     inkscape:groupmode="layer"
     id="layer1"
     transform="translate(-27.440387,-59.540024)">
    <g
       id="g3359"
       transform="translate(0,-1.6933333)">
      <rect
         y="61.303913"
         x="27.510942"
         height="16.96777"
         width="51.964855"
         id="rect3347"
         style="opacity:1;fill:#1a1a1a;fill-opacity:1;stroke:#ff2a2a;stroke-width:0.14111111;stroke-linecap:round;stroke-linejoin:round;stroke-miterlimit:4;stroke-dasharray:0.28222222, 0.28222222;stroke-dashoffset:0;stroke-opacity:1" />
      <text
         sodipodi:linespacing="125%"
         id="text3339"
         y="64.448685"
         x="28.661133"
         style="font-style:normal;font-weight:normal;font-size:9.63140392px;line-height:125%;font-family:sans-serif;letter-spacing:0px;word-spacing:0px;fill:#f9f9f9;fill-opacity:1;stroke:none;stroke-width:1px;stroke-linecap:butt;stroke-linejoin:miter;stroke-opacity:1"
         xml:space="preserve"><tspan
           style="font-style:normal;font-variant:normal;font-weight:normal;font-stretch:normal;font-size:3.00981379px;font-family:'American Typewriter';-inkscape-font-specification:'American Typewriter';fill:#f9f9f9"
           y="64.448685"
           x="28.661133"
           id="tspan3341"
           sodipodi:role="line">Glyph name :</tspan></text>
      <text
         xml:space="preserve"
         style="font-style:normal;font-weight:normal;font-size:11.28888893px;line-height:125%;font-family:sans-serif;letter-spacing:0px;word-spacing:0px;fill:#f9f9f9;fill-opacity:1;stroke:none;stroke-width:1px;stroke-linecap:butt;stroke-linejoin:miter;stroke-opacity:1"
         x="48.655766"
         y="64.322769"
         id="text3343"
         sodipodi:linespacing="125%"><tspan
           sodipodi:role="line"
           id="tspan3345"
           x="48.655766"
           y="64.322769"
           style="font-style:normal;font-variant:normal;font-weight:normal;font-stretch:normal;font-size:3.52777791px;font-family:'Uni Ila.Sundaram-07';-inkscape-font-specification:'Uni Ila.Sundaram-07';fill:#f9f9f9">முக்காணி</tspan></text>
      <text
         sodipodi:linespacing="125%"
         id="text3349"
         y="67.64711"
         x="29.506556"
         style="font-style:normal;font-weight:normal;font-size:11.28888893px;line-height:125%;font-family:sans-serif;letter-spacing:0px;word-spacing:0px;fill:#000000;fill-opacity:1;stroke:none;stroke-width:1px;stroke-linecap:butt;stroke-linejoin:miter;stroke-opacity:1"
         xml:space="preserve"><tspan
           style="font-style:normal;font-variant:normal;font-weight:normal;font-stretch:normal;font-size:1.76388896px;font-family:'American Typewriter';-inkscape-font-specification:'American Typewriter';fill:#ffffff"
           y="67.64711"
           x="29.506556"
           id="tspan3351"
           sodipodi:role="line">1. start with the raster image, resize, trace to vector.</tspan><tspan
           id="tspan3355"
           style="font-style:normal;font-variant:normal;font-weight:normal;font-stretch:normal;font-size:1.76388896px;font-family:'American Typewriter';-inkscape-font-specification:'American Typewriter';fill:#ffffff"
           y="69.851974"
           x="29.506556"
           sodipodi:role="line">2. use guidelines, boxes, simple geometries to edit.</tspan><tspan
           id="tspan3353"
           style="font-style:normal;font-variant:normal;font-weight:normal;font-stretch:normal;font-size:1.76388896px;font-family:'American Typewriter';-inkscape-font-specification:'American Typewriter';fill:#ffffff"
           y="72.056831"
           x="29.506556"
           sodipodi:role="line">3. use reduction process to remove unnecessary nodes.</tspan><tspan
           id="tspan3357"
           style="font-style:normal;font-variant:normal;font-weight:normal;font-stretch:normal;font-size:1.76388896px;font-family:'American Typewriter';-inkscape-font-specification:'American Typewriter';fill:#ffffff"
           y="74.261696"
           x="29.506556"
           sodipodi:role="line">4. use node tools to symmetrize and align with curvature.</tspan><tspan
           style="font-style:normal;font-variant:normal;font-weight:normal;font-stretch:normal;font-size:1.76388896px;font-family:'American Typewriter';-inkscape-font-specification:'American Typewriter';fill:#ffffff"
           y="76.466553"
           x="29.506556"
           sodipodi:role="line"
           id="tspan3375">5. use grids and snaps wherever possible.</tspan></text>
    </g>
    <rect
       y="78.363297"
       x="80.48098"
       height="32.432041"
       width="25.384886"
       id="rect4157"
       style="opacity:1;fill:none;fill-opacity:1;stroke:#ff2a2a;stroke-width:0.14111114;stroke-linecap:round;stroke-linejoin:round;stroke-miterlimit:4;stroke-dasharray:0.28222223, 0.28222223;stroke-dashoffset:0;stroke-opacity:1" />
    <g
       id="g4159"
       transform="translate(0.213703,1.0920268)">
      <path
         style="color:#000000;font-style:normal;font-variant:normal;font-weight:normal;font-stretch:normal;font-size:medium;line-height:normal;font-family:sans-serif;text-indent:0;text-align:start;text-decoration:none;text-decoration-line:none;text-decoration-style:solid;text-decoration-color:#000000;letter-spacing:normal;word-spacing:normal;text-transform:none;direction:ltr;block-progression:tb;writing-mode:lr-tb;baseline-shift:baseline;text-anchor:start;white-space:normal;clip-rule:nonzero;display:inline;overflow:visible;visibility:visible;opacity:1;isolation:auto;mix-blend-mode:normal;color-interpolation:sRGB;color-interpolation-filters:linearRGB;solid-color:#000000;solid-opacity:1;fill:#000000;fill-opacity:1;fill-rule:evenodd;stroke:none;stroke-width:1.69333339;stroke-linecap:butt;stroke-linejoin:miter;stroke-miterlimit:4;stroke-dasharray:none;stroke-dashoffset:0;stroke-opacity:1;color-rendering:auto;image-rendering:auto;shape-rendering:auto;text-rendering:auto;enable-background:accumulate"
         d="m 299.79297,280.71875 0,30.92187 c -5.63486,0 -12.73112,8.11425 -12.87891,17.18946 0,13.02783 9.29991,17.14153 20.04679,17.23047 10.75134,-0.36873 19.39877,-8.2624 19.53915,-17.39063 l 0,-11.18359 c 7.25014,0 11.35112,1.62961 11.55404,7.14258 l 0,20.70838 6,0 0,-20.70838 c 0,-5.42845 4.3341,-7.05588 10.92234,-7.05588 6.46063,0 12.8526,3.24751 13.00619,11.8449 0,22.06447 -56.57082,22.56946 -56.57082,43.97373 0,11.12564 8.71605,16.07255 18.61436,16.1103 10.70246,0 19.46097,-4.55667 19.46097,-15.65223 0,-3.4784 -2.7289,-9.64 -6.29603,-13.20714 l -4.24219,4.24219 c 2.55107,2.55107 4.47917,6.68405 4.47917,9.02486 0,8.25062 -8.18675,9.51299 -13.40192,9.59232 -6.23723,0 -12.53883,-3.12852 -12.61436,-10.1103 0,-15.2235 55.16194,-19.03286 55.93948,-43.97369 0,-11.71268 -8.99556,-17.97842 -18.36541,-17.97842 -2.77373,0 -10.54569,0.33408 -13.66651,5.30485 -1.84214,-2.96547 -4.10708,-5.16698 -9.17056,-5.16698 l -5.64908,-0.0911 0,-24.76758 24.01953,0 0,-6 z m 6,6 14.70703,0 0,24.71289 c -5.18497,-0.0608 -10.12862,-0.11827 -14.70703,-0.14062 z m -2.99609,30.55273 c 5.21695,0 11.38949,0.0864 17.70312,0.16016 l 0,11.23828 c -0.10166,7.10921 -6.94622,11.32256 -13.53915,11.39063 -8.00324,0.066 -13.94984,-3.43012 -14.04679,-11.23047 0.28032,-5.72654 3.64823,-11.4075 9.88282,-11.5586 z"
         transform="matrix(0.28222222,0,0,0.28222222,-0.213703,-1.0920268)"
         id="path4161"
         inkscape:connector-curvature="0"
         sodipodi:nodetypes="ccccccccccccccsccscccccccccccccccccccccc" />
    </g>
    <text
       sodipodi:linespacing="125%"
       id="text4171"
       y="62.755352"
       x="120.74439"
       style="font-style:normal;font-weight:normal;font-size:9.63140392px;line-height:125%;font-family:sans-serif;letter-spacing:0px;word-spacing:0px;fill:#f9f9f9;fill-opacity:1;stroke:none;stroke-width:1px;stroke-linecap:butt;stroke-linejoin:miter;stroke-opacity:1"
       xml:space="preserve"><tspan
         style="font-style:normal;font-variant:normal;font-weight:normal;font-stretch:normal;font-size:3.00981379px;font-family:'American Typewriter';-inkscape-font-specification:'American Typewriter';fill:#f9f9f9"
         y="62.755352"
         x="120.74439"
         id="tspan4173"
         sodipodi:role="line" /></text>
    <rect
       style="opacity:1;fill:none;fill-opacity:1;stroke:#ff2a2a;stroke-width:0.14111114;stroke-linecap:round;stroke-linejoin:round;stroke-miterlimit:4;stroke-dasharray:0.28222223, 0.28222223;stroke-dashoffset:0;stroke-opacity:1"
       id="rect3364"
       width="25.384886"
       height="32.432041"
       x="108.70464"
       y="78.363297" />
    <g
       transform="matrix(1.0588533,0,0,1.0588533,23.732392,-1.6783642)"
       id="g3366">
      <path
         style="color:#000000;font-style:normal;font-variant:normal;font-weight:normal;font-stretch:normal;font-size:medium;line-height:normal;font-family:sans-serif;text-indent:0;text-align:start;text-decoration:none;text-decoration-line:none;text-decoration-style:solid;text-decoration-color:#000000;letter-spacing:normal;word-spacing:normal;text-transform:none;direction:ltr;block-progression:tb;writing-mode:lr-tb;baseline-shift:baseline;text-anchor:start;white-space:normal;clip-rule:nonzero;display:inline;overflow:visible;visibility:visible;opacity:1;isolation:auto;mix-blend-mode:normal;color-interpolation:sRGB;color-interpolation-filters:linearRGB;solid-color:#000000;solid-opacity:1;fill:#000000;fill-opacity:1;fill-rule:evenodd;stroke:none;stroke-width:1.69333339;stroke-linecap:butt;stroke-linejoin:miter;stroke-miterlimit:4;stroke-dasharray:none;stroke-dashoffset:0;stroke-opacity:1;color-rendering:auto;image-rendering:auto;shape-rendering:auto;text-rendering:auto;enable-background:accumulate"
         d="m 402.37109,291.44336 13.46094,0 0,22.62109 c -4.74605,-0.0557 -9.27009,-0.10842 -13.46094,-0.1289 z m -2.74414,27.9668 c 4.77533,0 10.42591,0.079 16.20508,0.14648 l 0,10.28711 c -0.093,6.5074 -6.35775,10.36347 -12.39258,10.42578 -7.32575,0.0604 -12.76868,-3.13926 -12.85742,-10.2793 0.25657,-5.24178 3.3381,-10.44176 9.04492,-10.58007 z m 41.85087,3.91796 c 0.51431,2.59906 -0.25699,5.23026 -2.49247,6.65235 -2.23547,1.42209 -5.08455,1.32322 -7.2207,-0.24414 -2.86752,-2.40289 -3.13916,-6.87163 0.19338,-9.49177 3.33254,-2.62013 8.17353,-0.66034 9.51979,3.08356 z m -15.41096,2.81641 c 0,0 -0.66582,-2.98047 1.62603,-6.51928 l -6.36868,-0.0198 0,10.23828 c -0.1285,8.35551 -8.04355,15.58043 -17.88477,15.91797 -9.83714,-0.0814 -18.34961,-3.84648 -18.34961,-15.77149 0.13528,-8.30697 6.63121,-15.73437 11.78907,-15.73437 l 0,-28.30469 46.42965,1.9e-4 0,5.49219 -21.98632,0 -0.0664,22.58984 15.8538,0.12817 c 14.89382,0 20.52427,6.71732 20.52427,17.09625 0,8.06931 -7.18138,14.931 -13.77496,20.21352 -6.73741,5.39413 -11.565,10.32156 -11.565,17.47594 0,7.06028 9.78346,9.83593 15.49269,9.83593 12.57481,-0.19124 17.58552,-5.25745 17.63649,-19.18164 l 0.0417,-44.45898 4.4877,-0.0573 -0.0137,44.46163 c 0,18.65519 -8.39145,23.49804 -22.21667,23.49804 -10.63107,0 -19.91093,-4.95599 -19.91093,-14.09765 0,-8.50033 5.70947,-14.09164 13.05932,-20.51336 5.41498,-4.79863 12.63667,-10.31635 12.63667,-17.13535 0,-5.87972 -2.83791,-11.90473 -10.35253,-11.90473 4.39163,4.39163 1.39886,15.34082 -7.83353,15.34082 -4.55281,-0.21251 -9.25428,-3.88021 -9.25428,-8.5901 z"
         transform="matrix(0.28222222,0,0,0.28222222,-28.419691,-3.4953031)"
         id="path3368"
         inkscape:connector-curvature="0"
         sodipodi:nodetypes="ccccccccccccsczccccccccccccccccscccccsscccccc" />
    </g>
  </g>
</svg>
