<?xml version="1.0" standalone="no"?>
<!DOCTYPE svg PUBLIC "-//W3C//DTD SVG 1.1//EN" "http://www.w3.org/Graphics/SVG/1.1/DTD/svg11.dtd" >
<svg xmlns="http://www.w3.org/2000/svg" xmlns:xlink="http://www.w3.org/1999/xlink" version="1.1" viewBox="0 -809 2620 2048">
  <g transform="matrix(1 0 0 -1 0 1638)">
   <path fill="currentColor"
d="M814 664h22q96 -10 172 -90q58 -66 86 -160q30 -94 18 -192q-12 -106 -72 -216q-4 -8 -104 -166q-58 -90 -78 -158q-26 -90 -4 -160q14 -48 50 -88q30 -34 80 -62q140 -76 268 -34q114 38 184 158q72 120 70 272q0 58 46 62t50 -56q8 -92 40 -176q70 -184 218 -252
q168 -78 338 40q96 66 152 174q62 114 66 244q4 158 -70 286q-76 126 -196 160l22 120q154 -44 250 -206q98 -162 90 -366q-6 -166 -82 -308q-70 -134 -186 -214q-208 -142 -418 -46q-174 80 -264 296q-20 -60 -48 -106q-92 -154 -238 -202q-160 -54 -330 40q-64 36 -106 82
q-54 60 -76 138q-34 114 4 246q26 88 92 194q98 154 100 158q48 88 56 164q8 66 -12 130q-18 64 -60 108q-50 56 -116 62h-14q-78 0 -135 -43t-63 -103v-394h-122v886h-270v-886h-124v984h886v-98h-370v-320q22 44 75 71t123 27z" />
  </g>

</svg>
