<?xml version="1.0" standalone="no"?>
<!DOCTYPE svg PUBLIC "-//W3C//DTD SVG 1.1//EN" "http://www.w3.org/Graphics/SVG/1.1/DTD/svg11.dtd" >
<svg xmlns="http://www.w3.org/2000/svg" xmlns:xlink="http://www.w3.org/1999/xlink" version="1.1" viewBox="0 -410 1868 2048">
  <g transform="matrix(1 0 0 -1 0 1638)">
   <path fill="currentColor"
d="M494 886h-270v-886h-124v984h886v-98h-370v-312q56 34 124 34q100 0 174 -72q6 -6 10 -12l12 12q72 72 172 72q152 0 244 -134q72 -104 76 -218q0 -104 -20 -160h362v-96h-518q66 104 66 216q0 20 -2 40q-2 88 -58 166q-60 90 -150 90q-52 0 -87 -44t-35 -106v-362h-124
v362q0 62 -35 105t-87 43t-87 -43t-35 -105v-362h-124v886z" />
  </g>

</svg>
