<?xml version="1.0" standalone="no"?>
<!DOCTYPE svg PUBLIC "-//W3C//DTD SVG 1.1//EN" "http://www.w3.org/Graphics/SVG/1.1/DTD/svg11.dtd" >
<svg xmlns="http://www.w3.org/2000/svg" xmlns:xlink="http://www.w3.org/1999/xlink" version="1.1" viewBox="0 -410 3096 2048">
  <g transform="matrix(1 0 0 -1 0 1638)">
   <path fill="currentColor"
d="M624 1782q158 2 268 -100q122 -112 128 -300q4 -140 -68 -308q-32 -74 -94 -186q-76 -134 -96 -178q-104 -208 -86 -366q6 -54 26 -90q20 -42 56 -60q32 -14 70 -10q36 6 70 30q58 40 104 136q12 26 38 90q24 60 40 96q58 118 142 172q122 76 262 28q78 -28 138 -92
q14 -16 26 -34q50 16 100 20q144 14 260 -62q84 -54 132 -146q48 -90 46 -192q0 -48 -12 -86q-6 -24 -20 -46h844v-98h-1012q-48 2 -46 50q0 46 48 48v0q42 -2 68 28q18 18 26 46q8 26 8 60q0 78 -36 146t-100 110q-88 56 -196 46q-28 -2 -64 -12q8 -18 8 -20
q48 -144 -8 -310q-22 -72 -58 -110q-26 -28 -58 -44q-36 -16 -74 -14t-70 24q-30 18 -50 50q-32 48 -34 120q-4 90 40 176q40 78 114 136q26 20 54 38q-8 12 -8 10q-42 46 -98 66q-96 34 -178 -18q-62 -38 -106 -134q-14 -28 -38 -88q-26 -62 -40 -94q-56 -120 -136 -176
q-54 -36 -114 -46q-66 -8 -124 20q-64 30 -100 100q-28 54 -36 126q-20 186 94 420q24 50 98 182q62 110 92 176q62 148 58 268q-4 146 -96 232q-82 76 -200 72q-112 -2 -210 -76q-120 -92 -180 -276q46 16 94 10q88 -10 146 -86q50 -62 56 -150q6 -80 -28 -144
q-40 -78 -118 -100q-82 -26 -160 20q-66 40 -98 116q-28 64 -28 142q2 58 18 134q64 278 240 412q122 92 266 96zM296 1246q-38 -4 -64 -28q-36 -34 -32 -84h-2q0 -56 18 -96q20 -48 60 -72q42 -24 82 -12q38 12 60 54q22 38 18 90q-4 58 -36 100q-34 42 -82 48q-10 2 -22 0
zM1606 484q-22 -14 -42 -30q-56 -46 -88 -104q-32 -64 -30 -130q2 -42 20 -70q8 -14 20 -20q12 -8 24 -10q14 0 28 6t26 20q22 24 38 76q46 136 8 250q2 -4 -4 12z" />
  </g>

</svg>
