<?xml version="1.0" standalone="no"?>
<!DOCTYPE svg PUBLIC "-//W3C//DTD SVG 1.1//EN" "http://www.w3.org/Graphics/SVG/1.1/DTD/svg11.dtd" >
<svg xmlns="http://www.w3.org/2000/svg" xmlns:xlink="http://www.w3.org/1999/xlink" version="1.1" viewBox="0 -410 2882 2048">
  <g transform="matrix(1 0 0 -1 0 1638)">
   <path fill="currentColor"
d="M470 540h246v346h-246v-346zM1794 1378q-38 -20 -71 -71t-33 -93q0 -44 21 -85t61 -41q30 0 62 26t32 90q0 62 -72 174zM494 74q90 0 156 58t66 138v172h-370q-52 0 -87 -35t-35 -87q0 -100 79 -173t191 -73zM936 1598q-118 0 -196 -59t-78 -187q0 -98 53 -198t149 -170
h270v-98h-296v-346h296v-98h-296v-172q0 -122 -101 -208t-243 -86q-162 0 -278 101t-116 243q0 90 73 155t173 65v444h344q-54 60 -102 159t-48 209q0 162 103 253t293 91q160 0 248 -72q14 -12 24 -24q10 12 24 24q82 72 232 72q198 0 358 -178q78 34 166 32
q146 -4 258 -118q100 -102 104 -216v-2q0 -114 -38 -234h470v-98h-644l40 70q54 94 56 260q-2 84 -78 160q-78 78 -170 80q-44 2 -98 -14q84 -148 84 -234q0 -90 -53 -152t-147 -62q-96 0 -142 67t-46 157q0 74 37 138t107 112q-146 134 -264 134q-102 0 -147 -43t-45 -105
v-182h-124v182q0 62 -50 105t-162 43z" />
  </g>

</svg>
