<?xml version="1.0" standalone="no"?>
<!DOCTYPE svg PUBLIC "-//W3C//DTD SVG 1.1//EN" "http://www.w3.org/Graphics/SVG/1.1/DTD/svg11.dtd" >
<svg xmlns="http://www.w3.org/2000/svg" xmlns:xlink="http://www.w3.org/1999/xlink" version="1.1" viewBox="0 -338 667 1024">
  <g transform="matrix(1 0 0 -1 0 700)">
   <path fill="currentColor"
d="M219 443v-173h123v173h-123zM96 160q0 -50 39.5 -86.5t95.5 -36.5q45 0 78 29t33 69v86h-185q-26 0 -43.5 -17.5t-17.5 -43.5zM157 492h418v-49h-172v-173h49q71 0 121.5 -43t50.5 -104q0 -102 -68 -174t-165 -72h-234q-31 0 -52 -25t-21 -61q0 -25 12.5 -47.5
t36.5 -38.5l-37 -43q-34 20 -54 54t-20 75q0 57 39.5 96t95.5 39h234q71 0 121.5 58t50.5 139q0 41 -32.5 69.5t-78.5 28.5h-49v-86q0 -61 -50.5 -104t-121.5 -43q-81 0 -139 50.5t-58 121.5q0 45 36.5 77.5t86.5 32.5v222z" />
  </g>

</svg>
