<?xml version="1.0" encoding="UTF-8" standalone="no"?>
<!-- Created with Inkscape (http://www.inkscape.org/) -->

<svg
   xmlns:dc="http://purl.org/dc/elements/1.1/"
   xmlns:cc="http://creativecommons.org/ns#"
   xmlns:rdf="http://www.w3.org/1999/02/22-rdf-syntax-ns#"
   xmlns:svg="http://www.w3.org/2000/svg"
   xmlns="http://www.w3.org/2000/svg"
   xmlns:sodipodi="http://sodipodi.sourceforge.net/DTD/sodipodi-0.dtd"
   xmlns:inkscape="http://www.inkscape.org/namespaces/inkscape"
   width="1.1800585mm"
   height="0.97568548mm"
   viewBox="0 0 1.1800585 0.97568548"
   version="1.1"
   id="svg1074"
   inkscape:version="0.92.4 (unknown)"
   sodipodi:docname="வீசம்.svg">
  <defs
     id="defs1068" />
  <sodipodi:namedview
     id="base"
     pagecolor="#ffffff"
     bordercolor="#666666"
     borderopacity="1.0"
     inkscape:pageopacity="0.0"
     inkscape:pageshadow="2"
     inkscape:zoom="164.57122"
     inkscape:cx="1.5740138"
     inkscape:cy="2.0204556"
     inkscape:document-units="mm"
     inkscape:current-layer="layer1"
     showgrid="false"
     fit-margin-top="0"
     fit-margin-left="0"
     fit-margin-right="0"
     fit-margin-bottom="0"
     inkscape:window-width="1920"
     inkscape:window-height="1017"
     inkscape:window-x="0"
     inkscape:window-y="30"
     inkscape:window-maximized="1" />
  <metadata
     id="metadata1071">
    <rdf:RDF>
      <cc:Work
         rdf:about="">
        <dc:format>image/svg+xml</dc:format>
        <dc:type
           rdf:resource="http://purl.org/dc/dcmitype/StillImage" />
        <dc:title></dc:title>
      </cc:Work>
    </rdf:RDF>
  </metadata>
  <g
     inkscape:label="Layer 1"
     inkscape:groupmode="layer"
     id="layer1"
     transform="translate(106.49458,-144.56573)">
    <g
       transform="matrix(0.35277777,0,0,0.35277777,-134.07349,22.548974)"
       id="g779"
       style="fill:#211e1e;fill-opacity:1">
      <g
         id="use777"
         transform="matrix(0.26458333,0,0,0.26458333,78.040001,347.89999)">
        <path
           inkscape:connector-curvature="0"
           id="path1092"
           d="M 5.84375,0 V -5.375 H 4.875 v 4.453125 H 1.546875 V -5.375 H 0.515625 V 0 Z m 0,0"
           style="stroke:none" />
      </g>
    </g>
    <g
       transform="matrix(0.35277777,0,0,0.35277777,-135.72783,22.548974)"
       id="g783"
       style="fill:#211e1e;fill-opacity:1">
      <g
         id="use781"
         transform="matrix(0.26458333,0,0,0.26458333,84.4002,347.89999)">
        <path
           inkscape:connector-curvature="0"
           id="path1096"
           d="m 6.84375,-0.875 c 0,-2.921875 -1.390625,-5.375 -2.40625,-6.78125 H 3.390625 C 4.359375,-6.5 5.96875,-3.515625 5.96875,-1.25 5.96875,0.296875 5.453125,1.890625 4,1.890625 c -1.0625,0 -2,-0.59375 -2,-1.59375 0,-1.515625 1.796875,-2.28125 1.796875,-3.859375 0,-1.1875 -0.453125,-1.984375 -1.9375,-1.984375 C 0.875,-5.546875 0,-4.796875 0,-3.828125 0,-2.65625 0.984375,-2 2.140625,-2.03125 1.59375,-1.40625 1,-0.796875 1,0.328125 1,1.6875 2.296875,2.796875 3.796875,2.796875 5.640625,2.796875 6.84375,1.1875 6.84375,-0.875 Z M 2.890625,-3.84375 c 0,0.46875 -0.484375,0.875 -0.96875,0.875 -0.484375,0 -0.890625,-0.40625 -0.890625,-0.875 0,-0.5 0.40625,-0.90625 0.890625,-0.90625 0.484375,0 0.96875,0.40625 0.96875,0.90625 z m 0,0"
           style="stroke:none" />
      </g>
    </g>
  </g>
</svg>
