<?xml version="1.0" encoding="UTF-8" standalone="no"?>
<!-- Created with Inkscape (http://www.inkscape.org/) -->

<svg
   xmlns:dc="http://purl.org/dc/elements/1.1/"
   xmlns:cc="http://creativecommons.org/ns#"
   xmlns:rdf="http://www.w3.org/1999/02/22-rdf-syntax-ns#"
   xmlns:svg="http://www.w3.org/2000/svg"
   xmlns="http://www.w3.org/2000/svg"
   xmlns:sodipodi="http://sodipodi.sourceforge.net/DTD/sodipodi-0.dtd"
   xmlns:inkscape="http://www.inkscape.org/namespaces/inkscape"
   width="0.78609037mm"
   height="1.022355mm"
   viewBox="0 0 0.78609037 1.022355"
   version="1.1"
   id="svg2301"
   inkscape:version="0.92.4 (unknown)"
   sodipodi:docname="காணி.svg">
  <defs
     id="defs2295" />
  <sodipodi:namedview
     id="base"
     pagecolor="#ffffff"
     bordercolor="#666666"
     borderopacity="1.0"
     inkscape:pageopacity="0.0"
     inkscape:pageshadow="2"
     inkscape:zoom="221.531"
     inkscape:cx="1.4855269"
     inkscape:cy="1.9320016"
     inkscape:document-units="mm"
     inkscape:current-layer="layer1"
     showgrid="false"
     fit-margin-top="0"
     fit-margin-left="0"
     fit-margin-right="0"
     fit-margin-bottom="0"
     inkscape:window-width="1920"
     inkscape:window-height="1017"
     inkscape:window-x="0"
     inkscape:window-y="30"
     inkscape:window-maximized="1" />
  <metadata
     id="metadata2298">
    <rdf:RDF>
      <cc:Work
         rdf:about="">
        <dc:format>image/svg+xml</dc:format>
        <dc:type
           rdf:resource="http://purl.org/dc/dcmitype/StillImage" />
        <dc:title></dc:title>
      </cc:Work>
    </rdf:RDF>
  </metadata>
  <g
     inkscape:label="Layer 1"
     inkscape:groupmode="layer"
     id="layer1"
     transform="translate(205.25614,-153.61382)">
    <g
       transform="matrix(0.35277777,0,0,0.35277777,-284.99972,44.339361)"
       id="g1183"
       style="fill:#211e1e;fill-opacity:1">
      <g
         id="use1177"
         transform="matrix(0.26458333,0,0,0.26458333,226,311.89999)">
        <path
           inkscape:connector-curvature="0"
           id="path2319"
           d=""
           style="stroke:none" />
      </g>
      <g
         id="use1179"
         transform="matrix(0.26458333,0,0,0.26458333,226.0224,311.89999)">
        <path
           inkscape:connector-curvature="0"
           id="path2323"
           d=""
           style="stroke:none" />
      </g>
      <g
         id="use1181"
         transform="matrix(0.26458333,0,0,0.26458333,226.0448,311.89999)">
        <path
           inkscape:connector-curvature="0"
           id="path2327"
           d="m 8.421875,-0.203125 c 0,-2.421875 -2.59375,-6.25 -3.515625,-7.90625 H 3.703125 C 4.375,-7.3125 7.46875,-2.640625 7.46875,-0.453125 7.46875,1.078125 6.796875,1.9375 5.421875,1.9375 3.90625,1.9375 3.40625,0.984375 3.40625,-0.125 c 0,-1.1875 1.421875,-1.859375 1.421875,-3.25 0,-1.171875 -0.671875,-2.21875 -2.265625,-2.21875 -1.34375,0 -2.5625,0.8125 -2.5625,2.359375 0,0.890625 0.625,1.640625 1.65625,1.640625 0.78125,0 1.4375,-0.609375 1.4375,-1.375 0,-0.65625 -0.421875,-1.25 -1.140625,-1.25 -0.375,0 -0.609375,0.109375 -0.9375,0.28125 0.28125,-0.625 0.828125,-0.796875 1.453125,-0.796875 0.875,0 1.34375,0.6875 1.34375,1.453125 0,1.03125 -1.453125,1.53125 -1.453125,3.234375 0,1.59375 1.28125,2.890625 3,2.890625 1.734375,0 3.0625,-1.09375 3.0625,-3.046875 z M 2.15625,-2.90625 c 0,0.265625 -0.140625,0.484375 -0.40625,0.484375 -0.265625,0 -0.5,-0.21875 -0.5,-0.484375 0,-0.265625 0.234375,-0.515625 0.5,-0.515625 0.265625,0 0.40625,0.25 0.40625,0.515625 z m 0,0"
           style="stroke:none" />
      </g>
    </g>
  </g>
</svg>
