<?xml version="1.0" encoding="UTF-8" standalone="no"?>
<!-- Created with Inkscape (http://www.inkscape.org/) -->

<svg
   xmlns:dc="http://purl.org/dc/elements/1.1/"
   xmlns:cc="http://creativecommons.org/ns#"
   xmlns:rdf="http://www.w3.org/1999/02/22-rdf-syntax-ns#"
   xmlns:svg="http://www.w3.org/2000/svg"
   xmlns="http://www.w3.org/2000/svg"
   xmlns:sodipodi="http://sodipodi.sourceforge.net/DTD/sodipodi-0.dtd"
   xmlns:inkscape="http://www.inkscape.org/namespaces/inkscape"
   width="1.1754895mm"
   height="0.82546782mm"
   viewBox="0 0 1.1754895 0.82546782"
   version="1.1"
   id="svg2802"
   inkscape:version="0.92.4 (unknown)"
   sodipodi:docname="வரகு.svg">
  <defs
     id="defs2796" />
  <sodipodi:namedview
     id="base"
     pagecolor="#ffffff"
     bordercolor="#666666"
     borderopacity="1.0"
     inkscape:pageopacity="0.0"
     inkscape:pageshadow="2"
     inkscape:zoom="256"
     inkscape:cx="2.2213965"
     inkscape:cy="1.5599204"
     inkscape:document-units="mm"
     inkscape:current-layer="layer1"
     showgrid="false"
     fit-margin-top="0"
     fit-margin-left="0"
     fit-margin-right="0"
     fit-margin-bottom="0"
     inkscape:window-width="1920"
     inkscape:window-height="1017"
     inkscape:window-x="0"
     inkscape:window-y="30"
     inkscape:window-maximized="1" />
  <metadata
     id="metadata2799">
    <rdf:RDF>
      <cc:Work
         rdf:about="">
        <dc:format>image/svg+xml</dc:format>
        <dc:type
           rdf:resource="http://purl.org/dc/dcmitype/StillImage" />
        <dc:title></dc:title>
      </cc:Work>
    </rdf:RDF>
  </metadata>
  <g
     inkscape:label="Layer 1"
     inkscape:groupmode="layer"
     id="layer1"
     transform="translate(91.302029,-210.40869)">
    <g
       transform="matrix(0.35277777,0,0,0.35277777,-171.02543,47.556505)"
       id="g1305"
       style="fill:#211e1e;fill-opacity:1">
      <g
         id="use1303"
         transform="matrix(0.26458333,0,0,0.26458333,226,463.10001)">
        <path
           inkscape:connector-curvature="0"
           id="path2814"
           d="m 12.546875,-0.421875 c 0,-0.921875 -0.46875,-1.984375 -1.703125,-1.984375 -0.3125,0 -0.5,-0.015625 -0.8125,0.09375 l 0.03125,-2.609375 c 0,-0.3125 0.1875,-0.59375 0.1875,-0.59375 H 6.875 c 0,0 0.171875,0.0625 0.171875,0.515625 v 4.15625 h -1.625 c 0.53125,-0.5 0.6875,-1.015625 0.6875,-1.75 0,-1.78125 -0.84375,-2.96875 -2.828125,-2.96875 -1.640625,0 -3.328125,0.671875 -3.328125,3.078125 0,1.390625 0.65625,2.65625 2.15625,2.65625 0.96875,0 1.8125,-0.75 1.8125,-1.71875 0,-0.984375 -0.5625,-1.8125 -1.71875,-1.8125 -0.515625,0 -0.78125,0.125 -1.21875,0.515625 -0.015625,-1.3125 1.03125,-1.8125 2.109375,-1.8125 1.5,0 1.953125,1.09375 1.953125,2.140625 0,0.96875 -0.578125,1.609375 -1.28125,1.640625 v 0.890625 h 4.25 v -4.09375 c 0,-0.328125 0.125,-0.640625 0.5625,-0.640625 0.375,0 0.515625,0.34375 0.515625,0.640625 v 3.171875 c 0.3125,-0.34375 0.875,-0.640625 1.4375,-0.640625 0.71875,0 1.09375,0.484375 1.09375,1.296875 0,1.640625 -2.5625,2.65625 -4.640625,2.65625 -1.34375,0 -2.46875,-0.296875 -2.46875,-0.75 C 4.515625,1.546875 4.53125,1.375 4.71875,1.375 H 6.6875 V 0.46875 H 4.59375 c -0.53125,0 -1.140625,0.375 -1.140625,1.078125 0,1.125 1.734375,1.734375 3.34375,1.734375 2.6875,0 5.75,-1.0625 5.75,-3.703125 z M 3.03125,-1.53125 c 0,0.5 -0.40625,0.875 -0.890625,0.875 -0.484375,0 -0.890625,-0.375 -0.890625,-0.875 0,-0.46875 0.40625,-0.875 0.890625,-0.875 0.484375,0 0.890625,0.40625 0.890625,0.875 z m 0,0"
           style="stroke:none" />
      </g>
    </g>
  </g>
</svg>
