%YAML 1.1
%TAG !u! tag:unity3d.com,2011:
--- !u!21 &2100000
Material:
  serializedVersion: 6
  m_ObjectHideFlags: 0
  m_CorrespondingSourceObject: {fileID: 0}
  m_PrefabInstance: {fileID: 0}
  m_PrefabAsset: {fileID: 0}
  m_Name: WaterTextureAnimated 1
  m_Shader: {fileID: -6465566751694194690, guid: 76754378a824e3d428fe0255d8a6919b, type: 3}
  m_ShaderKeywords: 
  m_LightmapFlags: 4
  m_EnableInstancingVariants: 0
  m_DoubleSidedGI: 0
  m_CustomRenderQueue: -1
  stringTagMap: {}
  disabledShaderPasses: []
  m_SavedProperties:
    serializedVersion: 3
    m_TexEnvs:
    - _MainNormal:
        m_Texture: {fileID: 2800000, guid: 5abb1ac2ded93e44eb6e5f5603404b0a, type: 3}
        m_Scale: {x: 1, y: 1}
        m_Offset: {x: 0, y: 0}
    - _SecondNormal:
        m_Texture: {fileID: 2800000, guid: 80ad59ebe0e8c0f409c88e8592d077e0, type: 3}
        m_Scale: {x: 1, y: 1}
        m_Offset: {x: 0, y: 0}
    - unity_Lightmaps:
        m_Texture: {fileID: 0}
        m_Scale: {x: 1, y: 1}
        m_Offset: {x: 0, y: 0}
    - unity_LightmapsInd:
        m_Texture: {fileID: 0}
        m_Scale: {x: 1, y: 1}
        m_Offset: {x: 0, y: 0}
    - unity_ShadowMasks:
        m_Texture: {fileID: 0}
        m_Scale: {x: 1, y: 1}
        m_Offset: {x: 0, y: 0}
    m_Floats:
    - Vector1_77a666f5dc7e49758a97c07b43d24f21: 0
    - _Depth: 0
    - _Displacement: 0.59
    - _NormalStrength: 0.96
    - _Smoothness: 0.2
    - _Strength: 1
    m_Colors:
    - _DeepWater: {r: 0.2123887, g: 0.2298307, b: 0.7169812, a: 0.8392157}
    - _ShallowColor: {r: 0.4470588, g: 0.5882353, b: 0.9215686, a: 0.6941177}
  m_BuildTextureStacks: []
