%YAML 1.1
%TAG !u! tag:unity3d.com,2011:
--- !u!21 &2100000
Material:
  serializedVersion: 6
  m_ObjectHideFlags: 0
  m_CorrespondingSourceObject: {fileID: 0}
  m_PrefabInstance: {fileID: 0}
  m_PrefabAsset: {fileID: 0}
  m_Name: largerwaterEDITED
  m_Shader: {fileID: -6465566751694194690, guid: e081923b55b375a4e9dc3845b8106f83, type: 3}
  m_ShaderKeywords: 
  m_LightmapFlags: 4
  m_EnableInstancingVariants: 0
  m_DoubleSidedGI: 0
  m_CustomRenderQueue: -1
  stringTagMap: {}
  disabledShaderPasses: []
  m_SavedProperties:
    serializedVersion: 3
    m_TexEnvs:
    - Texture2D_6433E44:
        m_Texture: {fileID: 2800000, guid: 9289bcf7d8bd0de4ba3c1936142bd05a, type: 3}
        m_Scale: {x: 1, y: 1}
        m_Offset: {x: 0, y: 0}
    - Texture2D_7B05B096:
        m_Texture: {fileID: 2800000, guid: 752cd2818650c7b499cfba5faa8dec03, type: 3}
        m_Scale: {x: 1, y: 1}
        m_Offset: {x: 0, y: 0}
    - Texture2D_CCB3FA43:
        m_Texture: {fileID: 2800000, guid: 7479395504017d34797e9e1f01416773, type: 3}
        m_Scale: {x: 1, y: 1}
        m_Offset: {x: 0, y: 0}
    - Texture2D_F7374CBF:
        m_Texture: {fileID: 2800000, guid: 7479395504017d34797e9e1f01416773, type: 3}
        m_Scale: {x: 1, y: 1}
        m_Offset: {x: 0, y: 0}
    - Texture2D_F7D20451:
        m_Texture: {fileID: 2800000, guid: c2836cd591d01d34b82b8a48db35245f, type: 3}
        m_Scale: {x: 1, y: 1}
        m_Offset: {x: 0, y: 0}
    - unity_Lightmaps:
        m_Texture: {fileID: 0}
        m_Scale: {x: 1, y: 1}
        m_Offset: {x: 0, y: 0}
    - unity_LightmapsInd:
        m_Texture: {fileID: 0}
        m_Scale: {x: 1, y: 1}
        m_Offset: {x: 0, y: 0}
    - unity_ShadowMasks:
        m_Texture: {fileID: 0}
        m_Scale: {x: 1, y: 1}
        m_Offset: {x: 0, y: 0}
    m_Floats:
    - Vector1_10B7BD24: -0.16
    - Vector1_12198F11: 0.2
    - Vector1_1C04ACA9: 1
    - Vector1_1D76351A: 0.2
    - Vector1_2BD8E9F7: 0.051
    - Vector1_3A3EA0FB: 0.326
    - Vector1_3D7809C9: 0
    - Vector1_3F1B17FA: 2.66
    - Vector1_417C92AE: 0.02
    - Vector1_42CA2F7C: 1.98
    - Vector1_4488867C: 1
    - Vector1_46744A55: 1.24
    - Vector1_53ED3B4B: -0.23
    - Vector1_58202ED7: 17.6
    - Vector1_6070AF49: 300
    - Vector1_665A0801: 0
    - Vector1_6CC30BE: 0
    - Vector1_8C73230: 0.01
    - Vector1_ADEE287E: 1.61
    - Vector1_B2B48D67: 80
    - Vector1_C2199BAE: 0.1
    - Vector1_C3527EF0: 0
    - Vector1_C595CC03: 500
    - Vector1_C7D9146C: 0.41
    - Vector1_D323B284: 0.03
    - Vector1_D498C285: -0.61
    - Vector1_D6A8BFC7: 1.2
    - Vector1_DC688492: 2000
    - Vector1_E47E3501: 0.208
    - Vector1_E50BFD55: 0.232
    - Vector1_EC36055C: 0.229
    - Vector1_F8B81910: 0.03
    - Vector1_FDE8751A: 0.19
    - Vector1_FF26A87B: 3.5
    m_Colors:
    - Color_50C00F4E: {r: 0.25098038, g: 0.5030808, b: 1, a: 1}
    - Color_6AF14163: {r: 0.09868278, g: 0.13467532, b: 0.6792453, a: 1}
  m_BuildTextureStacks: []
--- !u!114 &3386865895175832212
MonoBehaviour:
  m_ObjectHideFlags: 11
  m_CorrespondingSourceObject: {fileID: 0}
  m_PrefabInstance: {fileID: 0}
  m_PrefabAsset: {fileID: 0}
  m_GameObject: {fileID: 0}
  m_Enabled: 1
  m_EditorHideFlags: 0
  m_Script: {fileID: 11500000, guid: d0353a89b1f911e48b9e16bdc9f2e058, type: 3}
  m_Name: 
  m_EditorClassIdentifier: 
  version: 1
