{
	"info": {
		"_postman_id": "8b295678-6961-4372-bb56-81bed10ee48a",
		"name": "Holidays webservice",
		"schema": "https://schema.getpostman.com/json/collection/v2.1.0/collection.json"
	},
	"item": [
		{
			"name": "static",
			"item": [
				{
					"name": "Holidays available USA",
					"event": [
						{
							"listen": "test",
							"script": {
								"id": "fbd62274-f93a-4137-b3c0-cd75ca5a15fe",
								"exec": [
									"pm.test(\"Holidays available USA with some HolidayCode\", function (){",
									"    var soapPathToObject = 'soap:Envelope.\\",
									"soap:Body.\\",
									"GetHolidaysAvailableResponse.\\",
									"GetHolidaysAvailableResult.\\",
									"HolidayCode';",
									"    var jsbody = xml2Json(responseBody);",
									"    pm.expect(_.get(jsbody,soapPathToObject).count()).to.be.gt(0);",
									"});"
								],
								"type": "text/javascript"
							}
						}
					],
					"request": {
						"method": "POST",
						"header": [
							{
								"key": "Content-Type",
								"name": "Content-Type",
								"value": "text/xml",
								"type": "text"
							}
						],
						"body": {
							"mode": "raw",
							"raw": "<?xml version=\"1.0\"?>\n<soapenv:Envelope xmlns:soapenv=\"http://schemas.xmlsoap.org/soap/envelope/\" xmlns:hs=\"http://www.holidaywebservice.com/HolidayService_v2/\">\n  <soapenv:Body>\n    <hs:GetHolidaysAvailable>\n      <hs:countryCode>UnitedStates</hs:countryCode>\n    </hs:GetHolidaysAvailable>\n  </soapenv:Body>\n</soapenv:Envelope>"
						},
						"url": {
							"raw": "http://www.holidaywebservice.com/HolidayService_v2/HolidayService2.asmx?wsdl",
							"protocol": "http",
							"host": [
								"www",
								"holidaywebservice",
								"com"
							],
							"path": [
								"",
								"HolidayService_v2",
								"HolidayService2.asmx"
							],
							"query": [
								{
									"key": "wsdl",
									"value": null
								}
							]
						}
					},
					"response": []
				},
				{
					"name": "Holidays for 2019 in Scotland",
					"event": [
						{
							"listen": "test",
							"script": {
								"id": "96ceed9a-005e-4e45-9eab-7f2dae3d3c03",
								"exec": [
									"pm.test(\"Holidays for 2019 in Scotland with some Holiday\", function (){",
									"    var soapPathToObject = 'soap:Envelope.\\",
									"soap:Body.\\",
									"GetHolidaysForYearResponse.\\",
									"GetHolidaysForYearResult.\\",
									"Holiday';",
									"    var jsbody = xml2Json(responseBody);",
									"    pm.expect(_.get(jsbody,soapPathToObject).count()).to.be.eq(41);",
									"});"
								],
								"type": "text/javascript"
							}
						}
					],
					"request": {
						"method": "POST",
						"header": [
							{
								"key": "Content-Type",
								"name": "Content-Type",
								"type": "text",
								"value": "text/xml"
							}
						],
						"body": {
							"mode": "raw",
							"raw": "<?xml version=\"1.0\"?>\n<soapenv:Envelope xmlns:soapenv=\"http://schemas.xmlsoap.org/soap/envelope/\" xmlns:hs=\"http://www.holidaywebservice.com/HolidayService_v2/\">\n  <soapenv:Body>\n    <hs:GetHolidaysForYear>\n      <hs:countryCode>Scotland</hs:countryCode>\n      <hs:year>2019</hs:year>\n    </hs:GetHolidaysForYear>\n  </soapenv:Body>\n</soapenv:Envelope>"
						},
						"url": {
							"raw": "http://www.holidaywebservice.com/HolidayService_v2/HolidayService2.asmx?wsdl",
							"protocol": "http",
							"host": [
								"www",
								"holidaywebservice",
								"com"
							],
							"path": [
								"",
								"HolidayService_v2",
								"HolidayService2.asmx"
							],
							"query": [
								{
									"key": "wsdl",
									"value": null
								}
							]
						}
					},
					"response": []
				},
				{
					"name": "Available countries",
					"event": [
						{
							"listen": "test",
							"script": {
								"id": "e5499ac4-08b0-4514-be85-1d3fb39123cf",
								"exec": [
									"pm.test(\"Holidays available USA with some HolidayCode\", function (){",
									"    var soapPathToObject = 'soap:Envelope.\\",
									"soap:Body.\\",
									"GetCountriesAvailableResponse.\\",
									"GetCountriesAvailableResult.\\",
									"CountryCode';",
									"    var jsbody = xml2Json(responseBody);",
									"    var jsobject = _.get(jsbody,soapPathToObject);",
									"    //pm.expect(jsobject).to.include.members([ { Code:\"Canada\", Description: \"Canada\"} ]);",
									"    pm.expect(jsobject).to.be.an('array');",
									"});"
								],
								"type": "text/javascript"
							}
						}
					],
					"request": {
						"method": "POST",
						"header": [
							{
								"key": "Content-Type",
								"name": "Content-Type",
								"value": "text/xml",
								"type": "text"
							}
						],
						"body": {
							"mode": "raw",
							"raw": "<?xml version=\"1.0\"?>\n<soapenv:Envelope xmlns:soapenv=\"http://schemas.xmlsoap.org/soap/envelope/\" xmlns:hs=\"http://www.holidaywebservice.com/HolidayService_v2/\">\n  <soapenv:Body>\n    <hs:GetCountriesAvailable/>\n  </soapenv:Body>\n</soapenv:Envelope>"
						},
						"url": {
							"raw": "http://www.holidaywebservice.com/HolidayService_v2/HolidayService2.asmx?wsdl",
							"protocol": "http",
							"host": [
								"www",
								"holidaywebservice",
								"com"
							],
							"path": [
								"",
								"HolidayService_v2",
								"HolidayService2.asmx"
							],
							"query": [
								{
									"key": "wsdl",
									"value": null
								}
							]
						}
					},
					"response": []
				}
			]
		},
		{
			"name": "iterative",
			"item": [
				{
					"name": "Holidays for country and date range",
					"event": [
						{
							"listen": "test",
							"script": {
								"id": "e5499ac4-08b0-4514-be85-1d3fb39123cf",
								"exec": [
									"pm.test(\"There is some holiday in the range\", function (){",
									"    var soapPathToObject = 'soap:Envelope.\\",
									"soap:Body.\\",
									"GetHolidaysForDateRangeResponse.\\",
									"GetHolidaysForDateRangeResult.\\",
									"Holiday';",
									"    var jsbody = xml2Json(responseBody);",
									"    var jsobject = _.get(jsbody,soapPathToObject);",
									"    pm.expect(jsobject).to.be.an('array');",
									"});"
								],
								"type": "text/javascript"
							}
						}
					],
					"request": {
						"method": "POST",
						"header": [
							{
								"key": "Content-Type",
								"name": "Content-Type",
								"value": "text/xml",
								"type": "text"
							}
						],
						"body": {
							"mode": "raw",
							"raw": "<?xml version=\"1.0\"?>\n<soapenv:Envelope xmlns:soapenv=\"http://schemas.xmlsoap.org/soap/envelope/\" xmlns:hs=\"http://www.holidaywebservice.com/HolidayService_v2/\">\n  <soapenv:Body>\n    <hs:GetHolidaysForDateRange>\n    \t<hs:countryCode>{{countryCode}}</hs:countryCode>\n    \t<hs:startDate>{{startDate}}</hs:startDate>\n    \t<hs:endDate>{{endDate}}</hs:endDate>\n    \t<!--<hs:countryCode>Scotland</hs:countryCode>\n    \t<hs:startDate>2019-01-01</hs:startDate>\n    \t<hs:endDate>2019-10-01</hs:endDate>-->\n    </hs:GetHolidaysForDateRange>\n  </soapenv:Body>\n</soapenv:Envelope>"
						},
						"url": {
							"raw": "http://www.holidaywebservice.com/HolidayService_v2/HolidayService2.asmx?wsdl",
							"protocol": "http",
							"host": [
								"www",
								"holidaywebservice",
								"com"
							],
							"path": [
								"",
								"HolidayService_v2",
								"HolidayService2.asmx"
							],
							"query": [
								{
									"key": "wsdl",
									"value": null
								}
							]
						}
					},
					"response": []
				}
			]
		}
	],
	"event": [
		{
			"listen": "prerequest",
			"script": {
				"id": "b8434373-5c3a-4f73-92a2-946cd13b540c",
				"type": "text/javascript",
				"exec": [
					""
				]
			}
		},
		{
			"listen": "test",
			"script": {
				"id": "e920b5ae-ebf1-4176-be24-5b95d8aa9f49",
				"type": "text/javascript",
				"exec": [
					"pm.test(\"Holidays webservice - response ok\", function () {",
					"    pm.response.to.have.status(200) &&",
					"    pm.response.to.have.body;",
					"});"
				]
			}
		}
	]
}