id,name,model_id:id,group_id:id,perm_read,perm_write,perm_create,perm_unlink
access_cm_map,cm.map,model_cm_map,,1,1,1,1
access_cm_map_colorschema,cm.map.colorschema,model_cm_map_colorschema,,1,1,1,1
access_cm_place,cm.place,model_crm_team,,1,1,1,1
access_cm_place_category,cm.place.category,model_cm_place_category,,1,1,1,1
access_cm_form_model,cm.form.model,model_cm_form_model,,1,1,1,1
access_cm_place_presenter_metadata,cm.place.presenter.metadata,model_cm_place_presenter_metadata,,1,1,1,1
access_cm_form_submission_metadata,cm.form.submission.metadata,model_cm_form_submission_metadata,,1,1,1,1
access_cm_presenter_model,cm.presenter.model,model_cm_presenter_model,,1,1,1,1
access_cm_crowdfunding_notification_request,cm.crowdfunding.notification.request,model_cm_crowdfunding_notification_request,,1,1,1,1
access_cm_crowdfunding_notification,cm.crowdfunding.notification,model_cm_crowdfunding_notification,,1,1,1,1