[
  {
    "code": "21IVA",
    "products": [
      {
        "code": "SE_SC_REC_BA_ADSL_100",
        "name": "ADSL 100 min a fix o mòbil",
        "price": 36,
        "category": "adsl",
        "minutes": null,
        "data": null,
        "bandwidth": 20
      },
      {
        "code": "SE_SC_REC_BA_ADSL_1000",
        "name": "ADSL 1000 min a fix",
        "price": 36,
        "category": "adsl",
        "minutes": null,
        "data": null,
        "bandwidth": 20
      },
      {
        "code": "SE_SC_REC_BA_ADSL_SF",
        "name": "ADSL sense fix",
        "price": 31.5,
        "category": "adsl",
        "minutes": null,
        "data": null,
        "bandwidth": 20
      },
      {
        "code": "SE_SC_REC_BA_F_100",
        "name": "Fibra 100Mb",
        "price": 36,
        "category": "fiber",
        "minutes": null,
        "data": null,
        "bandwidth": 100
      },
      {
        "code": "SE_SC_REC_BA_F_1024",
        "name": "Fibra 1Gb",
        "price": 58,
        "category": "fiber",
        "minutes": null,
        "data": null,
        "bandwidth": 1024
      },
      {
        "code": "SE_SC_REC_BA_F_600",
        "name": "Fibra 600Mb",
        "price": 43,
        "category": "fiber",
        "minutes": null,
        "data": null,
        "bandwidth": 600
      },
      {
        "code": "SE_SC_REC_MOBILE_T_0_0",
        "name": "0 min 0 MB",
        "price": 2,
        "category": "mobile",
        "minutes": 0,
        "data": 0,
        "bandwidth": null
      },
      {
        "code": "SE_SC_REC_MOBILE_T_0_1024",
        "name": "0 min 1 GB",
        "price": 4.5,
        "category": "mobile",
        "minutes": 0,
        "data": 1024,
        "bandwidth": null
      },
      {
        "code": "SE_SC_REC_MOBILE_T_0_10240",
        "name": "0 min 10 GB",
        "price": 11,
        "category": "mobile",
        "minutes": 0,
        "data": 10240,
        "bandwidth": null
      },
      {
        "code": "SE_SC_REC_MOBILE_T_0_200",
        "name": "0 min 200 MB",
        "price": 1,
        "category": "mobile",
        "minutes": 0,
        "data": 200,
        "bandwidth": null
      },
      {
        "code": "SE_SC_REC_MOBILE_T_0_2048",
        "name": "0 min 2 GB",
        "price": 7,
        "category": "mobile",
        "minutes": 0,
        "data": 2048,
        "bandwidth": null
      },
      {
        "code": "SE_SC_REC_MOBILE_T_0_3072",
        "name": "0 min 3 GB",
        "price": 1,
        "category": "mobile",
        "minutes": 0,
        "data": 3072,
        "bandwidth": null
      },
      {
        "code": "SE_SC_REC_MOBILE_T_0_500",
        "name": "0 min 500 MB",
        "price": 3.5,
        "category": "mobile",
        "minutes": 0,
        "data": 500,
        "bandwidth": null
      },
      {
        "code": "SE_SC_REC_MOBILE_T_0_5120",
        "name": "0 min 5 GB",
        "price": 1,
        "category": "mobile",
        "minutes": 0,
        "data": 5120,
        "bandwidth": null
      },
      {
        "code": "SE_SC_REC_MOBILE_T_100_0",
        "name": "100 min 0 MB",
        "price": 1,
        "category": "mobile",
        "minutes": 100,
        "data": 0,
        "bandwidth": null
      },
      {
        "code": "SE_SC_REC_MOBILE_T_100_200",
        "name": "100 min 200 MB",
        "price": 1,
        "category": "mobile",
        "minutes": 100,
        "data": 200,
        "bandwidth": null
      },
      {
        "code": "SE_SC_REC_MOBILE_T_150_0",
        "name": "150 min 0 MB",
        "price": 4.5,
        "category": "mobile",
        "minutes": 150,
        "data": 0,
        "bandwidth": null
      },
      {
        "code": "SE_SC_REC_MOBILE_T_150_1024",
        "name": "150 min 1 GB",
        "price": 8,
        "category": "mobile",
        "minutes": 150,
        "data": 1024,
        "bandwidth": null
      },
      {
        "code": "SE_SC_REC_MOBILE_T_150_10240",
        "name": "150 min 10 GB",
        "price": 12,
        "category": "mobile",
        "minutes": 150,
        "data": 10240,
        "bandwidth": null
      },
      {
        "code": "SE_SC_REC_MOBILE_T_150_2048",
        "name": "150 min 2 GB",
        "price": 10,
        "category": "mobile",
        "minutes": 150,
        "data": 2048,
        "bandwidth": null
      },
      {
        "code": "SE_SC_REC_MOBILE_T_150_500",
        "name": "150 min 500 MB",
        "price": 7.5,
        "category": "mobile",
        "minutes": 150,
        "data": 500,
        "bandwidth": null
      },
      {
        "code": "SE_SC_REC_MOBILE_T_200_0",
        "name": "200 min 0 MB",
        "price": 1,
        "category": "mobile",
        "minutes": 200,
        "data": 0,
        "bandwidth": null
      },
      {
        "code": "SE_SC_REC_MOBILE_T_200_1024",
        "name": "200 min 1 GB",
        "price": 1,
        "category": "mobile",
        "minutes": 200,
        "data": 1024,
        "bandwidth": null
      },
      {
        "code": "SE_SC_REC_MOBILE_T_200_200",
        "name": "200 min 200 MB",
        "price": 1,
        "category": "mobile",
        "minutes": 200,
        "data": 200,
        "bandwidth": null
      },
      {
        "code": "SE_SC_REC_MOBILE_T_200_2048",
        "name": "200 min 2 GB",
        "price": 1,
        "category": "mobile",
        "minutes": 200,
        "data": 2048,
        "bandwidth": null
      },
      {
        "code": "SE_SC_REC_MOBILE_T_200_500",
        "name": "200 min 500 MB",
        "price": 1,
        "category": "mobile",
        "minutes": 200,
        "data": 500,
        "bandwidth": null
      },
      {
        "code": "SE_SC_REC_MOBILE_T_UNL_0",
        "name": "Il·limitades 0 MB",
        "price": 9,
        "category": "mobile",
        "minutes": 99999,
        "data": 0,
        "bandwidth": null
      },
      {
        "code": "SE_SC_REC_MOBILE_T_UNL_1024",
        "name": "Il·limitades 1 GB",
        "price": 11,
        "category": "mobile",
        "minutes": 99999,
        "data": 1024,
        "bandwidth": null
      },
      {
        "code": "SE_SC_REC_MOBILE_T_UNL_10240",
        "name": "Il·limitades 10 GB",
        "price": 14,
        "category": "mobile",
        "minutes": 99999,
        "data": 10240,
        "bandwidth": null
      },
      {
        "code": "SE_SC_REC_MOBILE_T_UNL_2048",
        "name": "Il·limitades 2 GB",
        "price": 12,
        "category": "mobile",
        "minutes": 99999,
        "data": 2048,
        "bandwidth": null
      },
      {
        "code": "SE_SC_REC_MOBILE_T_UNL_23552",
        "name": "Il·limitades 23 GB",
        "price": 18,
        "category": "mobile",
        "minutes": 99999,
        "data": 23552,
        "bandwidth": null
      },
      {
        "code": "SE_SC_REC_MOBILE_T_UNL_30720",
        "name": "Il·limitades 30 GB",
        "price": 22,
        "category": "mobile",
        "minutes": 99999,
        "data": 30720,
        "bandwidth": null
      },
      {
        "code": "SE_SC_REC_MOBILE_T_UNL_500",
        "name": "Il·limitades 500 MB",
        "price": 10,
        "category": "mobile",
        "minutes": 99999,
        "data": 500,
        "bandwidth": null
      },
      {
        "code": "SE_SC_REC_MOBILE_T_UNL_5120",
        "name": "Il·limitades 5 GB",
        "price": 1,
        "category": "mobile",
        "minutes": 99999,
        "data": 5120,
        "bandwidth": null
      },
      {
        "code": "SE_SC_REC_MOBILE_T_UNL_51200",
        "name": "Il·limitades 50 GB",
        "price": 27,
        "category": "mobile",
        "minutes": 99999,
        "data": 51200,
        "bandwidth": null
      }
    ]
  }
]
