{
    "$schema": "https://docs.renovatebot.com/renovate-schema.json",
    "platform": "gitlab",
    "repositories": [
        "northamp/cicd-components/renovate"
    ],
    "baseBranches": ["beta"],
    "branchPrefix": "renovate_",
    "assignees": [
        "alt4"
    ],
    "packageRules": [
        {
            "matchManagers": [
                "gitlabci"
            ],
            "addLabels": [
                "deps::ci/cd"
            ],
            "automerge": true,
            "automergeMethod": "squash",
            "semanticCommits": "enabled"
        }
    ]
}