name,email,document,city,state,start_date
Francisco das Neves,francisco.dasneves@desouza.br,172.100.560-92,Santa Giovana,Rio de Janeiro,2020-02-20
Sra. Norma Galvão de Souza,normagalvao@gmail.com,882.708.630-76,Barbacena,Minas Gerais,2020-01-10
Prof. Flavio Araújo,flavioaraujo@usp.br,324.928.428-94,Piracicaba,São Paulo,2020-06-15
