123456 28 3 2017 450 1050
123456 28 3 2017 450 1050
123456 28 3 2017 450 1050
123456 28 3 2017 450 1050
123457 28 3 2017 450 1050
123457 28 3 2017 450 1050
123457 28 3 2017 450 1050
123457 28 3 2017 450 1050
123457 28 3 2017 450 1050
123457 28 3 2017 450 1050
123452 28 3 2017 450 1050
123452 28 3 2017 450 1050
123452 28 4 2017 450 1050
123452 28 4 2017 450 1050
123452 28 4 2017 450 1050
