{
	"info": {
		"_postman_id": "9e4427f3-91bd-4814-9120-44ebdf89aa85",
		"name": "Capstone2",
		"schema": "https://schema.getpostman.com/json/collection/v2.1.0/collection.json",
		"_exporter_id": "27151055"
	},
	"item": [
		{
			"name": "userRegistration",
			"request": {
				"auth": {
					"type": "noauth"
				},
				"method": "POST",
				"header": [],
				"body": {
					"mode": "raw",
					"raw": "{\r\n    \"email\": \"cust5@mail.com\",\r\n    \"password\": \"cust5\",\r\n    \"firstName\": \"cust5 name\",\r\n    \"lastName\": \"cust5 last name\",\r\n    \"address\": \"cust5 address\",\r\n    \"mobileNo\": \"091909190919\"\r\n}",
					"options": {
						"raw": {
							"language": "json"
						}
					}
				},
				"url": {
					"raw": "localhost:4000/users/register",
					"host": [
						"localhost"
					],
					"port": "4000",
					"path": [
						"users",
						"register"
					]
				}
			},
			"response": []
		},
		{
			"name": "log in user",
			"protocolProfileBehavior": {
				"disableBodyPruning": true
			},
			"request": {
				"method": "GET",
				"header": [],
				"body": {
					"mode": "raw",
					"raw": "{\r\n    \"email\": \"cust5@mail.com\",\r\n    \"password\": \"cust5\"\r\n}",
					"options": {
						"raw": {
							"language": "json"
						}
					}
				},
				"url": {
					"raw": "localhost:4000/users/login",
					"host": [
						"localhost"
					],
					"port": "4000",
					"path": [
						"users",
						"login"
					]
				}
			},
			"response": []
		},
		{
			"name": "user profile by id (admin)",
			"protocolProfileBehavior": {
				"disableBodyPruning": true
			},
			"request": {
				"auth": {
					"type": "bearer",
					"bearer": [
						{
							"key": "token",
							"value": "{{trial1}}",
							"type": "string"
						}
					]
				},
				"method": "GET",
				"header": [],
				"body": {
					"mode": "raw",
					"raw": "",
					"options": {
						"raw": {
							"language": "json"
						}
					}
				},
				"url": {
					"raw": "localhost:4000/users/647fde4c1f329ac58b7f9aec",
					"host": [
						"localhost"
					],
					"port": "4000",
					"path": [
						"users",
						"647fde4c1f329ac58b7f9aec"
					]
				}
			},
			"response": []
		},
		{
			"name": "all user profiles(admin)",
			"request": {
				"auth": {
					"type": "bearer",
					"bearer": [
						{
							"key": "token",
							"value": "{{admin}}",
							"type": "string"
						}
					]
				},
				"method": "GET",
				"header": [],
				"url": {
					"raw": "localhost:4000/users",
					"host": [
						"localhost"
					],
					"port": "4000",
					"path": [
						"users"
					]
				}
			},
			"response": []
		},
		{
			"name": "add product(admin)",
			"request": {
				"auth": {
					"type": "bearer",
					"bearer": [
						{
							"key": "token",
							"value": "{{admin}}",
							"type": "string"
						}
					]
				},
				"method": "POST",
				"header": [],
				"body": {
					"mode": "raw",
					"raw": "{\r\n    \"productName\": \"Mug\",\r\n\t\"description\": \"Created by Nescafe \",\r\n    \"productCategory\": \"Kitchenware\",\r\n\t\"price\": 10,\r\n\t\"productStocks\": 100\r\n}",
					"options": {
						"raw": {
							"language": "json"
						}
					}
				},
				"url": {
					"raw": "localhost:4000/products/addProducts",
					"host": [
						"localhost"
					],
					"port": "4000",
					"path": [
						"products",
						"addProducts"
					]
				}
			},
			"response": []
		},
		{
			"name": "find all active products",
			"request": {
				"auth": {
					"type": "noauth"
				},
				"method": "GET",
				"header": [],
				"url": {
					"raw": "localhost:4000/products/",
					"host": [
						"localhost"
					],
					"port": "4000",
					"path": [
						"products",
						""
					]
				}
			},
			"response": []
		},
		{
			"name": "find all products(admin only)",
			"request": {
				"auth": {
					"type": "bearer",
					"bearer": [
						{
							"key": "token",
							"value": "eyJhbGciOiJIUzI1NiIsInR5cCI6IkpXVCJ9.eyJpZCI6IjY0N2RjMzgzNGMyYmE1ODg2MzdkYzI1MSIsImlzQWRtaW4iOnRydWUsImVtYWlsIjoiYWRtaW5AbWFpbC5jb20iLCJpYXQiOjE2ODYwMjE3NTJ9.wGxDIA8JHFUZYzJE3b2DaTsmjWesn_Hy5qzOX3jz2uo",
							"type": "string"
						}
					]
				},
				"method": "GET",
				"header": [],
				"url": {
					"raw": "localhost:4000/products/allProducts",
					"host": [
						"localhost"
					],
					"port": "4000",
					"path": [
						"products",
						"allProducts"
					]
				}
			},
			"response": []
		},
		{
			"name": "update products(admin only)",
			"request": {
				"auth": {
					"type": "bearer",
					"bearer": [
						{
							"key": "token",
							"value": "{{admin}}",
							"type": "string"
						}
					]
				},
				"method": "PATCH",
				"header": [],
				"body": {
					"mode": "raw",
					"raw": "/*\r\n    Updatable inforamtion\r\n    \"productName\": \"\"\r\n\t\"description\": \"\"\r\n    \"productCategory\": \"\"\r\n\t\"price\": \r\n    \"productStocks\":\r\n*/\r\n\r\n{\r\n    \"description\": \"Made in China \",\r\n\t\"productCategory\": \"Leather Shoes\"\r\n\r\n}",
					"options": {
						"raw": {
							"language": "json"
						}
					}
				},
				"url": {
					"raw": "localhost:4000/products/647fdce91f329ac58b7f9ae4",
					"host": [
						"localhost"
					],
					"port": "4000",
					"path": [
						"products",
						"647fdce91f329ac58b7f9ae4"
					]
				}
			},
			"response": []
		},
		{
			"name": "archive products (admin only)",
			"request": {
				"auth": {
					"type": "bearer",
					"bearer": [
						{
							"key": "token",
							"value": "{{admin}}",
							"type": "string"
						}
					]
				},
				"method": "PATCH",
				"header": [],
				"body": {
					"mode": "raw",
					"raw": "{\r\n    \"isActive\": false\r\n}",
					"options": {
						"raw": {
							"language": "json"
						}
					}
				},
				"url": {
					"raw": "localhost:4000/products/6480223c5681a87accbf4f6e/archiveProducts",
					"host": [
						"localhost"
					],
					"port": "4000",
					"path": [
						"products",
						"6480223c5681a87accbf4f6e",
						"archiveProducts"
					]
				}
			},
			"response": []
		},
		{
			"name": "activate products(admin only)",
			"request": {
				"auth": {
					"type": "bearer",
					"bearer": [
						{
							"key": "token",
							"value": "{{admin}}",
							"type": "string"
						}
					]
				},
				"method": "PATCH",
				"header": [],
				"body": {
					"mode": "raw",
					"raw": "{\r\n    \"isActive\": true\r\n}",
					"options": {
						"raw": {
							"language": "json"
						}
					}
				},
				"url": {
					"raw": "localhost:4000/products/6480223c5681a87accbf4f6e/activateProducts",
					"host": [
						"localhost"
					],
					"port": "4000",
					"path": [
						"products",
						"6480223c5681a87accbf4f6e",
						"activateProducts"
					]
				}
			},
			"response": []
		},
		{
			"name": "get a single product by id(admin only)",
			"request": {
				"auth": {
					"type": "bearer",
					"bearer": [
						{
							"key": "token",
							"value": "{{admin}}",
							"type": "string"
						}
					]
				},
				"method": "GET",
				"header": [],
				"url": {
					"raw": "localhost:4000/products/647dddf260a7975ad1c35180",
					"host": [
						"localhost"
					],
					"port": "4000",
					"path": [
						"products",
						"647dddf260a7975ad1c35180"
					]
				}
			},
			"response": []
		},
		{
			"name": "order products(current user)",
			"request": {
				"auth": {
					"type": "bearer",
					"bearer": [
						{
							"key": "token",
							"value": "{{cust4}}",
							"type": "string"
						}
					]
				},
				"method": "POST",
				"header": [],
				"body": {
					"mode": "raw",
					"raw": "/*\r\n    \"order_id\": \"\",\r\n    \"quantity\" : \r\n\r\n*/\r\n\r\n{\r\n    \"id\":\"647fdc111f329ac58b7f9ae0\",\r\n    \"quantity\": 5\r\n}",
					"options": {
						"raw": {
							"language": "json"
						}
					}
				},
				"url": {
					"raw": "localhost:4000/users/orderProducts",
					"host": [
						"localhost"
					],
					"port": "4000",
					"path": [
						"users",
						"orderProducts"
					]
				}
			},
			"response": []
		},
		{
			"name": "current user ordered items(current user order)",
			"request": {
				"auth": {
					"type": "bearer",
					"bearer": [
						{
							"key": "token",
							"value": "{{cust4}}",
							"type": "string"
						}
					]
				},
				"method": "GET",
				"header": [],
				"url": {
					"raw": "localhost:4000/users/orderedItems",
					"host": [
						"localhost"
					],
					"port": "4000",
					"path": [
						"users",
						"orderedItems"
					]
				}
			},
			"response": []
		},
		{
			"name": "user PAYMENT (current order)",
			"request": {
				"auth": {
					"type": "bearer",
					"bearer": [
						{
							"key": "token",
							"value": "eyJhbGciOiJIUzI1NiIsInR5cCI6IkpXVCJ9.eyJpZCI6IjY0ODAyYjkxZGU0ZTAyZDI1Y2M3MDU5OSIsImlzQWRtaW4iOmZhbHNlLCJlbWFpbCI6ImN1c3Q0QG1haWwuY29tIiwiaWF0IjoxNjg2MTIxMzc4fQ.tXotz72MzXl2ZQODgFFoGjZt7qboDj3a-EgRfvQ2Tlo",
							"type": "string"
						}
					]
				},
				"method": "PATCH",
				"header": [],
				"body": {
					"mode": "raw",
					"raw": "/*\r\n    current user ordered _id : reference #\r\n    and order payment amount\r\n     \r\n    \"_id(array user orders)\": \"\",\r\n    \"orderPayment\": amount\r\n\r\n*/\r\n{\r\n  \"orderId\": \"64807f298597501f5cb0954c\",\r\n  \"paymentAmount\": 600\r\n}\r\n",
					"options": {
						"raw": {
							"language": "json"
						}
					}
				},
				"url": {
					"raw": "localhost:4000/users/orderPayments",
					"host": [
						"localhost"
					],
					"port": "4000",
					"path": [
						"users",
						"orderPayments"
					]
				}
			},
			"response": []
		},
		{
			"name": "view current user profile",
			"request": {
				"auth": {
					"type": "bearer",
					"bearer": [
						{
							"key": "token",
							"value": "",
							"type": "string"
						}
					]
				},
				"method": "GET",
				"header": [],
				"url": {
					"raw": "localhost:4000/users/myProfile",
					"host": [
						"localhost"
					],
					"port": "4000",
					"path": [
						"users",
						"myProfile"
					]
				}
			},
			"response": []
		},
		{
			"name": "get all authenticated users orders (admin only)",
			"request": {
				"auth": {
					"type": "bearer",
					"bearer": [
						{
							"key": "token",
							"value": "{{admin}}",
							"type": "string"
						}
					]
				},
				"method": "GET",
				"header": [],
				"url": {
					"raw": "localhost:4000/users/getAllOrders",
					"host": [
						"localhost"
					],
					"port": "4000",
					"path": [
						"users",
						"getAllOrders"
					]
				}
			},
			"response": []
		}
	],
	"variable": [
		{
			"key": "admin",
			"value": "eyJhbGciOiJIUzI1NiIsInR5cCI6IkpXVCJ9.eyJpZCI6IjY0N2RjMzgzNGMyYmE1ODg2MzdkYzI1MSIsImlzQWRtaW4iOnRydWUsImVtYWlsIjoiYWRtaW5AbWFpbC5jb20iLCJpYXQiOjE2ODYwMTE5Mzh9.BMod71FNqRvYaiim2q52Z6KFq_EbbbKQoG2ooCCWNu4"
		},
		{
			"key": "non admin user",
			"value": "eyJhbGciOiJIUzI1NiIsInR5cCI6IkpXVCJ9.eyJpZCI6IjY0N2RjMzY1NGMyYmE1ODg2MzdkYzI0ZSIsImlzQWRtaW4iOmZhbHNlLCJlbWFpbCI6ImN1c3QxQG1haWwuY29tIiwiaWF0IjoxNjg2MDEyMDA5fQ.3DcANjJvE2CJIbwJ9S235s9Mczj-qRqm9eal9eekyy0"
		},
		{
			"key": "trial1",
			"value": "eyJhbGciOiJIUzI1NiIsInR5cCI6IkpXVCJ9.eyJpZCI6IjY0N2Y0YmM0MWI5YmVjN2JmM2Q1ZTAyMiIsImlzQWRtaW4iOmZhbHNlLCJlbWFpbCI6InRyaWFsMUBtYWlsLmNvbSIsImlhdCI6MTY4NjA2NDA4MH0.L-wHD5i106OKSPdgbL-GS-aKrxTd56YtrCE2pJnfKHs"
		},
		{
			"key": "cust2",
			"value": "eyJhbGciOiJIUzI1NiIsInR5cCI6IkpXVCJ9.eyJpZCI6IjY0N2ZkZWU1MWYzMjlhYzU4YjdmOWFmMiIsImlzQWRtaW4iOmZhbHNlLCJlbWFpbCI6ImN1c3QyQG1haWwuY29tIiwiaWF0IjoxNjg2MTAxNzQ1fQ.Nn9MQPywhfLY_H6i7fUVCQluOn_xRhCiPH3uNA-dmkg"
		},
		{
			"key": "cust3",
			"value": "eyJhbGciOiJIUzI1NiIsInR5cCI6IkpXVCJ9.eyJpZCI6IjY0ODAxZjZhZWY3NzAwZWExYTE3N2JjNSIsImlzQWRtaW4iOmZhbHNlLCJlbWFpbCI6ImN1c3QzQG1haWwuY29tIiwiaWF0IjoxNjg2MTE4MzIyfQ.C0J1zEB7AHI1V31m_hbggaVmNiQ-50_cAYEzeT0evFI"
		},
		{
			"key": "cust4",
			"value": "eyJhbGciOiJIUzI1NiIsInR5cCI6IkpXVCJ9.eyJpZCI6IjY0ODAyYjkxZGU0ZTAyZDI1Y2M3MDU5OSIsImlzQWRtaW4iOmZhbHNlLCJlbWFpbCI6ImN1c3Q0QG1haWwuY29tIiwiaWF0IjoxNjg2MTIxMzc4fQ.tXotz72MzXl2ZQODgFFoGjZt7qboDj3a-EgRfvQ2Tlo"
		}
	]
}