cnp package
===========

Submodules
----------

cnp.app module
--------------

.. automodule:: cnp.app
   :members:
   :undoc-members:
   :show-inheritance:

cnp.common module
-----------------

.. automodule:: cnp.common
   :members:
   :undoc-members:
   :show-inheritance:

cnp.inout module
----------------

.. automodule:: cnp.inout
   :members:
   :undoc-members:
   :show-inheritance:

cnp.nparray module
------------------

.. automodule:: cnp.nparray
   :members:
   :undoc-members:
   :show-inheritance:

cnp.queue module
----------------

.. automodule:: cnp.queue
   :members:
   :undoc-members:
   :show-inheritance:

Module contents
---------------

.. automodule:: cnp
   :members:
   :undoc-members:
   :show-inheritance:
