{
    "class": "CommandLineTool",
    "cwlVersion": "v1.2",
    "$namespaces": {
      "sbg": "https://sevenbridges.com"
    },
    "baseCommand": [
      "sed"
    ],
    "inputs": [
      {
        "id": "input",
        "type": "File",
        "inputBinding": {
          "shellQuote": false,
          "position": 0
        }
      },
      {
        "id": "command",
        "type": "string",
        "inputBinding": {
          "shellQuote": false,
          "position": 0
        }
      }
    ],
    "outputs": [
      {
        "id": "output",
        "type": "File?",
        "outputBinding": {
          "glob": "*.out"
        }
      }
    ],
    "label": "sed",
    "requirements": [
      {
        "class": "ShellCommandRequirement"
      },
      {
        "class": "DockerRequirement",
        "dockerPull": "images.sbgenomics.com/contextualize/jq-alpine:0.1.0"
      },
      {
        "class": "InlineJavascriptRequirement"
      }
    ],
    "stdout": "$(inputs.input.nameroot).out",
    "sbg:projectName": "sandbox-lindsey",
    "sbg:revisionsInfo": [
      {
        "sbg:revision": 0,
        "sbg:modifiedBy": "htmdec/lindsey.kuettner",
        "sbg:modifiedOn": 1702483295,
        "sbg:revisionNotes": "Copy of htmdec/sandbox-lindsey/jq/2"
      },
      {
        "sbg:revision": 1,
        "sbg:modifiedBy": "htmdec/lindsey.kuettner",
        "sbg:modifiedOn": 1702483367,
        "sbg:revisionNotes": "Changed base command to sed."
      },
      {
        "sbg:revision": 2,
        "sbg:modifiedBy": "htmdec/lindsey.kuettner",
        "sbg:modifiedOn": 1702483377,
        "sbg:revisionNotes": ""
      }
    ],
    "sbg:image_url": null,
    "sbg:appVersion": [
      "v1.2"
    ],
    "id": "https://api.sbgenomics.com/v2/apps/htmdec/sandbox-lindsey/sed/2/raw/",
    "sbg:id": "htmdec/sandbox-lindsey/sed/2",
    "sbg:revision": 2,
    "sbg:revisionNotes": "",
    "sbg:modifiedOn": 1702483377,
    "sbg:modifiedBy": "htmdec/lindsey.kuettner",
    "sbg:createdOn": 1702483295,
    "sbg:createdBy": "htmdec/lindsey.kuettner",
    "sbg:project": "htmdec/sandbox-lindsey",
    "sbg:sbgMaintained": false,
    "sbg:validationErrors": [],
    "sbg:contributors": [
      "htmdec/lindsey.kuettner"
    ],
    "sbg:latestRevision": 2,
    "sbg:publisher": "sbg",
    "sbg:content_hash": "ad6734ed53493cf3112c890f3a570dbeca8edac64f8d384978ca5f106f7e4518d",
    "sbg:workflowLanguage": "CWL"
  }