{
    "class": "CommandLineTool",
    "cwlVersion": "v1.2",
    "$namespaces": {
      "sbg": "https://sevenbridges.com"
    },
    "baseCommand": [
      "birdshot",
      "--no-auth"
    ],
    "inputs": [
      {
        "id": "graph",
        "type": "File?",
        "inputBinding": {
          "prefix": "load",
          "shellQuote": false,
          "position": 0
        }
      },
      {
        "id": "algorithm",
        "type": [
          "null",
          {
            "type": "enum",
            "symbols": [
              "preorder",
              "nearest",
              "postorder",
              "scatter"
            ],
            "name": "algorithm"
          }
        ],
        "inputBinding": {
          "prefix": "--algorithm",
          "shellQuote": false,
          "position": 2
        },
        "label": "Traversal Algorithm",
        "doc": "Aggregation of data copies properties from child to parent.\n\nRelationally this is equivalent to the properties of the children being representative of the parent.\n\nTraversal order impacts the degree to which properties are aggregated.\n\nPreorder (a.k.a. nearest) only aggregates properties from a child to its parent, but those properties do not extend to earlier descendants.\n\nPostorder (a.k.a. collect) aggregates properties to all descendants. See \"start\" and \"stop\" options for logical control over postorder traversal.",
        "default": "scatter"
      },
      {
        "id": "method",
        "type": [
          "null",
          {
            "type": "enum",
            "symbols": [
              "skip",
              "append"
            ],
            "name": "method"
          }
        ],
        "inputBinding": {
          "prefix": "--method",
          "shellQuote": false,
          "position": 2
        },
        "label": "Merge Method",
        "doc": "By default, observations of each property type are collected into a list, so if, for example, several measurements of property A are made of one parent, all of these are captured in the parent.\n\nAlternatively, and less commonly, \"skip\" will only aggregate properties not already present in the parent. Relationally this could indicate that the parent property value should be used preferentially and to the exclusion of the child property.",
        "default": "append"
      },
      {
        "id": "start",
        "type": "string?",
        "inputBinding": {
          "prefix": "--start",
          "shellQuote": false,
          "position": 2
        },
        "label": "Start Name",
        "doc": "If specified, this will start aggregations at nodes matching the regular expression provided.\n\nNote that specifying a start node implies postorder (collect) traversal irrespective of the \"--algorithm\" setting."
      },
      {
        "id": "stop",
        "type": "string?",
        "inputBinding": {
          "prefix": "--stop",
          "shellQuote": false,
          "position": 2
        },
        "label": "Stop Name",
        "doc": "If given, aggregation stops at the specified node."
      }
    ],
    "outputs": [
      {
        "id": "output",
        "type": "File?",
        "outputBinding": {
          "glob": "$(inputs.graph.nameroot)-propagate$(inputs.graph.nameext)"
        }
      }
    ],
    "label": "birdshot-graph-propagate",
    "arguments": [
      {
        "prefix": "",
        "shellQuote": false,
        "position": 1,
        "valueFrom": "propagate"
      },
      {
        "prefix": "dump",
        "shellQuote": false,
        "position": 3,
        "valueFrom": "$(inputs.graph.nameroot)-propagate$(inputs.graph.nameext)"
      }
    ],
    "requirements": [
      {
        "class": "ShellCommandRequirement"
      },
      {
        "class": "DockerRequirement",
        "dockerPull": "images.sbgenomics.com/htmdec/birdshot:0.1.8"
      },
      {
        "class": "InlineJavascriptRequirement"
      }
    ],
    "sbg:projectName": "demo",
    "sbg:revisionsInfo": [
      {
        "sbg:revision": 0,
        "sbg:modifiedBy": "htmdec/bkappes",
        "sbg:modifiedOn": 1703447587,
        "sbg:revisionNotes": "Copy of htmdec/demo/birdshot-graph-aggregate/1"
      },
      {
        "sbg:revision": 1,
        "sbg:modifiedBy": "htmdec/bkappes",
        "sbg:modifiedOn": 1703447703,
        "sbg:revisionNotes": "Initial commit."
      },
      {
        "sbg:revision": 2,
        "sbg:modifiedBy": "htmdec/bkappes",
        "sbg:modifiedOn": 1703448666,
        "sbg:revisionNotes": "Hotfix: change output file name."
      }
    ],
    "sbg:image_url": null,
    "sbg:appVersion": [
      "v1.2"
    ],
    "id": "https://api.sbgenomics.com/v2/apps/htmdec/demo/birdshot-graph-propagate/2/raw/",
    "sbg:id": "htmdec/demo/birdshot-graph-propagate/2",
    "sbg:revision": 2,
    "sbg:revisionNotes": "Hotfix: change output file name.",
    "sbg:modifiedOn": 1703448666,
    "sbg:modifiedBy": "htmdec/bkappes",
    "sbg:createdOn": 1703447587,
    "sbg:createdBy": "htmdec/bkappes",
    "sbg:project": "htmdec/demo",
    "sbg:sbgMaintained": false,
    "sbg:validationErrors": [],
    "sbg:contributors": [
      "htmdec/bkappes"
    ],
    "sbg:latestRevision": 2,
    "sbg:publisher": "sbg",
    "sbg:content_hash": "ad27af9ca580ea4c7ec1534443a0258961ce5bda841726fae00c2c5ee820fa796",
    "sbg:workflowLanguage": "CWL"
  }
  