{
    "class": "CommandLineTool",
    "cwlVersion": "v1.2",
    "$namespaces": {
      "sbg": "https://sevenbridges.com"
    },
    "baseCommand": [],
    "inputs": [
      {
        "id": "input",
        "type": "File[]?"
      },
      {
        "id": "output_filename",
        "type": "string?"
      }
    ],
    "outputs": [
      {
        "id": "output",
        "type": "File?",
        "outputBinding": {
          "glob": "*.xlsx"
        }
      }
    ],
    "label": "concat-xlsx",
    "arguments": [
      {
        "prefix": "",
        "shellQuote": false,
        "position": 0,
        "valueFrom": "read -p 'index_col=0' -f ${\n    function get_path(obj) {\n        return obj.path\n    }\n    var paths = inputs.input.map(get_path)\n    return paths.join(\" read -p 'index_col=0' -f \")\n} concat write -f $(inputs.output_filename)"
      }
    ],
    "requirements": [
      {
        "class": "ShellCommandRequirement"
      },
      {
        "class": "DockerRequirement",
        "dockerPull": "images.sbgenomics.com/contextualize/tools-pd:0.1.1"
      },
      {
        "class": "InlineJavascriptRequirement"
      }
    ],
    "sbg:projectName": "sandbox-lindsey",
    "sbg:revisionsInfo": [
      {
        "sbg:revision": 0,
        "sbg:modifiedBy": "htmdec/lindsey.kuettner",
        "sbg:modifiedOn": 1704215734,
        "sbg:revisionNotes": null
      },
      {
        "sbg:revision": 1,
        "sbg:modifiedBy": "htmdec/lindsey.kuettner",
        "sbg:modifiedOn": 1704215823,
        "sbg:revisionNotes": ""
      }
    ],
    "sbg:image_url": null,
    "sbg:appVersion": [
      "v1.2"
    ],
    "id": "https://api.sbgenomics.com/v2/apps/htmdec/sandbox-lindsey/concat-xlsx/1/raw/",
    "sbg:id": "htmdec/sandbox-lindsey/concat-xlsx/1",
    "sbg:revision": 1,
    "sbg:revisionNotes": "",
    "sbg:modifiedOn": 1704215823,
    "sbg:modifiedBy": "htmdec/lindsey.kuettner",
    "sbg:createdOn": 1704215734,
    "sbg:createdBy": "htmdec/lindsey.kuettner",
    "sbg:project": "htmdec/sandbox-lindsey",
    "sbg:sbgMaintained": false,
    "sbg:validationErrors": [],
    "sbg:contributors": [
      "htmdec/lindsey.kuettner"
    ],
    "sbg:latestRevision": 1,
    "sbg:publisher": "sbg",
    "sbg:content_hash": "adc47ce57ebed9b2e4616750bed3063d93c256355f29000f2251f228f6c756103",
    "sbg:workflowLanguage": "CWL"
  }