﻿string_id,eng,gsw,dut
__ML0001_START_ANNOTATION_GUIDE__,"To start annotation, press the open button above (folder icon) and select the provided project file.","Um die Annotierung zu beginnen, drücken Sie auf die ""Öffnen"" Schaltfläche (Ordnersymbol) und wählen Sie das gewünschte Projektdokument aus.","[DUMMY EXAMPLE] Om annotatie te starten, druk op de open knop hierboven (mappictogram) en selecteer het verstrekte projectbestand."
__ML0002_SAVE_ANNOTATION_GUIDE_1__,"To save annotation, press the save button above (floppy icon) and select the desired folder.","Um die Annotation zu speichern, drücken Sie die ""Speichern"" Schaltfläche (Diskettensymbol) und wählen Sie den gewünschten Ordner.",dummy
__ML0003_SAVE_ANNOTATION_GUIDE_2__,N.B. The work can be saved in order to resume it later. There is not an auto-save function.,"N.B. Die Annotationen können gespeichert werden, um die Arbeit später fortzusetzen. Eine automatische Speicherfunktion gibt es leider nicht.",dummy
__ML0004_SHORTCUTS_GUIDE__,"A quick guide is provided during usage. For an improved usage, press the shortcuts button above (keyboard button).",Während der Benutzung wird eine Kurzanleitung zur Verfügung gestellt. Für eine vereinfachte Benutzung drücken Sie die obige Shortcut-Taste (Tastaturtaste).,dummy
__ML0005_OPEN_A_PROJECT__,Open a Project,Ein Projekt öffnen,dummy
__ML0006_SAVE_CURRENT_PROJECT__,Save current Project,Aktuelles Projekt speichern,dummy
__ML0007_KEYBOARD_SHORTCUTS__,Keyboard Shortcuts,Tastatur-Abkürzungen (Shortcuts),dummy
__ML0008_ABOUT__,About,Infos,dummy
__ML0009_GENERAL__,General,Allgemein,dummy
__ML0010_COMMAND__,Command,Befehl,dummy
__ML0011_SHORTCUT__,Shortcut,Abkürzung (Shortcut),dummy
__ML0012_PLAY_OR_PAUSE_MEDIA__,Play or Pause Media,Video abspielen oder anhalten,dummy
__ML0013_TOGGLE_MEDIA_MUTE__,Toggle Media Mute,Ton aus/einschalten,dummy
__ML0014_INCREASE_DECREASE_SPEED__,Increase / Decrease Media Playback Speed,Wiedergabegeschwindigkeit erhöhen/verringern,dummy
__ML0015_RESTORE_SPEED__,Restore Media Playback Speed,Wiederherstellen der Standardwiedergabegeschwindigkeit,dummy
__ML0016_BACKWARD_SEC__,Move Media Time Backward by 1 / 2 / ... / 9 sec.,Im Video um 1 / 2 / ...  / 9 Sek. vorwärts sprignen ,dummy
__ML0017_FORWARD_SEC__,Move Media Time Forward by 1 / 2 / ... / 9 sec.,Im Video um 1 / 2 / ...  / 9 Sek. zurück springen ,dummy
__ML0018_BACKWARD_FRAME__,Move Media Time Forward / Backward by 1 frame,Im Video um 1 Bild vorwärts/zurück springen,dummy
__ML0019_FORWARD_FRAME__,Move Media Time Forward / Backward by 5 frames,Im Video um 5 Bilder vorwärts/zurück springen,dummy
__ML0020_PREVIOUS_NEXT_TIMELINE__,Select Previous / Next Temporal Segment Timeline,Voriges/Nächstes Zeitsegment auswählen,dummy
__ML0021_SELECT_SEGMENT__,Select Temporal Segment on the current Timeline,Zeitsegment auf der aktuellen Zeitachse auswählen,dummy
__ML0022_SELECT_CURRENT_SEGMENT__,Select Temporal Segment at Current Time (if any),Zeitsegment zur aktuellen Zeit auswählen (falls vorhanden),dummy
__ML0023_PREVIOUS_NEXT_FRAME__,Move to Previous / Next Video Frame,Im Video um 1 Bild rückwärts / vorwärts springen,dummy
__ML0024_VIDEO_START_END__,Jump to Start/End of Video,Zum Anfang/Ende des Videos springen,dummy
__ML0025_SHIFT_TIMELINE_1SEC__,Shift Visible Timeline by 1 sec.,Sichtbaren Videobereich um 1 Sekunde verschieben.,dummy
__ML0026_SHIFT_TIMELINE_60SEC__,Shift Visible Timeline by 60 sec.,Sichtbaren Videobereich um 60 Sekunden verschieben.,dummy
__ML0027_ZOOM_TIMELINE__,Zoom In/Out the Temporal Segment Timeline,Auflösung der Zeitachse vergrößern/verkleinern,dummy
__ML0028_MOUSE_WHEEL__,Mouse Wheel,Mausrad,dummy
__ML0029_PAN_TIMELINE__,Pan the Temporal Segment Timeline Horizontally,Zeitsegment entlang der Zeitachse verschieben,dummy
__ML0030_SEGMENT_SELECTED__,When a Temporal Segment is Selected,Wenn ein Zeitsegment ausgewählt ist,dummy
__ML0031_SEGMENT_PLAY_PAUSE__,Play or Pause Media (Locked to Temporal Segment),Video abspielen oder anhalten (auf Zeitsegment begrenzt),dummy
__ML0032_UNSELECT_SEGMENT__,Unselect Temporal Segment,Auswahl des Zeitsegments aufheben,dummy
__ML0033_INCREASE_SEGMENT_1FRAME__,Increase the Extent of Left / Right Edge (by 1 frame),Erweitern des Zeitsegments links / rechts (um 1 Frame),dummy
__ML0034_DECREASE_SEGMENT_1FRAME__,Decrease the Extent of Left / Right Edge (by 1 frame),Verkleinern des Zeitsegments links / rechts (um 1 Frame),dummy
__ML0035_INCREASE_SEGMENT_1SEC__,Increase the Extent of Left / Right Edge (by 1 sec.),Erweitern des Zeitsegments links / rechts (um 1 Sek.),dummy
__ML0036_DECREASE_SEGMENT_1SEC__,Decrease the Extent of Left / Right Edge (by 1 sec.),Verkleinern des Zeitsegments links / rechts (um 1 Sek.),dummy
__ML0037_SEGMENT_START_END__,Jump to Start / End of Temporal Segment,Zum Anfang/Ende des Zeitsegments springen,dummy
__ML0038_MOVE_SEGMENT_1FRAME__,Move Selected Temporal Segment (by 1 frame),Ausgewähltes Zeitsegment verschieben (um 1 Frame),dummy
__ML0039_MOVE_SEGMENT_1SEC__,Move Selected Temporal Segment (by 1 sec.),Ausgewähltes Zeitsegment verschieben (um 1 Sek.),dummy
__ML0040_VERSION__,Version,Version,dummy
__ML0041_APP_DESCRIPTION_1__,CONTENT4ALL based on VIA is a tool to align videos transcriptions to the relative Sign Language interpretations for the CONTENT4ALL Project (an European Union’s Horizon 2020 research and innovation funded project).,CONTENT4ALL based on VIA ist eine Anwendung zur Synchronisierung von Videotranskriptionen mit den entsprechenden Gebärdenspracheninterpretationen für das CONTENT4ALL-Projekt (ein von der Europäischen Union im Rahmen von Horizon 2020 finanziertes Forschungs- und Innovationsprojekt).,dummy
__ML0042_APP_DESCRIPTION_2__,The goal is to obtain ground-truth data for the development of the CONTENT4ALL automatic translator of spoken/written language to Sign Language.,"Ziel dieser Anwendung ist es, eine Sammlung von annotierten Basisdaten für die Entwicklung des automatischen Übersetzungssystems zur Übersetzung gesprochener/geschriebener Sprache in Gebärdensprache in CONTENT4ALL aufzubauen.",dummy
__ML0043_APP_DESCRIPTION_3__,The tool is based on the VGG Image Annotator (VIA) of Abhishek Dutta (Visual Geometry Group of Oxford University).,Die Anwendung basiert auf dem VGG Image Annotator (VIA) von Dr. Abhishek Dutta (Visual Geometry Group der Universität Oxford).,dummy
__ML0044_APP_DESCRIPTION_4__,"This software is released as Open Source according to the ""2-Clause BSD License"".","Diese Software wird als Open Source gemäß der ""2-Klausel-BSD-Lizenz"" veröffentlicht.",dummy
__ML0045_APP_DESCRIPTION_5__,More details about CONTENT4ALL are available from:,Weitere Informationen über CONTENT4ALL erhalten Sie bei,dummy
__ML0046_APP_DESCRIPTION_6__,More details about VIA are available from:,Weitere Informationen über VIA erhalten Sie bei,dummy
__ML0047_LICENSE__,License,Lizenz,dummy
__ML0048_ORIGINAL_LICENSE__,Portions of this program were originally released under the following license:,Teile dieser Anwendung wurden ursprünglich unter der folgenden Lizenz veröffentlicht:,dummy
__ML0049_TIMELINE_QUICK_GUIDE__,"Paused. Press <span class=""key"">Space</span> to resume. Press <span class=""key"">&larr;</span> / <span class=""key"">&rarr;</span> to shift visible timeline and Mouse Wheel (over the second timeline) to zoom in/out. Click on a coloured Temporal Segment to edit it.","Pausiert. Drücken Sie <span class=""key"">Space</span>, um fortzufahren. Drücken Sie die Taste <span class=""key"">&larr;</span> / <span class=""key"">&rarr;</span>, um die sichtbare Zeitachse zu verschieben, und das Mausrad (über die zweite Zeitachse) zum Vergrößern/Verkleinern. Klicken Sie auf ein farbiges Temporalsegment, um es zu bearbeiten.",dummy
__ML0050_SEGMENT_QUICK_GUIDE__,"Temporal Segment selected. Drag the center to move, drag edges to resize. Press <span class=""key"">Delete</span> to discard/restore and <span class=""key"">Esc</span> to unselect.","Zeitsegment ausgewählt. Ziehen Sie die Mitte zum Verschieben, ziehen Sie die Ränder zur Änderung der Größe. Drücken Sie <span class=""key"">Delete</span> um die Auswahl zu verwerfen/wiederherzustellen und <span class=""key"">Esc</span> um die Auswahl aufzuheben.",dummy
__ML0051_PLAYING_QUICK_GUIDE__,"Playing. Press <span class=""key"">Space</span> to pause.","Wiedergabe. Drücken Sie <span class=""key"">Space</span> zum Anhalten.",dummy
__ML0052_TIMELINE_BOUNDARY__,Cannot move beyond the video timeline boundary!,Kann nicht über die Grenze des Videos hinausgehen!,dummy
__ML0053_SEGMENT_BOUNDARY__,Cannot move temporal segment beyond the boundary!,Das Zeitsegment kann nicht über die Videogrenze hinaus bewegt werden!,dummy
__ML0054_ERROR_PAGE_TITLE__,"Sorry, something went wrong",Fehler. Etwas hat nicht einwandfrei funktioniert.,dummy
__ML0055_ERROR_PAGE_DESCRIPTION__,"Please, save your current work on a DIFFERENT file, refresh the page, load it again and check if everything is ok.","Bitte speichern Sie Ihre aktuelle Arbeit unter einem ANDEREN Dateinamen, aktualisieren Sie die Seite, laden Sie sie erneut und überprüfen Sie, ob alles in Ordnung ist.",dummy
__ML0056_LEFT_EDGE_UPDATE__,Cannot update left edge!,Linker Rand nicht aktualisierbar!,dummy
__ML0057_RIGHT_EDGE_UPDATE__,Cannot update right edge!,Rechter Rand nicht aktualisierbar!,dummy
__ML0058_EDGE_BOUNDARY__,Cannot update edge beyond the boundary!,Rand über die Grenze nicht aktualisierbar!,dummy
__ML0058_DISCARD_SEGMENT__,Discard/Restore Temporal Segment on the current Timeline,Zeitliches Segment auf der aktuellen Zeitachse verwerfen/wiederherstellen,dummy
