0  0.0 
1 0.84  0.0 
0  0.03 
0  0.05 
0  0.08 
0  0.1 
1 0.82  0.13 
1 0.78  0.15 
1 0.76  0.18 
0  0.2 
0  0.23 
1 0.8  0.25 
1 0.77  0.28 
1 0.71  0.31 
0  0.33 
1 0.82  0.36 
1 0.85  0.39 
1 0.85  0.42 
1 0.79  0.44 
0  0.47 
1 0.8  0.5 
1 0.89  0.52 
1 0.86  0.55 
1 0.84  0.58 
1 0.85  0.61 
1 0.85  0.64 
1 0.77  0.67 
2 0.74 0.75  0.7 
1 0.72  0.72 
0  0.75 
1 0.85  0.77 
1 0.73  0.8 
0  0.82 
1 0.71  0.85 
1 0.78  0.88 
1 0.87  0.9 
1 0.88  0.93 
1 0.85  0.96 
0  0.98 
1 0.74  1.01 
1 0.73  1.04 
0  1.07 
0  1.1 
0  1.12 
0  1.15 
0  1.17 
0  1.19 
0  1.22 
0  1.24 
0  1.27 
0  1.29 
0  1.31 
0  1.34 
0  1.36 
0  1.39 
0  1.41 
0  1.43 
0  1.46 
0  1.48 
0  1.5 
0  1.53 
0  1.55 
0  1.58 
0  1.6 
0  1.62 
0  1.65 
0  1.67 
0  1.69 
0  1.71 
0  1.74 
0  1.76 
0  1.78 
0  1.81 
0  1.83 
0  1.85 
0  1.87 
0  1.9 
0  1.92 
0  1.94 
0  1.97 
0  1.99 
0  2.02 
0  2.04 
0  2.08 
0  2.11 
0  2.14 
0  2.16 
0  2.19 
0  2.21 
0  2.23 
0  2.25 
0  2.28 
0  2.3 
0  2.33 
0  2.35 
0  2.37 
0  2.4 
0  2.42 
1 0.77  2.45 
1 0.8  2.48 
1 0.78  2.51 
1 0.78  2.54 
0  2.57 
1 0.75  2.59 
1 0.77  2.62 
1 0.84  2.65 
1 0.83  2.68 
0  2.7 
1 0.76  2.73 
1 0.84  2.76 
1 0.78  2.79 
1 0.77  2.82 
1 0.73  2.85 
1 0.78  2.88 
1 0.71  2.91 
0  2.94 
0  2.96 
0  2.99 
1 0.71  3.02 
1 0.71  3.05 
0  3.07 
1 0.72  3.1 
0  3.12 
1 0.71  3.15 
0  3.19 
0  3.22 
0  3.25 
1 0.73  3.28 
0  3.31 
0  3.34 
1 0.73  3.37 
0  3.39 
0  3.42 
1 0.71  3.45 
0  3.48 
0  3.5 
1 0.71  3.53 
0  3.55 
1 0.71  3.58 
1 0.74  3.61 
1 0.81  3.64 
1 0.84  3.67 
1 0.86  3.7 
1 0.82  3.73 
1 0.82  3.76 
1 0.8  3.79 
1 0.85  3.81 
1 0.81  3.84 
1 0.83  3.87 
1 0.85  3.89 
1 0.86  3.92 
1 0.91  3.95 
1 0.91  3.97 
1 0.9  4.0 
1 0.9  4.03 
1 0.8  4.05 
1 0.79  4.08 
1 0.84  4.11 
1 0.85  4.14 
1 0.88  4.16 
1 0.91  4.19 
1 0.91  4.22 
1 0.88  4.24 
1 0.88  4.27 
1 0.88  4.3 
1 0.9  4.32 
1 0.92  4.35 
1 0.92  4.38 
1 0.9  4.4 
1 0.9  4.43 
1 0.9  4.46 
1 0.85  4.48 
1 0.79  4.51 
0  4.53 
0  4.56 
0  4.58 
1 0.73  4.61 
0  4.63 
0  4.66 
0  4.68 
0  4.7 
0  4.72 
1 0.73  4.75 
0  4.77 
0  4.8 
0  4.82 
0  4.84 
0  4.87 
0  4.89 
0  4.92 
0  4.94 
1 0.76  4.97 
1 0.78  4.99 
0  5.02 
0  5.05 
0  5.07 
0  5.09 
0  5.12 
1 0.73  5.15 
0  5.17 
0  5.2 
0  5.22 
0  5.25 
0  5.27 
0  5.29 
0  5.32 
0  5.34 
0  5.37 
0  5.4 
0  5.42 
0  5.45 
0  5.48 
0  5.5 
0  5.53 
0  5.55 
0  5.58 
0  5.6 
0  5.62 
0  5.65 
0  5.67 
0  5.7 
0  5.72 
0  5.75 
0  5.77 
0  5.8 
0  5.82 
0  5.84 
0  5.87 
0  5.89 
0  5.91 
0  5.94 
0  5.96 
0  5.98 
0  6.01 
1 0.73  6.03 
1 0.8  6.06 
1 0.74  6.09 
0  6.12 
3 0.73 0.74 0.76  6.15 
0  6.17 
0  6.2 
0  6.22 
0  6.25 
0  6.27 
0  6.3 
0  6.32 
0  6.34 
0  6.37 
0  6.39 
0  6.41 
0  6.44 
0  6.46 
0  6.49 
0  6.51 
0  6.54 
1 0.81  6.57 
0  6.59 
0  6.62 
1 0.73  6.65 
0  6.67 
1 0.76  6.7 
0  6.73 
0  6.75 
0  6.78 
0  6.8 
0  6.83 
0  6.85 
0  6.88 
0  6.9 
0  6.92 
0  6.95 
0  6.97 
0  6.99 
0  7.02 
0  7.04 
0  7.06 
0  7.09 
0  7.11 
0  7.13 
0  7.16 
0  7.18 
0  7.21 
0  7.23 
0  7.25 
0  7.28 
0  7.3 
0  7.33 
0  7.35 
0  7.38 
0  7.4 
0  7.43 
0  7.45 
1 0.73  7.48 
0  7.5 
0  7.53 
0  7.55 
0  7.58 
0  7.61 
0  7.63 
0  7.66 
0  7.68 
1 0.8  7.71 
1 0.75  7.75 
1 0.72  7.78 
1 0.71  7.81 
0  7.84 
0  7.86 
0  7.89 
0  7.91 
0  7.94 
0  7.96 
1 0.82  7.99 
1 0.81  8.02 
1 0.72  8.05 
1 0.74  8.08 
1 0.79  8.11 
1 0.73  8.14 
1 0.81  8.16 
1 0.88  8.2 
1 0.85  8.22 
1 0.81  8.25 
1 0.83  8.28 
1 0.86  8.31 
1 0.87  8.33 
1 0.87  8.36 
1 0.86  8.39 
1 0.86  8.42 
1 0.86  8.45 
1 0.86  8.48 
1 0.85  8.5 
1 0.84  8.53 
1 0.84  8.56 
1 0.85  8.59 
1 0.86  8.62 
1 0.89  8.65 
1 0.89  8.68 
1 0.89  8.71 
1 0.88  8.74 
1 0.85  8.77 
1 0.83  8.8 
1 0.84  8.82 
1 0.84  8.85 
1 0.86  8.88 
2 0.8 0.87  8.91 
1 0.88  8.94 
2 0.76 0.91  8.97 
1 0.92  9.0 
2 0.72 0.92  9.02 
2 0.78 0.91  9.05 
2 0.79 0.91  9.08 
1 0.9  9.11 
1 0.9  9.13 
1 0.85  9.16 
1 0.85  9.19 
1 0.87  9.21 
1 0.85  9.24 
1 0.86  9.27 
1 0.88  9.29 
1 0.87  9.32 
1 0.86  9.35 
1 0.86  9.38 
1 0.85  9.41 
1 0.84  9.44 
1 0.82  9.47 
1 0.85  9.5 
1 0.85  9.53 
1 0.83  9.56 
1 0.85  9.59 
1 0.85  9.62 
1 0.86  9.65 
1 0.87  9.68 
1 0.86  9.71 
1 0.86  9.74 
1 0.88  9.77 
1 0.9  9.8 
1 0.9  9.83 
1 0.89  9.85 
1 0.89  9.88 
1 0.9  9.91 
1 0.91  9.94 
1 0.91  9.96 
1 0.9  9.99 
1 0.9  10.02 
1 0.9  10.04 
1 0.9  10.07 
1 0.9  10.1 
1 0.89  10.13 
1 0.89  10.16 
1 0.89  10.18 
1 0.88  10.21 
1 0.9  10.24 
1 0.9  10.27 
1 0.92  10.29 
1 0.92  10.32 
2 0.76 0.91  10.35 
2 0.76 0.91  10.38 
1 0.91  10.41 
1 0.9  10.44 
2 0.74 0.89  10.47 
1 0.87  10.5 
1 0.88  10.53 
1 0.86  10.56 
1 0.83  10.59 
1 0.82  10.61 
1 0.88  10.64 
1 0.91  10.67 
1 0.92  10.7 
1 0.9  10.73 
2 0.84 0.91  10.75 
2 0.74 0.9  10.78 
1 0.91  10.81 
1 0.9  10.84 
1 0.89  10.87 
1 0.89  10.89 
2 0.78 0.89  10.92 
1 0.89  10.95 
2 0.72 0.89  10.98 
1 0.89  11.01 
1 0.87  11.04 
1 0.88  11.07 
1 0.86  11.09 
1 0.89  11.12 
1 0.9  11.15 
1 0.91  11.18 
0  11.2 
0  11.22 
0  11.25 
0  11.27 
1 0.75  11.3 
0  11.32 
1 0.71  11.35 
1 0.89  11.38 
1 0.9  11.41 
1 0.92  11.43 
1 0.9  11.46 
1 0.91  11.49 
2 0.71 0.91  11.52 
1 0.9  11.55 
1 0.9  11.58 
1 0.9  11.6 
1 0.9  11.63 
1 0.91  11.66 
1 0.88  11.69 
1 0.89  11.72 
1 0.9  11.75 
1 0.89  11.78 
2 0.71 0.91  11.81 
1 0.91  11.84 
1 0.91  11.87 
1 0.87  11.9 
0  11.93 
0  11.95 
0  11.98 
0  12.0 
0  12.03 
0  12.06 
0  12.08 
0  12.11 
0  12.13 
0  12.16 
1 0.87  12.19 
1 0.84  12.22 
1 0.74  12.24 
1 0.76  12.27 
1 0.77  12.3 
0  12.32 
0  12.35 
1 0.71  12.38 
1 0.79  12.4 
2 0.8 0.86  12.43 
1 0.88  12.47 
1 0.88  12.49 
0  12.52 
0  12.54 
1 0.73  12.57 
2 0.75 0.81  12.6 
1 0.83  12.63 
0  12.65 
2 0.74 0.84  12.68 
2 0.79 0.86  12.71 
2 0.85 0.88  12.74 
2 0.8 0.86  12.77 
2 0.79 0.82  12.8 
2 0.82 0.88  12.83 
2 0.71 0.94  12.86 
1 0.91  12.89 
1 0.94  12.91 
1 0.93  12.94 
1 0.93  12.97 
2 0.76 0.92  13.0 
1 0.82  13.02 
1 0.89  13.05 
1 0.86  13.08 
1 0.92  13.11 
2 0.72 0.9  13.14 
2 0.81 0.91  13.16 
2 0.83 0.91  13.2 
1 0.84  13.22 
1 0.81  13.25 
1 0.81  13.28 
1 0.82  13.31 
0  13.33 
0  13.36 
0  13.38 
0  13.41 
0  13.44 
0  13.46 
0  13.49 
0  13.51 
2 0.71 0.72  13.54 
1 0.76  13.58 
0  13.6 
0  13.62 
0  13.65 
0  13.67 
0  13.7 
0  13.72 
0  13.75 
0  13.78 
0  13.8 
1 0.82  13.83 
1 0.82  13.86 
2 0.73 0.86  13.88 
2 0.75 0.86  13.91 
2 0.77 0.89  13.94 
2 0.86 0.88  13.97 
2 0.84 0.86  14.01 
2 0.83 0.88  14.03 
2 0.71 0.77  14.06 
1 0.77  14.09 
0  14.12 
0  14.14 
1 0.73  14.17 
2 0.81 0.86  14.2 
1 0.84  14.24 
1 0.85  14.27 
1 0.88  14.3 
1 0.7  14.33 
0  14.35 
1 0.72  14.38 
2 0.74 0.8  14.42 
3 0.79 0.82 0.84  14.45 
3 0.72 0.75 0.85  14.48 
2 0.8 0.87  14.51 
2 0.79 0.86  14.55 
1 0.76  14.58 
0  14.6 
1 0.75  14.63 
0  14.66 
0  14.68 
0  14.71 
0  14.73 
0  14.76 
0  14.79 
0  14.81 
0  14.84 
0  14.87 
0  14.89 
0  14.92 
0  14.94 
0  14.97 
0  14.99 
0  15.02 
1 0.7  15.04 
0  15.07 
0  15.09 
0  15.12 
0  15.14 
0  15.16 
1 0.73  15.19 
0  15.22 
1 0.77  15.25 
0  15.28 
0  15.3 
0  15.33 
0  15.35 
0  15.38 
0  15.4 
0  15.43 
0  15.45 
1 0.71  15.48 
0  15.51 
0  15.54 
1 0.73  15.57 
1 0.74  15.59 
1 0.71  15.62 
0  15.65 
0  15.67 
0  15.69 
0  15.72 
1 0.74  15.75 
1 0.81  15.78 
0  15.81 
0  15.83 
0  15.86 
1 0.71  15.89 
0  15.91 
0  15.94 
0  15.96 
0  15.99 
1 0.77  16.02 
0  16.04 
0  16.07 
0  16.09 
0  16.12 
0  16.14 
0  16.17 
1 0.71  16.2 
0  16.23 
0  16.25 
0  16.28 
0  16.3 
0  16.33 
0  16.35 
0  16.38 
0  16.4 
0  16.43 
1 0.8  16.46 
1 0.79  16.48 
1 0.77  16.51 
1 0.74  16.54 
1 0.71  16.57 
0  16.59 
0  16.62 
0  16.64 
0  16.66 
0  16.69 
0  16.71 
0  16.74 
0  16.76 
0  16.79 
0  16.81 
0  16.83 
0  16.86 
1 0.72  16.89 
1 0.71  16.91 
1 0.76  16.94 
1 0.77  16.97 
0  16.99 
0  17.02 
0  17.04 
0  17.07 
0  17.09 
0  17.11 
0  17.14 
0  17.16 
0  17.18 
1 0.76  17.21 
1 0.74  17.25 
0  17.27 
0  17.3 
0  17.32 
1 0.71  17.35 
0  17.38 
1 0.75  17.41 
1 0.74  17.43 
0  17.46 
1 0.75  17.49 
1 0.8  17.52 
0  17.54 
0  17.57 
1 0.8  17.59 
0  17.62 
0  17.65 
0  17.67 
0  17.69 
0  17.72 
0  17.75 
1 0.76  17.78 
0  17.8 
0  17.83 
0  17.85 
0  17.88 
0  17.9 
1 0.81  17.93 
1 0.77  17.96 
1 0.73  17.98 
0  18.01 
0  18.03 
0  18.06 
0  18.08 
0  18.11 
0  18.13 
0  18.16 
0  18.19 
0  18.21 
0  18.24 
1 0.72  18.27 
0  18.29 
0  18.32 
0  18.34 
0  18.37 
0  18.39 
0  18.42 
0  18.44 
0  18.47 
0  18.49 
0  18.52 
0  18.54 
0  18.57 
0  18.59 
0  18.62 
0  18.64 
0  18.67 
0  18.69 
0  18.72 
0  18.74 
0  18.77 
0  18.79 
0  18.82 
0  18.84 
0  18.87 
0  18.89 
0  18.92 
0  18.94 
0  18.97 
0  18.99 
1 0.73  19.02 
0  19.04 
0  19.07 
1 0.74  19.1 
1 0.78  19.13 
1 0.89  19.15 
1 0.86  19.18 
1 0.83  19.21 
1 0.88  19.24 
1 0.88  19.27 
1 0.86  19.3 
1 0.84  19.33 
1 0.81  19.36 
1 0.74  19.39 
1 0.77  19.42 
2 0.78 0.79  19.45 
2 0.77 0.81  19.47 
1 0.84  19.5 
2 0.79 0.85  19.53 
1 0.84  19.56 
1 0.85  19.59 
1 0.76  19.62 
1 0.79  19.64 
1 0.8  19.67 
1 0.84  19.7 
1 0.84  19.73 
1 0.83  19.76 
1 0.76  19.79 
1 0.76  19.82 
1 0.83  19.84 
1 0.85  19.87 
1 0.88  19.9 
1 0.83  19.93 
1 0.76  19.96 
1 0.82  19.98 
1 0.85  20.01 
1 0.89  20.04 
1 0.9  20.07 
1 0.89  20.1 
1 0.88  20.12 
1 0.89  20.15 
1 0.88  20.18 
1 0.9  20.21 
1 0.9  20.24 
1 0.9  20.27 
1 0.91  20.3 
1 0.91  20.32 
1 0.9  20.35 
1 0.9  20.38 
1 0.9  20.41 
1 0.9  20.44 
0  20.46 
0  20.49 
0  20.51 
0  20.54 
0  20.56 
0  20.59 
0  20.61 
0  20.64 
0  20.66 
0  20.69 
0  20.72 
0  20.74 
0  20.77 
0  20.79 
0  20.82 
0  20.84 
0  20.87 
0  20.89 
0  20.92 
0  20.94 
0  20.97 
0  20.99 
0  21.02 
0  21.04 
0  21.07 
0  21.09 
0  21.12 
1 0.73  21.15 
2 0.74 0.74  21.18 
1 0.85  21.2 
1 0.85  21.23 
2 0.74 0.86  21.26 
1 0.72  21.29 
0  21.32 
0  21.34 
0  21.37 
0  21.39 
1 0.77  21.42 
0  21.44 
1 0.79  21.47 
1 0.82  21.5 
1 0.8  21.53 
1 0.82  21.56 
1 0.84  21.59 
2 0.74 0.86  21.62 
1 0.84  21.65 
0  21.67 
0  21.7 
0  21.72 
0  21.75 
0  21.77 
0  21.8 
0  21.82 
0  21.85 
0  21.87 
0  21.9 
0  21.92 
0  21.95 
0  21.97 
0  22.0 
0  22.03 
0  22.05 
0  22.07 
0  22.1 
0  22.12 
0  22.15 
0  22.17 
0  22.2 
0  22.22 
0  22.25 
0  22.28 
0  22.3 
0  22.33 
0  22.35 
0  22.38 
0  22.4 
0  22.43 
0  22.45 
0  22.48 
0  22.5 
0  22.53 
0  22.55 
0  22.58 
0  22.6 
0  22.63 
0  22.65 
0  22.68 
0  22.7 
0  22.73 
0  22.75 
0  22.78 
0  22.8 
0  22.83 
1 0.76  22.85 
1 0.83  22.88 
1 0.75  22.91 
0  22.94 
0  22.96 
0  22.99 
1 0.7  23.01 
1 0.75  23.04 
0  23.07 
0  23.09 
0  23.12 
0  23.14 
0  23.16 
0  23.19 
1 0.77  23.22 
0  23.24 
0  23.27 
0  23.29 
0  23.31 
0  23.34 
0  23.36 
0  23.39 
0  23.41 
0  23.43 
0  23.46 
0  23.48 
0  23.51 
0  23.53 
0  23.55 
0  23.58 
0  23.6 
0  23.63 
0  23.65 
0  23.68 
0  23.7 
0  23.72 
0  23.75 
0  23.77 
0  23.8 
0  23.82 
0  23.85 
0  23.87 
0  23.89 
0  23.92 
0  23.94 
0  23.97 
0  23.99 
0  24.02 
0  24.04 
0  24.07 
0  24.09 
0  24.11 
0  24.14 
0  24.16 
0  24.19 
0  24.21 
0  24.24 
0  24.26 
0  24.29 
0  24.31 
1 0.73  24.34 
1 0.73  24.37 
0  24.39 
0  24.42 
0  24.45 
0  24.47 
1 0.71  24.5 
0  24.52 
0  24.55 
0  24.57 
0  24.6 
0  24.62 
0  24.65 
0  24.67 
0  24.7 
0  24.72 
0  24.74 
0  24.77 
0  24.8 
1 0.79  24.82 
0  24.85 
0  24.87 
0  24.9 
0  24.92 
0  24.95 
0  24.97 
0  25.0 
0  25.02 
0  25.05 
0  25.07 
0  25.1 
0  25.12 
0  25.15 
0  25.17 
0  25.2 
0  25.22 
0  25.25 
0  25.27 
0  25.3 
0  25.32 
0  25.35 
0  25.37 
0  25.4 
0  25.42 
0  25.44 
0  25.47 
0  25.49 
0  25.52 
0  25.54 
0  25.56 
0  25.59 
0  25.61 
0  25.64 
0  25.66 
0  25.69 
0  25.71 
0  25.74 
0  25.76 
0  25.78 
0  25.81 
0  25.83 
0  25.86 
0  25.88 
0  25.91 
0  25.93 
0  25.95 
0  25.98 
0  26.0 
0  26.03 
0  26.05 
1 0.83  26.08 
1 0.82  26.11 
1 0.81  26.14 
1 0.85  26.16 
1 0.83  26.19 
1 0.79  26.22 
0  26.25 
0  26.27 
0  26.3 
0  26.32 
0  26.35 
1 0.76  26.37 
0  26.4 
0  26.43 
0  26.45 
0  26.47 
0  26.5 
0  26.52 
0  26.55 
0  26.57 
0  26.59 
0  26.62 
0  26.64 
0  26.67 
0  26.7 
0  26.72 
0  26.75 
0  26.77 
0  26.8 
0  26.82 
0  26.85 
0  26.87 
0  26.9 
0  26.93 
0  26.95 
0  26.98 
0  27.0 
0  27.03 
0  27.05 
0  27.08 
0  27.1 
0  27.13 
0  27.15 
0  27.18 
1 0.82  27.2 
1 0.9  27.23 
1 0.93  27.26 
1 0.9  27.29 
1 0.72  27.33 
0  27.35 
0  27.38 
0  27.4 
0  27.43 
0  27.46 
0  27.48 
1 0.89  27.51 
1 0.86  27.54 
1 0.9  27.57 
1 0.89  27.6 
1 0.87  27.62 
0  27.65 
0  27.67 
0  27.7 
0  27.72 
1 0.8  27.75 
1 0.87  27.77 
1 0.88  27.8 
2 0.71 0.84  27.83 
2 0.71 0.84  27.86 
2 0.82 0.85  27.89 
2 0.83 0.86  27.92 
2 0.85 0.86  27.95 
2 0.82 0.86  27.97 
2 0.87 0.9  28.0 
2 0.85 0.9  28.03 
2 0.77 0.9  28.06 
2 0.79 0.91  28.09 
2 0.86 0.92  28.12 
2 0.87 0.89  28.15 
2 0.86 0.87  28.17 
2 0.84 0.85  28.2 
2 0.83 0.9  28.23 
2 0.83 0.92  28.26 
2 0.83 0.92  28.29 
2 0.87 0.91  28.32 
2 0.83 0.92  28.34 
2 0.79 0.92  28.37 
2 0.79 0.92  28.4 
2 0.81 0.93  28.43 
2 0.77 0.92  28.46 
2 0.72 0.9  28.49 
3 0.71 0.85 0.9  28.51 
2 0.87 0.88  28.54 
2 0.72 0.88  28.58 
2 0.71 0.88  28.61 
1 0.89  28.64 
1 0.8  28.67 
0  28.7 
1 0.73  28.73 
2 0.71 0.74  28.76 
1 0.8  28.79 
1 0.82  28.83 
1 0.75  28.86 
1 0.8  28.88 
1 0.87  28.91 
0  28.94 
1 0.83  28.96 
1 0.79  28.99 
1 0.83  29.02 
1 0.78  29.05 
1 0.78  29.07 
1 0.79  29.1 
1 0.81  29.15 
1 0.84  29.17 
1 0.82  29.2 
0  29.23 
0  29.25 
0  29.28 
0  29.3 
0  29.33 
0  29.35 
0  29.37 
0  29.4 
0  29.42 
0  29.45 
0  29.48 
0  29.53 
0  29.57 
0  29.6 
1 0.78  29.64 
0  29.67 
1 0.73  29.7 
0  29.73 
0  29.77 
0  29.79 
1 0.71  29.83 
1 0.73  29.86 
1 0.71  29.89 
1 0.74  29.93 
1 0.79  29.96 
1 0.77  29.99 
1 0.77  30.02 
0  30.05 
0  30.08 
1 0.79  30.12 
1 0.8  30.15 
0  30.18 
0  30.21 
0  30.24 
0  30.27 
0  30.3 
1 0.7  30.33 
0  30.36 
0  30.39 
0  30.42 
0  30.45 
0  30.48 
0  30.5 
0  30.53 
0  30.55 
0  30.58 
0  30.6 
0  30.62 
1 0.79  30.65 
1 0.83  30.68 
1 0.74  30.71 
0  30.73 
0  30.76 
0  30.78 
0  30.81 
0  30.83 
0  30.86 
0  30.88 
0  30.91 
0  30.93 
0  30.95 
0  30.98 
0  31.0 
0  31.03 
0  31.05 
0  31.07 
0  31.1 
0  31.12 
0  31.15 
0  31.17 
1 0.71  31.2 
0  31.22 
0  31.25 
0  31.27 
0  31.29 
0  31.32 
0  31.34 
1 0.74  31.37 
1 0.83  31.4 
1 0.9  31.43 
1 0.93  31.46 
1 0.93  31.48 
1 0.91  31.51 
1 0.87  31.54 
1 0.78  31.57 
1 0.81  31.59 
1 0.85  31.62 
1 0.83  31.65 
1 0.83  31.68 
1 0.85  31.71 
1 0.89  31.73 
1 0.89  31.76 
1 0.87  31.79 
1 0.82  31.82 
1 0.78  31.85 
1 0.72  31.87 
1 0.71  31.9 
0  31.93 
0  31.95 
0  31.98 
0  32.0 
0  32.02 
0  32.05 
0  32.07 
0  32.1 
0  32.12 
0  32.15 
0  32.17 
1 0.73  32.2 
1 0.82  32.23 
1 0.79  32.25 
1 0.78  32.28 
1 0.75  32.31 
1 0.78  32.34 
1 0.77  32.37 
1 0.77  32.39 
1 0.82  32.43 
2 0.71 0.88  32.45 
2 0.82 0.83  32.48 
2 0.85 0.87  32.51 
2 0.77 0.86  32.54 
2 0.84 0.87  32.57 
2 0.82 0.84  32.6 
2 0.73 0.84  32.63 
2 0.73 0.84  32.66 
2 0.74 0.83  32.69 
2 0.77 0.84  32.71 
2 0.8 0.83  32.74 
2 0.73 0.82  32.77 
1 0.84  32.8 
2 0.74 0.82  32.83 
1 0.81  32.86 
1 0.76  32.89 
1 0.81  32.91 
1 0.86  32.94 
1 0.75  32.97 
1 0.78  33.0 
1 0.8  33.03 
1 0.83  33.07 
1 0.89  33.11 
1 0.87  33.13 
1 0.89  33.16 
1 0.89  33.19 
1 0.87  33.22 
1 0.91  33.25 
1 0.91  33.28 
1 0.89  33.31 
1 0.86  33.34 
2 0.74 0.84  33.36 
1 0.8  33.39 
0  33.42 
0  33.44 
1 0.85  33.47 
1 0.85  33.5 
1 0.81  33.53 
1 0.8  33.55 
1 0.81  33.58 
1 0.89  33.62 
1 0.88  33.67 
0  33.69 
0  33.72 
1 0.78  33.75 
1 0.85  33.78 
1 0.89  33.8 
1 0.89  33.83 
1 0.88  33.87 
1 0.84  33.9 
1 0.84  33.93 
1 0.87  33.96 
1 0.87  33.99 
0  34.02 
0  34.05 
1 0.87  34.08 
1 0.9  34.12 
1 0.9  34.15 
1 0.8  34.18 
1 0.72  34.21 
0  34.23 
0  34.26 
0  34.28 
1 0.82  34.31 
1 0.84  34.34 
1 0.78  34.37 
2 0.76 0.84  34.4 
2 0.86 0.9  34.43 
2 0.86 0.93  34.46 
2 0.85 0.92  34.49 
2 0.87 0.92  34.52 
2 0.88 0.91  34.55 
2 0.89 0.9  34.58 
2 0.9 0.91  34.61 
2 0.88 0.89  34.64 
2 0.88 0.89  34.68 
2 0.84 0.89  34.71 
2 0.82 0.88  34.73 
2 0.79 0.87  34.77 
2 0.73 0.88  34.8 
1 0.89  34.82 
1 0.87  34.85 
1 0.85  34.88 
2 0.75 0.82  34.91 
2 0.72 0.79  34.94 
1 0.77  34.97 
1 0.72  35.0 
1 0.76  35.04 
1 0.79  35.08 
1 0.77  35.11 
1 0.77  35.15 
0  35.18 
0  35.22 
0  35.25 
0  35.28 
0  35.31 
0  35.34 
0  35.38 
1 0.8  35.42 
1 0.75  35.45 
0  35.49 
0  35.52 
0  35.55 
0  35.58 
0  35.62 
0  35.65 
0  35.68 
0  35.71 
0  35.75 
0  35.78 
0  35.81 
0  35.84 
0  35.87 
0  35.89 
0  35.92 
0  35.94 
0  35.96 
0  35.99 
0  36.01 
0  36.04 
0  36.06 
0  36.08 
0  36.11 
0  36.13 
0  36.16 
0  36.18 
0  36.21 
0  36.24 
0  36.26 
0  36.29 
0  36.32 
0  36.34 
1 0.72  36.39 
1 0.76  36.43 
0  36.46 
1 0.81  36.5 
1 0.86  36.53 
1 0.75  36.57 
1 0.78  36.61 
1 0.75  36.64 
0  36.68 
0  36.71 
0  36.74 
0  36.77 
0  36.81 
0  36.84 
0  36.87 
0  36.9 
0  36.93 
0  36.96 
0  36.99 
0  37.03 
0  37.06 
0  37.09 
0  37.12 
0  37.15 
0  37.18 
0  37.2 
0  37.23 
0  37.25 
0  37.27 
0  37.3 
0  37.33 
0  37.36 
0  37.39 
0  37.41 
0  37.44 
1 0.73  37.48 
1 0.73  37.51 
0  37.53 
0  37.57 
0  37.59 
0  37.62 
0  37.65 
0  37.68 
0  37.71 
0  37.74 
0  37.76 
0  37.79 
0  37.82 
0  37.86 
0  37.88 
0  37.91 
0  37.94 
0  37.97 
0  37.99 
0  38.02 
0  38.05 
0  38.08 
0  38.11 
0  38.14 
0  38.16 
0  38.18 
0  38.21 
0  38.23 
0  38.26 
0  38.28 
0  38.31 
0  38.33 
0  38.35 
0  38.38 
0  38.4 
0  38.42 
0  38.45 
0  38.47 
0  38.5 
0  38.53 
0  38.56 
0  38.58 
0  38.61 
0  38.63 
0  38.66 
0  38.68 
0  38.71 
0  38.73 
1 0.8  38.76 
1 0.83  38.79 
1 0.83  38.82 
0  38.85 
0  38.88 
0  38.9 
0  38.93 
0  38.95 
0  38.98 
0  39.0 
0  39.03 
0  39.05 
0  39.08 
0  39.1 
0  39.13 
0  39.15 
0  39.18 
0  39.2 
0  39.22 
0  39.25 
0  39.27 
0  39.3 
0  39.32 
0  39.34 
0  39.37 
0  39.39 
0  39.42 
0  39.44 
0  39.46 
0  39.49 
0  39.51 
0  39.54 
0  39.56 
0  39.59 
0  39.61 
0  39.63 
0  39.66 
0  39.7 
0  39.73 
0  39.76 
0  39.79 
0  39.81 
0  39.84 
0  39.86 
0  39.88 
0  39.91 
0  39.93 
0  39.96 
1 0.74  39.99 
2 0.72 0.76  40.02 
0  40.04 
0  40.07 
0  40.09 
0  40.11 
0  40.14 
0  40.17 
0  40.19 
0  40.22 
0  40.24 
0  40.27 
0  40.29 
0  40.32 
0  40.35 
0  40.38 
0  40.4 
0  40.43 
0  40.46 
0  40.48 
0  40.51 
0  40.54 
0  40.57 
0  40.6 
0  40.64 
0  40.67 
0  40.7 
0  40.72 
0  40.75 
0  40.77 
0  40.79 
0  40.82 
0  40.85 
0  40.87 
0  40.9 
0  40.93 
0  40.96 
0  40.98 
0  41.01 
0  41.04 
0  41.07 
0  41.1 
1 0.71  41.13 
1 0.71  41.16 
1 0.82  41.19 
1 0.8  41.22 
1 0.79  41.25 
1 0.83  41.28 
1 0.73  41.31 
0  41.33 
1 0.83  41.36 
1 0.8  41.39 
0  41.42 
1 0.71  41.44 
0  41.47 
0  41.49 
0  41.52 
0  41.54 
0  41.57 
0  41.59 
0  41.62 
0  41.64 
0  41.66 
0  41.69 
0  41.71 
0  41.74 
1 0.83  41.77 
1 0.87  41.79 
0  41.82 
0  41.84 
0  41.87 
0  41.89 
1 0.79  41.92 
1 0.71  41.95 
2 0.76 0.86  41.98 
2 0.74 0.79  42.01 
2 0.74 0.82  42.04 
2 0.77 0.81  42.07 
2 0.74 0.81  42.1 
1 0.73  42.13 
2 0.75 0.78  42.16 
2 0.71 0.81  42.19 
2 0.78 0.84  42.22 
1 0.78  42.24 
1 0.81  42.27 
1 0.83  42.3 
1 0.87  42.33 
1 0.85  42.36 
1 0.79  42.38 
1 0.83  42.41 
1 0.87  42.44 
1 0.89  42.47 
1 0.88  42.5 
1 0.87  42.53 
1 0.82  42.55 
1 0.82  42.58 
1 0.87  42.61 
1 0.87  42.64 
1 0.85  42.67 
1 0.86  42.7 
1 0.82  42.73 
1 0.8  42.75 
1 0.76  42.78 
1 0.86  42.81 
1 0.83  42.84 
1 0.8  42.87 
0  42.89 
0  42.91 
0  42.94 
0  42.96 
0  43.0 
0  43.03 
0  43.06 
0  43.09 
0  43.12 
0  43.15 
0  43.18 
0  43.2 
0  43.23 
0  43.25 
0  43.28 
0  43.3 
1 0.72  43.33 
1 0.84  43.36 
2 0.7 0.84  43.39 
1 0.86  43.42 
1 0.78  43.45 
1 0.75  43.47 
0  43.5 
0  43.52 
0  43.55 
0  43.57 
0  43.6 
0  43.62 
0  43.64 
0  43.67 
1 0.82  43.7 
1 0.86  43.72 
2 0.74 0.86  43.75 
1 0.86  43.78 
1 0.87  43.81 
2 0.72 0.85  43.84 
1 0.86  43.87 
1 0.86  43.89 
2 0.75 0.85  43.92 
2 0.76 0.83  43.95 
2 0.71 0.86  43.98 
1 0.85  44.01 
1 0.85  44.03 
1 0.84  44.06 
1 0.85  44.09 
1 0.83  44.12 
1 0.85  44.14 
1 0.86  44.17 
1 0.87  44.2 
1 0.88  44.23 
1 0.85  44.26 
1 0.75  44.28 
0  44.31 
0  44.33 
0  44.36 
1 0.71  44.38 
1 0.71  44.41 
1 0.74  44.44 
0  44.46 
1 0.72  44.49 
1 0.78  44.52 
0  44.54 
0  44.57 
1 0.77  44.59 
1 0.74  44.62 
1 0.76  44.65 
1 0.79  44.68 
0  44.7 
0  44.73 
0  44.75 
0  44.78 
0  44.8 
0  44.83 
0  44.85 
0  44.87 
0  44.9 
0  44.93 
0  44.96 
1 0.73  45.03 
1 0.72  45.06 
0  45.09 
0  45.12 
0  45.14 
0  45.17 
1 0.78  45.2 
1 0.76  45.23 
1 0.73  45.25 
0  45.28 
0  45.3 
0  45.33 
0  45.35 
1 0.71  45.38 
0  45.4 
0  45.43 
0  45.45 
1 0.78  45.48 
0  45.51 
0  45.54 
0  45.56 
0  45.59 
0  45.63 
0  45.65 
0  45.68 
0  45.7 
0  45.72 
1 0.73  45.75 
0  45.78 
0  45.81 
0  45.85 
0  45.87 
0  45.9 
0  45.92 
0  45.95 
0  45.97 
1 0.7  46.01 
2 0.77 0.78  46.04 
2 0.7 0.74  46.08 
1 0.73  46.11 
1 0.75  46.14 
1 0.73  46.17 
2 0.71 0.79  46.2 
1 0.81  46.23 
1 0.73  46.26 
1 0.73  46.29 
0  46.32 
0  46.34 
2 0.72 0.75  46.37 
1 0.79  46.4 
1 0.73  46.43 
1 0.76  46.46 
0  46.49 
1 0.71  46.52 
0  46.55 
0  46.57 
0  46.6 
0  46.62 
0  46.65 
2 0.71 0.8  46.68 
0  46.7 
0  46.73 
0  46.75 
0  46.78 
1 0.72  46.8 
1 0.79  46.83 
1 0.78  46.86 
1 0.8  46.9 
1 0.8  46.94 
1 0.78  46.97 
2 0.74 0.78  47.0 
1 0.73  47.02 
1 0.74  47.05 
1 0.76  47.08 
1 0.74  47.1 
1 0.77  47.13 
1 0.73  47.16 
1 0.78  47.19 
1 0.8  47.22 
1 0.84  47.24 
0  47.27 
0  47.29 
0  47.32 
1 0.81  47.35 
1 0.87  47.37 
1 0.86  47.41 
1 0.87  47.43 
1 0.87  47.47 
1 0.86  47.5 
1 0.86  47.53 
1 0.76  47.56 
1 0.76  47.59 
1 0.71  47.63 
1 0.71  47.66 
1 0.79  47.69 
1 0.72  47.72 
0  47.75 
0  47.78 
0  47.8 
0  47.83 
0  47.86 
1 0.81  47.89 
0  47.91 
0  47.94 
0  47.97 
1 0.86  48.0 
0  48.03 
1 0.76  48.06 
1 0.88  48.09 
1 0.89  48.12 
1 0.89  48.15 
1 0.87  48.18 
1 0.87  48.21 
1 0.85  48.24 
1 0.86  48.27 
1 0.87  48.3 
1 0.89  48.32 
1 0.89  48.35 
1 0.87  48.38 
1 0.88  48.41 
1 0.9  48.44 
1 0.88  48.47 
1 0.88  48.49 
1 0.88  48.53 
1 0.86  48.55 
1 0.88  48.58 
1 0.89  48.61 
1 0.88  48.64 
1 0.87  48.67 
1 0.91  48.69 
1 0.91  48.72 
1 0.94  48.75 
1 0.94  48.78 
1 0.93  48.81 
1 0.92  48.83 
1 0.93  48.86 
1 0.93  48.89 
1 0.92  48.92 
1 0.91  48.94 
1 0.91  48.97 
1 0.9  49.0 
1 0.9  49.03 
2 0.74 0.89  49.05 
2 0.75 0.87  49.08 
1 0.88  49.11 
1 0.79  49.14 
2 0.78 0.79  49.16 
1 0.79  49.19 
1 0.79  49.22 
2 0.76 0.8  49.25 
1 0.78  49.28 
1 0.79  49.31 
1 0.76  49.34 
1 0.73  49.37 
1 0.75  49.4 
0  49.44 
0  49.49 
0  49.52 
0  49.54 
0  49.57 
1 0.76  49.61 
0  49.63 
0  49.66 
0  49.69 
0  49.71 
0  49.74 
1 0.78  49.78 
1 0.75  49.81 
0  49.84 
0  49.86 
0  49.89 
0  49.91 
0  49.93 
0  49.96 
0  49.98 
0  50.01 
0  50.03 
0  50.05 
0  50.08 
0  50.1 
0  50.13 
0  50.15 
0  50.17 
0  50.2 
0  50.22 
0  50.25 
0  50.27 
0  50.3 
0  50.32 
0  50.34 
0  50.37 
0  50.39 
0  50.42 
0  50.44 
0  50.47 
0  50.49 
0  50.52 
0  50.54 
0  50.57 
0  50.59 
0  50.62 
0  50.64 
0  50.66 
0  50.69 
0  50.71 
0  50.73 
0  50.76 
0  50.78 
0  50.81 
0  50.83 
0  50.86 
0  50.89 
0  50.92 
0  50.95 
0  50.99 
0  51.02 
0  51.05 
0  51.08 
0  51.11 
0  51.15 
0  51.18 
0  51.21 
0  51.25 
0  51.28 
0  51.31 
0  51.34 
0  51.38 
0  51.41 
0  51.44 
0  51.47 
0  51.5 
0  51.53 
0  51.56 
0  51.59 
0  51.61 
0  51.64 
0  51.67 
0  51.7 
0  51.72 
0  51.75 
0  51.77 
0  51.8 
0  51.82 
0  51.85 
0  51.87 
0  51.89 
0  51.92 
0  51.95 
0  51.97 
0  51.99 
0  52.02 
0  52.04 
0  52.07 
0  52.09 
0  52.12 
0  52.14 
0  52.16 
0  52.19 
0  52.21 
0  52.24 
0  52.26 
0  52.28 
0  52.31 
0  52.33 
0  52.36 
0  52.38 
0  52.4 
0  52.43 
0  52.45 
0  52.48 
0  52.5 
0  52.52 
0  52.55 
0  52.57 
0  52.59 
0  52.62 
1 0.84  52.65 
1 0.83  52.67 
1 0.74  52.7 
1 0.81  52.73 
0  52.75 
0  52.78 
0  52.8 
0  52.83 
0  52.85 
0  52.88 
0  52.9 
0  52.92 
0  52.95 
0  52.97 
0  53.0 
0  53.02 
0  53.04 
0  53.07 
0  53.09 
0  53.11 
0  53.14 
0  53.16 
0  53.19 
0  53.21 
0  53.23 
0  53.26 
2 0.77 0.85  53.29 
1 0.82  53.31 
2 0.72 0.78  53.34 
2 0.77 0.82  53.37 
0  53.39 
1 0.72  53.44 
0  53.47 
0  53.49 
0  53.52 
0  53.54 
0  53.57 
1 0.77  53.59 
1 0.74  53.62 
1 0.7  53.65 
0  53.67 
0  53.69 
0  53.72 
0  53.74 
0  53.76 
0  53.79 
0  53.81 
0  53.84 
0  53.86 
0  53.89 
0  53.91 
0  53.93 
0  53.96 
0  53.98 
0  54.01 
0  54.03 
0  54.06 
0  54.08 
0  54.1 
1 0.71  54.13 
0  54.16 
0  54.18 
0  54.2 
0  54.23 
0  54.25 
0  54.28 
0  54.3 
0  54.32 
0  54.35 
0  54.37 
0  54.39 
0  54.42 
1 0.73  54.45 
1 0.76  54.48 
0  54.5 
1 0.76  54.53 
1 0.78  54.55 
1 0.84  54.58 
1 0.79  54.61 
1 0.8  54.64 
1 0.79  54.67 
1 0.82  54.7 
1 0.71  54.72 
1 0.81  54.75 
1 0.77  54.78 
1 0.76  54.81 
1 0.75  54.84 
1 0.82  54.86 
1 0.82  54.89 
1 0.82  54.92 
1 0.86  54.95 
1 0.87  54.98 
1 0.81  55.01 
1 0.82  55.03 
1 0.85  55.06 
1 0.86  55.09 
1 0.85  55.12 
1 0.81  55.15 
1 0.83  55.17 
1 0.75  55.2 
1 0.73  55.23 
1 0.78  55.26 
1 0.76  55.29 
1 0.75  55.31 
1 0.71  55.34 
1 0.73  55.37 
1 0.73  55.4 
1 0.75  55.43 
1 0.73  55.45 
0  55.48 
0  55.5 
0  55.52 
0  55.55 
0  55.57 
0  55.6 
0  55.62 
0  55.64 
0  55.67 
0  55.69 
0  55.72 
0  55.74 
0  55.77 
0  55.79 
0  55.81 
1 0.81  55.84 
1 0.85  55.87 
1 0.81  55.9 
1 0.86  55.93 
1 0.84  55.95 
2 0.76 0.83  55.98 
2 0.76 0.87  56.01 
1 0.92  56.04 
1 0.92  56.07 
2 0.73 0.92  56.09 
2 0.71 0.88  56.12 
1 0.82  56.15 
1 0.8  56.18 
1 0.81  56.2 
1 0.81  56.23 
1 0.82  56.26 
1 0.87  56.28 
1 0.9  56.31 
1 0.91  56.34 
1 0.91  56.37 
1 0.91  56.39 
1 0.92  56.42 
1 0.93  56.45 
1 0.92  56.48 
1 0.93  56.51 
1 0.93  56.53 
2 0.8 0.93  56.56 
1 0.91  56.59 
1 0.92  56.61 
1 0.92  56.64 
1 0.92  56.67 
1 0.93  56.7 
1 0.93  56.72 
1 0.93  56.75 
1 0.93  56.78 
1 0.92  56.81 
1 0.9  56.83 
1 0.91  56.86 
1 0.91  56.89 
1 0.9  56.92 
1 0.92  56.94 
1 0.92  56.97 
1 0.92  57.0 
1 0.91  57.03 
1 0.92  57.05 
1 0.9  57.08 
1 0.91  57.11 
1 0.89  57.14 
1 0.89  57.16 
1 0.91  57.19 
1 0.92  57.22 
1 0.93  57.25 
1 0.93  57.27 
2 0.71 0.94  57.3 
2 0.78 0.94  57.33 
1 0.94  57.36 
1 0.93  57.38 
1 0.92  57.41 
1 0.91  57.44 
1 0.86  57.47 
1 0.89  57.5 
1 0.9  57.52 
1 0.91  57.55 
1 0.92  57.58 
1 0.92  57.6 
1 0.93  57.63 
1 0.92  57.66 
1 0.93  57.69 
1 0.93  57.71 
1 0.93  57.74 
1 0.93  57.77 
1 0.94  57.79 
1 0.93  57.82 
1 0.93  57.85 
1 0.93  57.88 
1 0.94  57.9 
1 0.93  57.93 
1 0.93  57.96 
1 0.93  57.99 
1 0.94  58.02 
1 0.93  58.04 
1 0.93  58.07 
1 0.93  58.1 
1 0.93  58.12 
1 0.91  58.15 
1 0.93  58.18 
1 0.93  58.21 
1 0.92  58.23 
1 0.92  58.26 
1 0.92  58.29 
1 0.92  58.32 
1 0.92  58.35 
1 0.92  58.37 
1 0.91  58.4 
1 0.91  58.43 
1 0.9  58.46 
1 0.91  58.48 
1 0.9  58.51 
1 0.89  58.54 
2 0.71 0.89  58.56 
2 0.77 0.89  58.59 
1 0.89  58.62 
1 0.89  58.65 
1 0.86  58.68 
1 0.86  58.7 
1 0.88  58.73 
1 0.9  58.76 
1 0.92  58.79 
1 0.92  58.81 
1 0.92  58.84 
1 0.92  58.87 
1 0.92  58.89 
1 0.91  58.92 
1 0.91  58.95 
1 0.91  58.98 
1 0.87  59.01 
1 0.89  59.03 
1 0.85  59.06 
1 0.83  59.09 
1 0.86  59.12 
1 0.87  59.14 
1 0.8  59.17 
1 0.71  59.21 
0  59.23 
0  59.26 
1 0.79  59.28 
1 0.86  59.31 
1 0.84  59.34 
1 0.82  59.37 
1 0.73  59.4 
1 0.75  59.42 
0  59.45 
1 0.76  59.48 
1 0.71  59.51 
2 0.71 0.75  59.54 
1 0.79  59.56 
1 0.74  59.59 
1 0.79  59.62 
1 0.81  59.65 
1 0.83  59.68 
1 0.75  59.7 
1 0.74  59.73 
0  59.75 
0  59.78 
0  59.8 
0  59.83 
0  59.85 
0  59.87 
0  59.9 
0  59.92 
0  59.95 
0  59.97 
0  60.0 
0  60.02 
0  60.04 
0  60.07 
0  60.1 
0  60.12 
0  60.14 
0  60.17 
1 0.71  60.2 
0  60.22 
0  60.24 
0  60.27 
0  60.29 
0  60.32 
0  60.34 
0  60.37 
1 0.83  60.39 
0  60.42 
0  60.44 
0  60.47 
0  60.49 
0  60.52 
0  60.54 
0  60.57 
0  60.59 
0  60.61 
0  60.64 
0  60.66 
0  60.69 
0  60.71 
0  60.74 
0  60.76 
0  60.78 
0  60.81 
0  60.83 
0  60.86 
0  60.88 
0  60.91 
0  60.93 
0  60.95 
0  60.98 
0  61.0 
1 0.74  61.03 
0  61.05 
0  61.08 
0  61.1 
0  61.13 
0  61.15 
2 0.7 0.81  61.18 
2 0.73 0.85  61.21 
1 0.85  61.23 
1 0.86  61.26 
1 0.88  61.29 
2 0.77 0.87  61.32 
2 0.74 0.88  61.34 
2 0.74 0.86  61.37 
1 0.85  61.4 
1 0.78  61.43 
0  61.45 
2 0.73 0.76  61.48 
0  61.51 
1 0.76  61.53 
1 0.78  61.56 
1 0.74  61.59 
0  61.61 
0  61.64 
0  61.66 
1 0.72  61.69 
1 0.83  61.72 
1 0.85  61.75 
1 0.9  61.77 
1 0.91  61.8 
1 0.89  61.83 
1 0.88  61.87 
1 0.89  61.91 
1 0.88  61.94 
1 0.87  61.97 
1 0.86  62.0 
1 0.85  62.02 
1 0.85  62.05 
1 0.83  62.08 
1 0.79  62.1 
1 0.74  62.13 
1 0.72  62.16 
0  62.18 
0  62.21 
0  62.23 
0  62.26 
0  62.28 
0  62.3 
0  62.33 
0  62.35 
0  62.37 
0  62.4 
0  62.42 
0  62.45 
0  62.47 
0  62.49 
0  62.52 
0  62.54 
0  62.56 
0  62.59 
0  62.61 
0  62.64 
0  62.66 
0  62.69 
0  62.71 
0  62.73 
1 0.71  62.76 
1 0.71  62.79 
0  62.81 
0  62.84 
0  62.86 
0  62.89 
0  62.91 
0  62.94 
0  62.96 
0  62.98 
0  63.01 
0  63.03 
0  63.06 
0  63.08 
0  63.11 
0  63.13 
0  63.15 
1 0.71  63.18 
0  63.2 
0  63.23 
0  63.25 
0  63.28 
0  63.3 
0  63.32 
0  63.35 
0  63.37 
0  63.39 
0  63.42 
0  63.45 
0  63.47 
0  63.49 
0  63.52 
0  63.54 
0  63.57 
1 0.7  63.59 
0  63.62 
0  63.64 
0  63.66 
1 0.74  63.69 
0  63.72 
0  63.74 
1 0.83  63.77 
1 0.87  63.79 
1 0.87  63.82 
1 0.87  63.85 
1 0.85  63.88 
0  63.9 
1 0.83  63.93 
1 0.81  63.96 
0  63.98 
0  64.01 
0  64.03 
0  64.05 
0  64.08 
0  64.1 
1 0.78  64.13 
1 0.86  64.16 
1 0.85  64.18 
1 0.78  64.21 
0  64.24 
0  64.26 
0  64.28 
0  64.31 
1 0.72  64.33 
1 0.78  64.36 
1 0.74  64.39 
0  64.41 
0  64.44 
0  64.46 
0  64.49 
0  64.51 
0  64.53 
1 0.82  64.56 
1 0.84  64.59 
1 0.83  64.62 
1 0.82  64.65 
1 0.82  64.67 
1 0.84  64.7 
1 0.84  64.73 
1 0.82  64.76 
1 0.87  64.78 
1 0.87  64.81 
1 0.89  64.84 
1 0.9  64.87 
1 0.89  64.9 
1 0.9  64.93 
1 0.89  64.95 
1 0.86  64.98 
1 0.88  65.01 
1 0.87  65.04 
2 0.8 0.85  65.07 
1 0.78  65.09 
0  65.12 
0  65.14 
0  65.17 
0  65.19 
1 0.71  65.22 
0  65.24 
0  65.27 
0  65.29 
0  65.31 
0  65.34 
0  65.36 
0  65.39 
0  65.41 
0  65.44 
0  65.46 
0  65.49 
0  65.51 
0  65.53 
0  65.56 
0  65.58 
0  65.6 
0  65.63 
0  65.65 
0  65.68 
0  65.7 
1 0.86  65.73 
1 0.86  65.76 
1 0.79  65.78 
1 0.75  65.81 
1 0.78  65.84 
1 0.81  65.87 
1 0.77  65.9 
1 0.71  65.92 
1 0.73  65.95 
1 0.71  65.98 
0  66.01 
0  66.03 
0  66.05 
0  66.08 
0  66.1 
0  66.13 
1 0.83  66.15 
0  66.18 
0  66.2 
0  66.23 
0  66.25 
0  66.28 
0  66.3 
0  66.33 
0  66.35 
0  66.38 
0  66.4 
0  66.43 
0  66.45 
0  66.47 
0  66.5 
0  66.52 
0  66.55 
0  66.57 
0  66.6 
0  66.62 
0  66.64 
0  66.67 
0  66.69 
0  66.72 
1 0.77  66.75 
1 0.79  66.78 
0  66.8 
0  66.82 
1 0.72  66.85 
0  66.88 
1 0.76  66.9 
1 0.79  66.93 
2 0.77 0.81  66.96 
2 0.79 0.85  66.99 
1 0.84  67.02 
1 0.87  67.05 
1 0.85  67.08 
1 0.84  67.1 
1 0.83  67.13 
2 0.72 0.82  67.16 
2 0.75 0.85  67.19 
2 0.8 0.88  67.22 
1 0.88  67.24 
2 0.85 0.91  67.27 
2 0.87 0.93  67.3 
2 0.83 0.94  67.33 
2 0.8 0.94  67.36 
2 0.77 0.93  67.39 
2 0.86 0.92  67.42 
2 0.88 0.92  67.45 
2 0.84 0.93  67.48 
2 0.85 0.91  67.51 
2 0.76 0.84  67.53 
1 0.83  67.58 
2 0.72 0.73  67.61 
1 0.71  67.64 
0  67.66 
1 0.74  67.69 
1 0.76  67.72 
1 0.86  67.75 
1 0.91  67.78 
1 0.9  67.8 
1 0.84  67.83 
1 0.82  67.86 
1 0.85  67.89 
1 0.84  67.91 
1 0.8  67.95 
1 0.72  67.97 
2 0.71 0.81  68.0 
1 0.85  68.03 
1 0.86  68.06 
1 0.86  68.09 
2 0.83 0.88  68.12 
2 0.81 0.89  68.15 
2 0.81 0.9  68.18 
2 0.84 0.91  68.21 
1 0.9  68.24 
1 0.89  68.26 
1 0.89  68.29 
1 0.88  68.32 
1 0.84  68.35 
1 0.86  68.38 
1 0.88  68.4 
1 0.88  68.44 
1 0.86  68.46 
1 0.82  68.49 
1 0.75  68.52 
1 0.71  68.55 
1 0.8  68.58 
1 0.8  68.61 
1 0.7  68.63 
1 0.74  68.66 
1 0.85  68.69 
1 0.81  68.73 
1 0.73  68.76 
1 0.74  68.78 
1 0.76  68.81 
1 0.77  68.84 
1 0.7  68.87 
1 0.71  68.9 
0  68.92 
0  68.95 
1 0.79  68.97 
2 0.71 0.83  69.0 
2 0.72 0.83  69.03 
1 0.84  69.06 
1 0.86  69.09 
1 0.84  69.12 
2 0.77 0.85  69.15 
1 0.88  69.18 
1 0.9  69.2 
1 0.9  69.23 
2 0.77 0.83  69.26 
2 0.84 0.85  69.29 
3 0.71 0.72 0.85  69.32 
2 0.72 0.88  69.35 
2 0.74 0.76  69.37 
2 0.73 0.76  69.4 
2 0.72 0.75  69.43 
2 0.73 0.76  69.46 
1 0.76  69.49 
2 0.7 0.74  69.52 
2 0.71 0.82  69.55 
2 0.71 0.86  69.58 
1 0.83  69.6 
1 0.83  69.63 
1 0.82  69.66 
1 0.83  69.69 
1 0.84  69.72 
1 0.81  69.74 
1 0.79  69.78 
1 0.76  69.8 
1 0.77  69.83 
1 0.75  69.86 
0  69.88 
1 0.76  69.91 
2 0.71 0.85  69.94 
2 0.74 0.89  69.97 
2 0.71 0.87  70.0 
2 0.76 0.82  70.03 
2 0.8 0.82  70.05 
2 0.84 0.86  70.08 
2 0.85 0.86  70.12 
2 0.85 0.85  70.15 
2 0.73 0.92  70.17 
2 0.86 0.91  70.2 
2 0.82 0.91  70.23 
2 0.77 0.91  70.26 
2 0.76 0.9  70.29 
2 0.74 0.91  70.32 
2 0.81 0.9  70.34 
2 0.81 0.9  70.37 
1 0.88  70.4 
1 0.87  70.43 
1 0.87  70.46 
1 0.86  70.49 
1 0.83  70.52 
1 0.79  70.54 
1 0.8  70.57 
1 0.81  70.6 
1 0.85  70.63 
1 0.85  70.66 
1 0.85  70.68 
1 0.81  70.71 
1 0.8  70.74 
1 0.81  70.77 
1 0.74  70.79 
1 0.71  70.82 
0  70.85 
0  70.87 
0  70.89 
0  70.92 
0  70.94 
0  70.97 
0  70.99 
0  71.02 
0  71.04 
0  71.07 
0  71.09 
0  71.11 
0  71.14 
0  71.16 
0  71.19 
0  71.21 
0  71.24 
0  71.26 
0  71.28 
0  71.31 
0  71.33 
0  71.36 
0  71.38 
0  71.41 
0  71.43 
0  71.45 
1 0.74  71.48 
0  71.51 
1 0.83  71.53 
1 0.82  71.56 
1 0.72  71.59 
1 0.82  71.62 
1 0.76  71.64 
0  71.67 
0  71.69 
0  71.72 
0  71.74 
1 0.72  71.77 
0  71.79 
0  71.82 
0  71.84 
1 0.73  71.87 
1 0.76  71.9 
1 0.79  71.93 
1 0.81  71.96 
1 0.84  71.99 
1 0.83  72.02 
1 0.81  72.04 
1 0.82  72.07 
1 0.84  72.1 
1 0.84  72.13 
1 0.86  72.16 
1 0.88  72.18 
1 0.89  72.21 
1 0.9  72.24 
1 0.91  72.27 
1 0.92  72.3 
1 0.91  72.32 
1 0.9  72.35 
1 0.9  72.38 
2 0.78 0.9  72.41 
2 0.83 0.9  72.44 
2 0.83 0.88  72.47 
2 0.85 0.89  72.5 
2 0.82 0.9  72.53 
2 0.85 0.88  72.55 
2 0.81 0.89  72.58 
2 0.82 0.9  72.61 
2 0.82 0.89  72.64 
2 0.72 0.89  72.67 
1 0.91  72.7 
1 0.91  72.72 
1 0.9  72.75 
1 0.9  72.78 
1 0.9  72.81 
1 0.89  72.84 
1 0.89  72.86 
1 0.89  72.89 
1 0.88  72.92 
1 0.88  72.95 
1 0.87  72.98 
1 0.9  73.0 
1 0.9  73.03 
1 0.9  73.06 
1 0.9  73.09 
1 0.89  73.12 
1 0.88  73.14 
1 0.87  73.17 
1 0.88  73.2 
1 0.9  73.23 
1 0.9  73.26 
0  73.28 
0  73.31 
0  73.33 
0  73.36 
0  73.38 
0  73.4 
0  73.43 
0  73.45 
0  73.48 
0  73.5 
0  73.53 
0  73.55 
0  73.58 
0  73.6 
0  73.63 
0  73.65 
0  73.67 
0  73.7 
0  73.73 
0  73.75 
0  73.78 
0  73.8 
0  73.82 
0  73.85 
0  73.87 
0  73.9 
0  73.92 
0  73.95 
0  73.98 
0  74.0 
1 0.88  74.03 
1 0.88  74.06 
1 0.89  74.08 
1 0.89  74.11 
1 0.88  74.14 
1 0.87  74.17 
1 0.89  74.2 
1 0.89  74.22 
1 0.87  74.25 
1 0.88  74.28 
1 0.87  74.31 
1 0.89  74.34 
1 0.87  74.37 
1 0.84  74.39 
2 0.76 0.82  74.42 
2 0.77 0.84  74.45 
2 0.8 0.82  74.48 
2 0.72 0.8  74.51 
2 0.8 0.81  74.54 
2 0.79 0.88  74.57 
1 0.9  74.6 
2 0.76 0.89  74.62 
2 0.85 0.91  74.65 
2 0.79 0.88  74.68 
2 0.83 0.84  74.71 
1 0.89  74.74 
2 0.77 0.91  74.77 
2 0.72 0.93  74.8 
1 0.89  74.83 
1 0.89  74.86 
1 0.9  74.88 
1 0.91  74.91 
1 0.86  74.94 
1 0.9  74.97 
1 0.91  75.0 
1 0.91  75.03 
2 0.74 0.92  75.06 
2 0.77 0.92  75.09 
1 0.91  75.12 
1 0.9  75.15 
2 0.74 0.9  75.18 
2 0.78 0.89  75.21 
1 0.89  75.24 
1 0.89  75.27 
1 0.89  75.3 
2 0.85 0.89  75.33 
2 0.7 0.88  75.35 
2 0.75 0.88  75.39 
1 0.88  75.41 
1 0.88  75.44 
1 0.88  75.47 
1 0.89  75.5 
1 0.89  75.53 
1 0.9  75.56 
1 0.91  75.58 
1 0.91  75.61 
1 0.9  75.64 
1 0.9  75.67 
1 0.9  75.69 
1 0.9  75.72 
2 0.75 0.88  75.75 
1 0.88  75.78 
1 0.89  75.81 
1 0.89  75.84 
1 0.89  75.86 
2 0.8 0.9  75.89 
2 0.75 0.88  75.92 
2 0.82 0.83  75.96 
2 0.7 0.89  75.98 
1 0.88  76.01 
2 0.71 0.86  76.04 
2 0.74 0.84  76.07 
1 0.71  76.1 
1 0.72  76.13 
1 0.73  76.15 
1 0.75  76.18 
1 0.83  76.21 
1 0.85  76.25 
1 0.8  76.28 
1 0.77  76.31 
1 0.82  76.34 
1 0.82  76.37 
1 0.8  76.4 
1 0.84  76.43 
1 0.79  76.46 
2 0.71 0.79  76.49 
2 0.74 0.81  76.52 
0  76.55 
0  76.57 
0  76.6 
0  76.63 
0  76.65 
0  76.68 
0  76.7 
0  76.73 
0  76.75 
0  76.78 
0  76.8 
0  76.83 
0  76.85 
0  76.87 
0  76.9 
0  76.92 
0  76.95 
0  76.97 
0  77.0 
0  77.03 
0  77.05 
1 0.72  77.08 
0  77.1 
0  77.13 
0  77.15 
0  77.18 
0  77.2 
0  77.23 
0  77.25 
0  77.28 
0  77.3 
0  77.33 
0  77.35 
0  77.38 
1 0.8  77.4 
1 0.8  77.43 
0  77.46 
1 0.72  77.49 
0  77.51 
0  77.54 
0  77.56 
0  77.59 
0  77.61 
0  77.64 
0  77.66 
0  77.68 
0  77.72 
0  77.74 
0  77.77 
1 0.76  77.79 
1 0.75  77.82 
1 0.71  77.85 
1 0.75  77.88 
1 0.75  77.91 
1 0.77  77.94 
0  77.96 
0  77.99 
0  78.01 
0  78.04 
0  78.06 
1 0.75  78.09 
1 0.77  78.12 
1 0.7  78.15 
0  78.17 
0  78.2 
0  78.22 
0  78.25 
0  78.27 
0  78.3 
0  78.32 
1 0.7  78.35 
1 0.79  78.38 
1 0.82  78.41 
2 0.76 0.83  78.44 
1 0.85  78.47 
2 0.8 0.86  78.5 
1 0.88  78.53 
1 0.85  78.56 
2 0.75 0.76  78.59 
2 0.78 0.82  78.61 
2 0.8 0.84  78.64 
2 0.76 0.85  78.67 
2 0.7 0.85  78.7 
1 0.86  78.73 
1 0.88  78.76 
1 0.86  78.79 
1 0.71  78.82 
2 0.71 0.74  78.84 
0  78.87 
2 0.72 0.84  78.9 
2 0.72 0.83  78.93 
1 0.84  78.96 
2 0.71 0.77  78.99 
2 0.71 0.73  79.02 
1 0.84  79.05 
1 0.73  79.08 
0  79.1 
0  79.13 
0  79.16 
0  79.19 
1 0.71  79.23 
0  79.25 
0  79.28 
0  79.3 
1 0.78  79.33 
1 0.79  79.36 
1 0.9  79.39 
1 0.88  79.42 
1 0.88  79.45 
1 0.92  79.48 
1 0.86  79.51 
1 0.9  79.54 
1 0.9  79.56 
1 0.89  79.59 
1 0.85  79.62 
1 0.85  79.65 
1 0.81  79.68 
1 0.83  79.71 
1 0.79  79.74 
1 0.82  79.77 
1 0.86  79.8 
1 0.84  79.83 
1 0.82  79.86 
1 0.88  79.89 
1 0.9  79.91 
2 0.71 0.88  79.95 
2 0.73 0.84  79.97 
2 0.83 0.84  80.0 
2 0.81 0.86  80.03 
2 0.75 0.89  80.06 
2 0.71 0.84  80.09 
2 0.71 0.87  80.12 
1 0.88  80.15 
2 0.73 0.87  80.18 
2 0.73 0.84  80.21 
2 0.74 0.87  80.24 
2 0.76 0.88  80.27 
2 0.76 0.9  80.3 
1 0.89  80.33 
1 0.9  80.36 
1 0.91  80.39 
1 0.89  80.42 
0  80.45 
0  80.47 
0  80.5 
0  80.52 
0  80.55 
2 0.7 0.79  80.58 
2 0.71 0.71  80.61 
0  80.63 
1 0.82  80.66 
1 0.8  80.69 
1 0.8  80.72 
1 0.76  80.75 
1 0.79  80.78 
2 0.73 0.75  80.81 
0  80.83 
0  80.86 
1 0.71  80.89 
1 0.75  80.92 
1 0.78  80.95 
2 0.8 0.84  80.97 
2 0.7 0.75  81.0 
1 0.8  81.03 
1 0.81  81.06 
0  81.09 
0  81.11 
1 0.74  81.14 
0  81.17 
0  81.19 
0  81.22 
0  81.24 
0  81.27 
0  81.29 
0  81.32 
0  81.34 
1 0.7  81.37 
0  81.4 
0  81.42 
0  81.45 
0  81.48 
1 0.76  81.5 
0  81.53 
1 0.77  81.56 
1 0.75  81.59 
1 0.73  81.62 
1 0.73  81.65 
1 0.73  81.67 
1 0.73  81.7 
0  81.73 
0  81.75 
1 0.72  81.78 
0  81.81 
0  81.83 
1 0.71  81.86 
0  81.89 
1 0.72  81.91 
0  81.94 
0  81.97 
1 0.79  82.0 
1 0.79  82.03 
1 0.82  82.05 
1 0.81  82.08 
1 0.8  82.11 
1 0.83  82.14 
1 0.86  82.17 
1 0.9  82.2 
1 0.92  82.22 
1 0.92  82.25 
1 0.91  82.28 
1 0.9  82.31 
1 0.9  82.34 
1 0.88  82.37 
1 0.86  82.39 
1 0.85  82.42 
1 0.85  82.45 
1 0.87  82.48 
1 0.85  82.51 
1 0.86  82.54 
1 0.9  82.57 
1 0.88  82.6 
1 0.85  82.62 
2 0.79 0.83  82.65 
2 0.81 0.82  82.68 
2 0.79 0.84  82.71 
3 0.73 0.82 0.86  82.74 
2 0.83 0.87  82.77 
3 0.8 0.85 0.89  82.8 
3 0.81 0.88 0.9  82.83 
3 0.75 0.86 0.9  82.86 
2 0.85 0.91  82.89 
2 0.73 0.91  82.92 
2 0.74 0.91  82.95 
2 0.72 0.92  82.98 
1 0.92  83.01 
1 0.89  83.04 
1 0.84  83.07 
0  83.09 
0  83.12 
0  83.14 
0  83.17 
0  83.19 
0  83.21 
1 0.76  83.24 
0  83.27 
1 0.79  83.3 
1 0.77  83.33 
1 0.79  83.35 
1 0.74  83.38 
0  83.41 
1 0.74  83.44 
1 0.74  83.47 
0  83.49 
1 0.77  83.52 
1 0.77  83.55 
0  83.58 
1 0.73  83.61 
0  83.63 
0  83.66 
0  83.68 
0  83.71 
0  83.73 
0  83.76 
0  83.78 
0  83.81 
0  83.83 
0  83.86 
0  83.88 
0  83.91 
0  83.94 
0  83.96 
0  83.99 
0  84.01 
0  84.04 
0  84.06 
0  84.09 
0  84.11 
0  84.14 
0  84.16 
0  84.19 
0  84.21 
0  84.24 
0  84.26 
0  84.29 
1 0.74  84.32 
1 0.8  84.35 
1 0.73  84.38 
1 0.75  84.4 
1 0.8  84.43 
1 0.82  84.46 
1 0.82  84.5 
1 0.89  84.52 
1 0.88  84.55 
1 0.87  84.58 
1 0.87  84.61 
1 0.87  84.64 
1 0.86  84.7 
1 0.83  84.72 
1 0.84  84.75 
1 0.8  84.78 
1 0.8  84.81 
1 0.78  84.84 
1 0.73  84.87 
1 0.77  84.9 
1 0.8  84.92 
1 0.82  84.95 
1 0.82  84.98 
1 0.82  85.01 
1 0.83  85.04 
1 0.84  85.07 
1 0.86  85.1 
1 0.88  85.13 
1 0.88  85.16 
2 0.75 0.87  85.19 
1 0.83  85.21 
2 0.73 0.8  85.24 
2 0.75 0.77  85.27 
2 0.79 0.82  85.3 
2 0.82 0.87  85.33 
2 0.83 0.88  85.36 
2 0.77 0.78  85.39 
2 0.71 0.83  85.42 
0  85.45 
0  85.47 
0  85.5 
0  85.53 
0  85.56 
0  85.59 
0  85.61 
0  85.64 
0  85.66 
0  85.69 
0  85.71 
0  85.74 
0  85.76 
1 0.72  85.79 
0  85.81 
1 0.72  85.84 
1 0.75  85.87 
1 0.73  85.9 
0  85.93 
0  85.95 
0  85.98 
0  86.0 
0  86.03 
0  86.05 
0  86.08 
0  86.1 
0  86.13 
0  86.15 
0  86.18 
1 0.85  86.21 
1 0.91  86.23 
1 0.85  86.26 
1 0.88  86.29 
1 0.88  86.32 
1 0.85  86.35 
1 0.77  86.38 
1 0.83  86.43 
0  86.46 
1 0.75  86.49 
0  86.51 
0  86.54 
1 0.8  86.56 
0  86.59 
0  86.61 
0  86.64 
1 0.87  86.67 
1 0.85  86.7 
1 0.76  86.73 
1 0.71  86.76 
0  86.78 
0  86.81 
0  86.83 
0  86.86 
0  86.88 
0  86.91 
0  86.93 
0  86.96 
0  86.99 
0  87.01 
0  87.03 
0  87.06 
0  87.09 
0  87.11 
0  87.13 
0  87.16 
0  87.18 
0  87.21 
0  87.23 
0  87.26 
0  87.28 
0  87.31 
0  87.33 
0  87.36 
0  87.38 
1 0.79  87.41 
1 0.81  87.44 
1 0.83  87.47 
1 0.84  87.5 
1 0.84  87.53 
1 0.82  87.55 
1 0.8  87.58 
1 0.81  87.61 
1 0.78  87.64 
1 0.72  87.67 
0  87.69 
0  87.72 
0  87.74 
0  87.77 
0  87.79 
0  87.82 
0  87.84 
0  87.87 
0  87.89 
0  87.92 
0  87.94 
0  87.97 
0  87.99 
0  88.02 
0  88.04 
0  88.07 
0  88.09 
0  88.12 
0  88.14 
0  88.17 
0  88.19 
0  88.23 
0  88.25 
0  88.28 
0  88.3 
0  88.33 
0  88.35 
0  88.38 
0  88.4 
0  88.43 
0  88.46 
0  88.48 
0  88.51 
0  88.53 
0  88.56 
0  88.58 
0  88.61 
0  88.64 
0  88.66 
0  88.69 
0  88.71 
0  88.74 
0  88.76 
0  88.79 
0  88.81 
0  88.84 
0  88.86 
0  88.89 
0  88.91 
0  88.94 
0  88.97 
0  88.99 
0  89.02 
0  89.04 
0  89.07 
0  89.09 
1 0.74  89.12 
0  89.15 
0  89.17 
0  89.19 
0  89.22 
0  89.25 
0  89.27 
0  89.3 
0  89.32 
0  89.35 
0  89.37 
0  89.4 
0  89.42 
0  89.45 
0  89.47 
0  89.5 
0  89.53 
0  89.55 
0  89.58 
0  89.6 
0  89.63 
0  89.65 
0  89.68 
0  89.71 
0  89.73 
0  89.76 
0  89.79 
0  89.81 
0  89.84 
0  89.87 
0  89.89 
0  89.92 
0  89.95 
1 0.74  89.97 
0  90.0 
1 0.72  90.03 
0  90.06 
1 0.71  90.08 
0  90.11 
0  90.14 
0  90.16 
1 0.77  90.19 
1 0.86  90.22 
1 0.75  90.25 
1 0.8  90.28 
0  90.3 
0  90.33 
0  90.36 
0  90.38 
0  90.41 
0  90.43 
0  90.46 
1 0.78  90.49 
1 0.8  90.52 
0  90.54 
0  90.57 
1 0.74  90.59 
0  90.62 
1 0.85  90.65 
1 0.82  90.68 
1 0.76  90.71 
0  90.74 
0  90.76 
0  90.79 
0  90.81 
0  90.84 
0  90.86 
0  90.89 
0  90.91 
0  90.94 
0  90.96 
0  90.99 
1 0.72  91.02 
0  91.04 
0  91.07 
0  91.09 
0  91.12 
0  91.14 
0  91.17 
0  91.19 
0  91.22 
0  91.24 
0  91.27 
0  91.29 
0  91.32 
0  91.34 
0  91.37 
0  91.39 
0  91.42 
0  91.44 
0  91.47 
0  91.49 
0  91.52 
0  91.54 
0  91.57 
0  91.59 
0  91.62 
0  91.65 
0  91.67 
0  91.7 
0  91.72 
0  91.75 
0  91.77 
0  91.8 
1 0.74  91.83 
1 0.74  91.86 
0  91.88 
0  91.91 
0  91.93 
0  91.96 
0  91.98 
1 0.71  92.01 
0  92.04 
0  92.06 
0  92.09 
0  92.11 
0  92.14 
0  92.16 
0  92.19 
0  92.21 
0  92.24 
0  92.26 
0  92.29 
0  92.31 
0  92.34 
0  92.36 
0  92.39 
0  92.42 
1 0.72  92.44 
1 0.76  92.47 
1 0.75  92.5 
1 0.78  92.53 
1 0.79  92.56 
1 0.81  92.59 
1 0.81  92.62 
1 0.81  92.65 
1 0.75  92.68 
1 0.78  92.7 
1 0.86  92.73 
1 0.82  92.76 
1 0.86  92.79 
1 0.8  92.82 
1 0.81  92.85 
1 0.86  92.88 
1 0.82  92.91 
1 0.82  92.94 
0  92.96 
0  92.99 
1 0.77  93.02 
1 0.79  93.04 
1 0.83  93.07 
1 0.78  93.1 
1 0.76  93.13 
1 0.77  93.16 
1 0.83  93.19 
1 0.91  93.21 
1 0.91  93.24 
1 0.92  93.28 
1 0.91  93.3 
1 0.85  93.33 
1 0.87  93.36 
1 0.88  93.39 
1 0.86  93.42 
2 0.77 0.86  93.45 
1 0.85  93.48 
2 0.74 0.85  93.51 
2 0.76 0.86  93.54 
1 0.86  93.56 
1 0.84  93.59 
2 0.71 0.83  93.62 
1 0.83  93.65 
1 0.87  93.68 
1 0.84  93.71 
1 0.86  93.74 
1 0.86  93.77 
2 0.75 0.82  93.8 
2 0.73 0.87  93.83 
1 0.9  93.86 
1 0.91  93.89 
1 0.87  93.92 
1 0.87  93.95 
1 0.87  93.97 
1 0.83  94.0 
1 0.7  94.03 
1 0.73  94.06 
1 0.79  94.09 
2 0.74 0.75  94.12 
1 0.73  94.15 
1 0.74  94.18 
1 0.74  94.21 
1 0.73  94.23 
1 0.79  94.26 
1 0.81  94.29 
1 0.82  94.32 
1 0.79  94.35 
0  94.38 
0  94.4 
1 0.71  94.43 
0  94.46 
0  94.48 
0  94.51 
0  94.53 
0  94.56 
0  94.58 
0  94.61 
0  94.64 
0  94.66 
0  94.69 
0  94.71 
0  94.74 
0  94.77 
0  94.79 
0  94.82 
0  94.84 
0  94.87 
0  94.89 
0  94.92 
0  94.95 
0  94.97 
1 0.81  95.0 
0  95.03 
1 0.73  95.06 
0  95.08 
0  95.11 
0  95.14 
1 0.83  95.17 
1 0.78  95.2 
1 0.91  95.22 
1 0.86  95.25 
0  95.28 
0  95.3 
0  95.33 
0  95.36 
1 0.91  95.38 
1 0.89  95.41 
1 0.84  95.44 
1 0.78  95.47 
1 0.72  95.5 
2 0.72 0.79  95.53 
0  95.56 
1 0.8  95.59 
1 0.76  95.62 
2 0.71 0.8  95.65 
3 0.79 0.8 0.83  95.68 
3 0.81 0.82 0.87  95.71 
3 0.82 0.83 0.9  95.74 
3 0.82 0.84 0.91  95.77 
3 0.73 0.8 0.92  95.8 
3 0.76 0.83 0.92  95.83 
2 0.85 0.9  95.86 
2 0.85 0.88  95.89 
2 0.84 0.88  95.92 
2 0.81 0.91  95.95 
2 0.76 0.91  95.98 
2 0.77 0.91  96.01 
2 0.75 0.88  96.04 
1 0.82  96.07 
2 0.75 0.75  96.1 
2 0.78 0.8  96.13 
3 0.71 0.74 0.87  96.16 
3 0.75 0.87 0.87  96.19 
3 0.77 0.88 0.89  96.22 
3 0.84 0.89 0.91  96.26 
3 0.83 0.88 0.91  96.29 
3 0.85 0.9 0.91  96.32 
3 0.84 0.89 0.9  96.36 
3 0.84 0.87 0.9  96.39 
3 0.85 0.87 0.9  96.42 
3 0.84 0.86 0.91  96.45 
3 0.83 0.84 0.9  96.48 
3 0.82 0.83 0.91  96.51 
3 0.83 0.84 0.91  96.54 
3 0.77 0.79 0.91  96.57 
2 0.75 0.92  96.6 
3 0.71 0.77 0.91  96.63 
2 0.8 0.92  96.66 
2 0.83 0.92  96.69 
2 0.82 0.92  96.72 
2 0.84 0.93  96.75 
2 0.86 0.92  96.78 
2 0.81 0.91  96.81 
2 0.82 0.91  96.84 
2 0.76 0.91  96.87 
2 0.79 0.92  96.9 
2 0.76 0.92  96.93 
1 0.92  96.96 
2 0.74 0.92  96.99 
1 0.92  97.02 
1 0.91  97.05 
1 0.9  97.07 
1 0.88  97.1 
2 0.71 0.86  97.13 
1 0.86  97.16 
1 0.84  97.19 
1 0.81  97.22 
1 0.83  97.25 
1 0.86  97.28 
1 0.86  97.31 
1 0.88  97.33 
2 0.76 0.91  97.36 
1 0.92  97.39 
1 0.93  97.42 
1 0.93  97.45 
1 0.92  97.48 
1 0.91  97.51 
1 0.9  97.54 
1 0.89  97.57 
1 0.91  97.6 
1 0.91  97.63 
1 0.91  97.66 
1 0.91  97.69 
1 0.91  97.71 
1 0.91  97.74 
1 0.9  97.77 
1 0.89  97.8 
1 0.89  97.83 
1 0.89  97.86 
1 0.9  97.89 
1 0.9  97.92 
2 0.84 0.9  97.95 
1 0.9  97.98 
2 0.71 0.9  98.01 
1 0.9  98.04 
1 0.9  98.07 
2 0.76 0.91  98.1 
3 0.8 0.81 0.9  98.13 
3 0.71 0.77 0.89  98.16 
1 0.86  98.19 
1 0.84  98.22 
2 0.73 0.81  98.25 
1 0.83  98.28 
2 0.72 0.83  98.31 
1 0.83  98.34 
2 0.72 0.85  98.37 
1 0.84  98.4 
2 0.75 0.83  98.43 
2 0.8 0.81  98.46 
2 0.74 0.85  98.49 
2 0.75 0.85  98.52 
2 0.79 0.81  98.55 
1 0.76  98.58 
1 0.83  98.6 
1 0.78  98.63 
0  98.66 
1 0.73  98.69 
0  98.71 
0  98.74 
1 0.79  98.77 
1 0.74  98.8 
2 0.77 0.8  98.83 
2 0.74 0.86  98.86 
1 0.8  98.89 
2 0.83 0.83  98.91 
2 0.85 0.85  98.95 
2 0.78 0.8  98.98 
1 0.79  99.0 
1 0.8  99.03 
2 0.73 0.8  99.06 
1 0.74  99.09 
0  99.12 
1 0.84  99.14 
1 0.8  99.17 
1 0.83  99.2 
1 0.88  99.23 
0  99.25 
0  99.28 
1 0.72  99.31 
1 0.86  99.34 
1 0.76  99.36 
0  99.39 
0  99.41 
0  99.44 
0  99.47 
0  99.49 
0  99.52 
0  99.54 
0  99.57 
0  99.59 
0  99.62 
0  99.64 
0  99.67 
0  99.69 
0  99.72 
0  99.75 
0  99.77 
0  99.8 
0  99.82 
0  99.85 
1 0.76  99.88 
1 0.82  99.91 
1 0.84  99.94 
1 0.86  99.97 
1 0.79  100.0 
2 0.71 0.74  100.02 
0  100.05 
0  100.08 
1 0.73  100.11 
1 0.76  100.14 
0  100.16 
0  100.19 
0  100.21 
0  100.24 
0  100.26 
0  100.29 
0  100.31 
0  100.34 
0  100.37 
0  100.39 
0  100.42 
0  100.44 
0  100.47 
0  100.49 
0  100.52 
0  100.55 
0  100.57 
0  100.6 
0  100.62 
0  100.65 
0  100.67 
0  100.7 
0  100.73 
0  100.75 
0  100.78 
0  100.8 
0  100.83 
0  100.86 
0  100.88 
0  100.91 
0  100.93 
0  100.96 
0  100.99 
0  101.01 
0  101.04 
0  101.06 
0  101.09 
0  101.11 
0  101.14 
0  101.17 
0  101.19 
0  101.22 
0  101.24 
0  101.27 
0  101.29 
0  101.32 
0  101.35 
0  101.37 
0  101.4 
0  101.42 
0  101.45 
0  101.48 
0  101.5 
0  101.53 
1 0.74  101.55 
1 0.76  101.58 
0  101.61 
0  101.63 
1 0.82  101.66 
1 0.71  101.69 
1 0.82  101.72 
1 0.86  101.75 
1 0.85  101.78 
1 0.88  101.81 
1 0.9  101.84 
1 0.9  101.87 
1 0.9  101.91 
2 0.74 0.9  101.94 
2 0.75 0.9  101.97 
2 0.72 0.9  102.0 
1 0.91  102.03 
1 0.9  102.06 
1 0.9  102.09 
1 0.9  102.12 
1 0.9  102.15 
1 0.9  102.18 
1 0.9  102.21 
1 0.9  102.25 
1 0.89  102.28 
1 0.9  102.31 
1 0.9  102.34 
1 0.9  102.37 
1 0.9  102.4 
1 0.91  102.43 
1 0.9  102.46 
1 0.9  102.5 
1 0.91  102.53 
1 0.91  102.56 
1 0.91  102.59 
1 0.91  102.62 
1 0.88  102.65 
0  102.68 
0  102.71 
0  102.73 
0  102.76 
0  102.78 
0  102.81 
1 0.71  102.84 
0  102.86 
1 0.75  102.89 
1 0.71  102.92 
0  102.95 
0  102.98 
0  103.0 
1 0.83  103.03 
1 0.87  103.06 
1 0.88  103.09 
1 0.91  103.12 
1 0.91  103.15 
1 0.91  103.18 
1 0.92  103.21 
1 0.92  103.24 
1 0.93  103.27 
1 0.91  103.3 
1 0.86  103.33 
1 0.85  103.36 
1 0.83  103.39 
1 0.8  103.42 
1 0.83  103.45 
1 0.85  103.48 
1 0.87  103.51 
1 0.87  103.54 
1 0.85  103.58 
1 0.89  103.61 
1 0.91  103.64 
1 0.91  103.67 
1 0.92  103.69 
1 0.88  103.72 
1 0.83  103.75 
1 0.82  103.78 
1 0.83  103.81 
1 0.86  103.84 
1 0.84  103.87 
1 0.78  103.9 
0  103.93 
0  103.96 
0  103.98 
0  104.01 
1 0.76  104.04 
1 0.79  104.07 
1 0.8  104.1 
1 0.8  104.13 
1 0.77  104.16 
1 0.7  104.19 
0  104.21 
0  104.24 
1 0.76  104.27 
1 0.78  104.3 
1 0.76  104.33 
0  104.35 
0  104.38 
0  104.41 
0  104.43 
0  104.46 
0  104.49 
0  104.52 
1 0.78  104.55 
0  104.57 
0  104.6 
0  104.62 
0  104.65 
1 0.74  104.68 
1 0.81  104.71 
1 0.79  104.74 
1 0.87  104.77 
1 0.87  104.79 
1 0.86  104.82 
1 0.81  104.85 
1 0.73  104.88 
1 0.73  104.91 
1 0.75  104.94 
1 0.82  104.97 
1 0.83  105.0 
1 0.73  105.03 
1 0.72  105.06 
1 0.86  105.09 
1 0.89  105.12 
1 0.87  105.15 
1 0.87  105.18 
2 0.7 0.82  105.22 
1 0.75  105.25 
1 0.82  105.28 
1 0.83  105.31 
0  105.34 
0  105.36 
1 0.71  105.39 
0  105.42 
0  105.44 
1 0.73  105.47 
2 0.82 0.82  105.5 
1 0.76  105.53 
0  105.56 
0  105.58 
0  105.61 
0  105.63 
0  105.66 
0  105.68 
0  105.71 
0  105.73 
0  105.76 
0  105.78 
0  105.81 
0  105.83 
0  105.86 
0  105.88 
0  105.91 
0  105.93 
0  105.96 
0  105.99 
1 0.72  106.02 
1 0.71  106.05 
1 0.81  106.07 
1 0.74  106.1 
1 0.72  106.13 
0  106.16 
0  106.18 
0  106.21 
0  106.23 
0  106.26 
0  106.28 
0  106.31 
0  106.33 
0  106.36 
0  106.38 
0  106.41 
0  106.44 
0  106.46 
0  106.49 
0  106.51 
0  106.54 
0  106.56 
0  106.59 
0  106.62 
0  106.64 
0  106.67 
0  106.7 
0  106.72 
0  106.75 
0  106.78 
0  106.81 
0  106.84 
0  106.86 
0  106.89 
0  106.92 
0  106.95 
0  106.98 
0  107.01 
0  107.03 
0  107.06 
0  107.09 
1 0.76  107.12 
1 0.82  107.15 
1 0.79  107.18 
1 0.77  107.21 
1 0.77  107.24 
1 0.84  107.27 
1 0.82  107.3 
1 0.79  107.33 
0  107.36 
0  107.38 
0  107.41 
0  107.43 
0  107.46 
0  107.49 
0  107.51 
0  107.54 
0  107.56 
0  107.59 
0  107.61 
0  107.64 
0  107.66 
0  107.69 
0  107.71 
0  107.74 
0  107.77 
0  107.79 
0  107.82 
0  107.84 
0  107.87 
0  107.89 
0  107.92 
0  107.94 
0  107.97 
0  108.0 
0  108.02 
0  108.05 
0  108.07 
0  108.1 
0  108.12 
0  108.15 
0  108.17 
0  108.2 
0  108.22 
0  108.25 
0  108.27 
0  108.3 
0  108.33 
0  108.35 
0  108.38 
0  108.4 
0  108.43 
0  108.45 
0  108.48 
0  108.51 
0  108.53 
0  108.56 
0  108.58 
0  108.61 
0  108.63 
0  108.66 
1 0.73  108.69 
1 0.83  108.71 
1 0.73  108.74 
0  108.77 
0  108.79 
1 0.83  108.82 
2 0.71 0.75  108.85 
1 0.78  108.88 
0  108.91 
0  108.94 
0  108.96 
0  108.99 
0  109.01 
0  109.04 
0  109.07 
0  109.09 
1 0.77  109.12 
0  109.15 
0  109.17 
1 0.77  109.2 
1 0.81  109.23 
1 0.88  109.26 
1 0.85  109.29 
1 0.78  109.32 
1 0.7  109.35 
1 0.79  109.37 
0  109.4 
0  109.43 
1 0.78  109.46 
1 0.75  109.49 
1 0.78  109.52 
0  109.54 
0  109.57 
1 0.82  109.6 
1 0.84  109.63 
1 0.86  109.68 
1 0.86  109.71 
1 0.86  109.74 
1 0.9  109.77 
1 0.89  109.8 
1 0.9  109.83 
1 0.91  109.86 
1 0.89  109.89 
1 0.85  109.92 
1 0.84  109.95 
1 0.85  109.98 
1 0.88  110.01 
1 0.86  110.04 
1 0.85  110.07 
1 0.82  110.1 
1 0.85  110.13 
1 0.86  110.16 
1 0.87  110.19 
1 0.86  110.22 
1 0.81  110.25 
1 0.84  110.28 
1 0.84  110.31 
1 0.82  110.34 
1 0.77  110.37 
1 0.8  110.39 
1 0.81  110.42 
1 0.75  110.46 
0  110.48 
0  110.51 
0  110.53 
1 0.71  110.56 
1 0.75  110.59 
1 0.77  110.62 
2 0.73 0.78  110.65 
1 0.79  110.68 
2 0.84 0.84  110.71 
2 0.83 0.86  110.74 
2 0.81 0.82  110.77 
2 0.77 0.83  110.8 
2 0.73 0.88  110.83 
2 0.72 0.9  110.87 
2 0.77 0.89  110.89 
2 0.78 0.89  110.92 
2 0.83 0.84  110.95 
2 0.85 0.88  110.98 
2 0.7 0.9  111.01 
1 0.91  111.04 
1 0.9  111.07 
2 0.78 0.87  111.1 
2 0.75 0.89  111.13 
2 0.81 0.89  111.15 
2 0.81 0.9  111.18 
2 0.86 0.91  111.21 
2 0.81 0.93  111.24 
2 0.81 0.91  111.27 
2 0.79 0.88  111.3 
2 0.71 0.88  111.33 
1 0.9  111.36 
2 0.76 0.9  111.39 
2 0.79 0.89  111.42 
2 0.8 0.88  111.45 
2 0.82 0.87  111.48 
2 0.81 0.83  111.5 
2 0.77 0.86  111.53 
2 0.8 0.87  111.56 
2 0.8 0.86  111.59 
2 0.8 0.84  111.62 
1 0.76  111.65 
1 0.77  111.68 
1 0.79  111.7 
1 0.76  111.73 
1 0.81  111.76 
1 0.8  111.79 
1 0.76  111.82 
1 0.76  111.84 
1 0.74  111.87 
1 0.71  111.9 
1 0.75  111.93 
1 0.78  111.96 
1 0.83  111.99 
1 0.83  112.02 
1 0.8  112.04 
1 0.78  112.07 
1 0.83  112.1 
1 0.82  112.13 
1 0.81  112.16 
1 0.83  112.18 
1 0.81  112.21 
1 0.84  112.24 
1 0.81  112.27 
1 0.8  112.29 
1 0.89  112.32 
1 0.92  112.35 
1 0.92  112.39 
1 0.93  112.42 
1 0.88  112.45 
1 0.76  112.48 
1 0.76  112.5 
1 0.83  112.53 
2 0.76 0.85  112.56 
2 0.74 0.86  112.59 
2 0.73 0.83  112.62 
2 0.7 0.76  112.65 
1 0.76  112.68 
1 0.71  112.71 
1 0.72  112.73 
1 0.81  112.76 
1 0.75  112.79 
2 0.74 0.75  112.82 
1 0.73  112.85 
0  112.87 
0  112.9 
0  112.92 
0  112.95 
2 0.72 0.74  112.98 
1 0.81  113.01 
1 0.82  113.04 
1 0.82  113.07 
1 0.84  113.1 
1 0.88  113.12 
1 0.85  113.15 
2 0.77 0.86  113.18 
2 0.71 0.88  113.21 
1 0.87  113.24 
1 0.88  113.27 
1 0.88  113.3 
1 0.89  113.33 
1 0.88  113.35 
1 0.84  113.38 
1 0.81  113.41 
1 0.85  113.44 
1 0.88  113.47 
1 0.89  113.5 
1 0.88  113.53 
1 0.89  113.55 
1 0.89  113.58 
1 0.88  113.61 
1 0.89  113.64 
1 0.9  113.67 
1 0.86  113.69 
1 0.84  113.72 
1 0.86  113.75 
1 0.87  113.78 
1 0.88  113.8 
1 0.85  113.83 
1 0.85  113.86 
1 0.83  113.89 
1 0.85  113.92 
1 0.85  113.94 
1 0.85  113.97 
1 0.87  114.0 
1 0.89  114.03 
1 0.9  114.06 
1 0.9  114.08 
1 0.9  114.11 
1 0.9  114.14 
1 0.9  114.17 
1 0.9  114.2 
1 0.9  114.22 
1 0.9  114.25 
1 0.88  114.28 
1 0.87  114.31 
1 0.9  114.34 
1 0.9  114.37 
1 0.89  114.39 
1 0.89  114.42 
1 0.89  114.45 
1 0.9  114.48 
1 0.9  114.51 
1 0.89  114.54 
1 0.89  114.56 
1 0.89  114.59 
1 0.89  114.62 
1 0.89  114.65 
1 0.9  114.68 
1 0.89  114.7 
1 0.89  114.73 
1 0.89  114.76 
1 0.89  114.79 
2 0.79 0.89  114.82 
2 0.8 0.9  114.85 
2 0.84 0.9  114.87 
2 0.83 0.89  114.9 
2 0.8 0.89  114.93 
2 0.81 0.88  114.96 
2 0.79 0.89  114.99 
2 0.74 0.89  115.02 
1 0.89  115.05 
1 0.88  115.08 
2 0.7 0.88  115.1 
1 0.88  115.13 
1 0.89  115.16 
1 0.88  115.19 
1 0.88  115.22 
1 0.87  115.25 
1 0.87  115.27 
1 0.88  115.3 
1 0.87  115.33 
1 0.87  115.36 
1 0.87  115.38 
1 0.86  115.41 
1 0.87  115.44 
1 0.86  115.47 
1 0.86  115.5 
1 0.88  115.53 
1 0.88  115.55 
1 0.87  115.58 
1 0.88  115.61 
1 0.87  115.64 
1 0.87  115.66 
1 0.87  115.69 
1 0.86  115.72 
1 0.85  115.75 
1 0.85  115.77 
2 0.86 0.86  115.8 
2 0.85 0.85  115.83 
2 0.71 0.86  115.86 
2 0.71 0.85  115.89 
1 0.8  115.91 
1 0.8  115.94 
2 0.75 0.76  115.97 
2 0.71 0.78  116.0 
1 0.81  116.03 
1 0.81  116.05 
1 0.79  116.08 
1 0.77  116.11 
1 0.84  116.14 
1 0.89  116.16 
1 0.92  116.19 
1 0.92  116.22 
1 0.93  116.24 
1 0.92  116.27 
1 0.89  116.3 
1 0.88  116.33 
1 0.89  116.35 
1 0.9  116.38 
2 0.7 0.89  116.41 
1 0.87  116.44 
1 0.87  116.46 
1 0.85  116.49 
1 0.9  116.52 
1 0.89  116.55 
1 0.88  116.57 
1 0.88  116.6 
1 0.9  116.63 
1 0.89  116.65 
1 0.88  116.68 
1 0.88  116.71 
1 0.91  116.73 
1 0.91  116.76 
1 0.91  116.79 
2 0.74 0.91  116.82 
1 0.89  116.84 
1 0.88  116.87 
1 0.9  116.9 
1 0.91  116.92 
1 0.93  116.95 
1 0.91  116.98 
1 0.92  117.01 
1 0.89  117.03 
1 0.86  117.06 
1 0.87  117.09 
1 0.88  117.11 
1 0.9  117.14 
1 0.92  117.17 
1 0.9  117.2 
1 0.92  117.22 
1 0.91  117.25 
1 0.89  117.28 
1 0.9  117.3 
1 0.9  117.33 
1 0.89  117.36 
1 0.92  117.39 
1 0.91  117.41 
1 0.91  117.44 
1 0.91  117.47 
1 0.92  117.5 
1 0.91  117.52 
1 0.92  117.55 
1 0.91  117.58 
0  117.6 
0  117.63 
0  117.65 
0  117.67 
1 0.8  117.7 
1 0.82  117.73 
1 0.8  117.75 
1 0.81  117.78 
1 0.78  117.81 
1 0.84  117.83 
1 0.79  117.88 
1 0.82  117.91 
1 0.75  117.94 
2 0.78 0.79  117.97 
2 0.73 0.81  118.0 
2 0.77 0.85  118.02 
1 0.78  118.05 
0  118.07 
0  118.1 
0  118.12 
0  118.14 
1 0.75  118.17 
0  118.19 
1 0.8  118.22 
2 0.8 0.81  118.25 
2 0.81 0.83  118.28 
2 0.73 0.84  118.3 
2 0.77 0.85  118.33 
1 0.85  118.36 
1 0.84  118.39 
1 0.85  118.41 
1 0.86  118.44 
1 0.87  118.47 
1 0.86  118.5 
1 0.87  118.52 
1 0.82  118.55 
1 0.88  118.58 
1 0.89  118.6 
1 0.88  118.63 
1 0.86  118.66 
1 0.82  118.68 
1 0.83  118.71 
1 0.84  118.74 
1 0.82  118.76 
1 0.82  118.79 
1 0.8  118.82 
1 0.84  118.84 
1 0.85  118.87 
1 0.84  118.9 
1 0.82  118.93 
1 0.78  118.95 
1 0.83  118.98 
1 0.8  119.01 
1 0.81  119.03 
1 0.86  119.06 
1 0.88  119.09 
1 0.89  119.11 
1 0.9  119.14 
1 0.87  119.17 
1 0.78  119.2 
0  119.22 
1 0.76  119.25 
1 0.71  119.27 
1 0.77  119.3 
0  119.32 
0  119.35 
0  119.37 
1 0.75  119.4 
0  119.42 
0  119.45 
0  119.47 
0  119.5 
1 0.74  119.52 
1 0.83  119.55 
1 0.73  119.58 
1 0.82  119.61 
1 0.79  119.63 
1 0.71  119.66 
1 0.73  119.69 
0  119.71 
0  119.74 
0  119.76 
1 0.73  119.79 
1 0.75  119.82 
1 0.8  119.84 
0  119.87 
0  119.89 
1 0.7  119.92 
0  119.94 
0  119.97 
0  119.99 
0  120.01 
0  120.03 
0  120.06 
0  120.08 
0  120.11 
0  120.13 
0  120.15 
0  120.18 
0  120.2 
0  120.22 
0  120.25 
0  120.27 
0  120.29 
0  120.32 
0  120.34 
0  120.36 
0  120.38 
0  120.41 
0  120.43 
0  120.46 
0  120.48 
0  120.5 
1 0.72  120.53 
1 0.75  120.56 
1 0.8  120.58 
1 0.83  120.61 
1 0.72  120.64 
1 0.71  120.66 
1 0.76  120.69 
1 0.72  120.72 
0  120.74 
0  120.76 
0  120.79 
0  120.81 
0  120.83 
0  120.86 
0  120.88 
1 0.82  120.91 
0  120.93 
0  120.96 
0  120.98 
0  121.01 
0  121.03 
0  121.05 
0  121.08 
1 0.72  121.1 
1 0.81  121.13 
1 0.87  121.16 
1 0.89  121.18 
1 0.86  121.21 
1 0.76  121.24 
1 0.77  121.27 
1 0.79  121.3 
0  121.33 
0  121.36 
0  121.38 
0  121.41 
0  121.43 
0  121.46 
0  121.48 
0  121.5 
0  121.53 
0  121.55 
0  121.57 
1 0.81  121.6 
1 0.76  121.63 
0  121.65 
0  121.68 
0  121.7 
0  121.72 
1 0.74  121.75 
1 0.8  121.78 
1 0.75  121.8 
1 0.75  121.83 
1 0.73  121.86 
1 0.74  121.89 
1 0.78  121.91 
2 0.77 0.83  121.94 
3 0.77 0.84 0.89  121.97 
2 0.78 0.89  122.0 
3 0.73 0.87 0.87  122.03 
3 0.75 0.8 0.89  122.05 
3 0.74 0.75 0.86  122.08 
3 0.73 0.77 0.88  122.11 
2 0.76 0.84  122.14 
2 0.71 0.84  122.17 
0  122.19 
1 0.73  122.22 
1 0.78  122.24 
1 0.83  122.27 
1 0.86  122.3 
1 0.85  122.32 
1 0.84  122.35 
1 0.84  122.38 
1 0.88  122.41 
0  122.43 
1 0.84  122.47 
1 0.85  122.5 
1 0.92  122.53 
1 0.88  122.56 
1 0.81  122.59 
0  122.61 
0  122.64 
0  122.67 
0  122.7 
0  122.72 
1 0.81  122.75 
1 0.7  122.78 
1 0.75  122.81 
1 0.83  122.84 
1 0.83  122.87 
1 0.73  122.9 
1 0.77  122.93 
1 0.77  122.96 
1 0.84  122.99 
1 0.83  123.02 
0  123.04 
1 0.79  123.07 
1 0.81  123.1 
1 0.78  123.12 
1 0.85  123.15 
1 0.75  123.18 
1 0.73  123.21 
1 0.85  123.24 
1 0.8  123.26 
2 0.76 0.86  123.29 
2 0.81 0.84  123.32 
2 0.78 0.85  123.35 
1 0.84  123.38 
1 0.85  123.41 
1 0.84  123.44 
1 0.83  123.48 
2 0.83 0.88  123.51 
2 0.81 0.91  123.54 
2 0.83 0.91  123.57 
2 0.82 0.91  123.6 
2 0.83 0.86  123.63 
2 0.75 0.77  123.66 
2 0.76 0.89  123.69 
1 0.84  123.72 
0  123.75 
0  123.77 
0  123.8 
0  123.82 
0  123.85 
0  123.88 
1 0.78  123.91 
0  123.93 
0  123.96 
0  123.99 
0  124.01 
0  124.04 
0  124.06 
0  124.09 
0  124.12 
0  124.14 
0  124.17 
0  124.19 
0  124.22 
0  124.25 
0  124.27 
0  124.3 
0  124.32 
0  124.35 
0  124.38 
0  124.4 
0  124.43 
0  124.46 
0  124.48 
0  124.51 
0  124.53 
0  124.56 
0  124.59 
0  124.61 
0  124.64 
0  124.66 
0  124.69 
0  124.72 
0  124.74 
0  124.77 
0  124.79 
0  124.82 
0  124.85 
0  124.87 
0  124.9 
0  124.93 
0  124.95 
0  124.98 
0  125.0 
0  125.03 
0  125.06 
0  125.08 
1 0.72  125.11 
0  125.13 
0  125.16 
0  125.19 
0  125.21 
0  125.24 
0  125.26 
0  125.29 
0  125.32 
0  125.34 
0  125.37 
1 0.73  125.4 
1 0.77  125.43 
1 0.72  125.46 
1 0.8  125.49 
1 0.73  125.52 
0  125.55 
0  125.58 
1 0.85  125.61 
1 0.85  125.64 
1 0.88  125.67 
1 0.88  125.7 
1 0.88  125.73 
1 0.83  125.76 
1 0.81  125.79 
1 0.81  125.82 
0  125.84 
0  125.87 
1 0.79  125.9 
1 0.73  125.93 
1 0.84  125.96 
1 0.75  125.99 
0  126.03 
1 0.77  126.06 
1 0.77  126.09 
0  126.12 
1 0.78  126.14 
1 0.7  126.17 
0  126.2 
1 0.76  126.23 
1 0.77  126.26 
1 0.82  126.29 
1 0.85  126.32 
1 0.84  126.35 
1 0.77  126.38 
1 0.86  126.41 
1 0.87  126.44 
1 0.83  126.47 
1 0.81  126.5 
1 0.81  126.53 
1 0.82  126.56 
1 0.84  126.59 
1 0.88  126.62 
1 0.84  126.64 
1 0.84  126.67 
1 0.86  126.7 
1 0.86  126.73 
1 0.86  126.76 
0  126.79 
1 0.71  126.81 
0  126.84 
0  126.87 
0  126.89 
0  126.92 
1 0.71  126.95 
0  126.97 
1 0.72  127.0 
0  127.03 
0  127.05 
0  127.08 
0  127.1 
1 0.71  127.13 
2 0.72 0.77  127.16 
1 0.74  127.19 
1 0.72  127.22 
0  127.24 
0  127.27 
0  127.3 
0  127.32 
0  127.35 
0  127.37 
0  127.4 
0  127.42 
0  127.45 
0  127.48 
0  127.5 
0  127.53 
0  127.56 
0  127.58 
0  127.62 
0  127.64 
0  127.67 
0  127.69 
0  127.72 
1 0.82  127.75 
1 0.79  127.78 
2 0.73 0.8  127.81 
1 0.79  127.84 
1 0.77  127.87 
0  127.89 
0  127.92 
0  127.95 
0  127.97 
0  128.0 
0  128.02 
0  128.05 
0  128.08 
0  128.1 
1 0.7  128.13 
0  128.16 
0  128.18 
1 0.75  128.21 
1 0.74  128.24 
1 0.72  128.27 
1 0.77  128.3 
0  128.32 
1 0.75  128.35 
1 0.72  128.38 
1 0.82  128.41 
1 0.73  128.44 
0  128.47 
1 0.74  128.5 
2 0.7 0.79  128.53 
1 0.75  128.56 
0  128.58 
1 0.74  128.61 
1 0.76  128.64 
1 0.84  128.67 
1 0.85  128.7 
1 0.85  128.73 
2 0.74 0.85  128.76 
0  128.78 
2 0.72 0.73  128.81 
0  128.83 
0  128.86 
1 0.71  128.89 
1 0.8  128.91 
1 0.83  128.94 
1 0.86  128.97 
1 0.85  129.0 
1 0.86  129.03 
1 0.86  129.05 
1 0.86  129.08 
1 0.89  129.11 
1 0.87  129.14 
1 0.88  129.17 
1 0.84  129.2 
1 0.79  129.22 
1 0.82  129.25 
1 0.84  129.28 
1 0.83  129.31 
1 0.87  129.33 
1 0.86  129.36 
1 0.79  129.39 
1 0.77  129.42 
1 0.79  129.45 
1 0.81  129.48 
1 0.84  129.5 
1 0.86  129.53 
1 0.85  129.56 
1 0.85  129.59 
1 0.85  129.62 
1 0.86  129.64 
1 0.88  129.67 
1 0.81  129.7 
0  129.72 
0  129.75 
0  129.77 
0  129.8 
0  129.82 
0  129.84 
0  129.87 
0  129.9 
0  129.92 
0  129.94 
1 0.71  129.97 
1 0.77  130.0 
0  130.03 
1 0.78  130.06 
1 0.7  130.08 
1 0.76  130.11 
1 0.75  130.14 
0  130.17 
0  130.2 
0  130.22 
0  130.25 
0  130.28 
0  130.31 
0  130.33 
0  130.36 
0  130.39 
0  130.41 
0  130.44 
0  130.47 
0  130.49 
0  130.52 
0  130.55 
0  130.57 
0  130.6 
0  130.63 
0  130.65 
0  130.68 
0  130.71 
0  130.73 
0  130.76 
2 0.74 0.81  130.79 
1 0.8  130.82 
1 0.87  130.85 
1 0.79  130.88 
1 0.83  130.91 
1 0.84  130.94 
1 0.76  130.97 
0  131.0 
1 0.73  131.03 
1 0.86  131.06 
1 0.87  131.09 
1 0.89  131.12 
1 0.87  131.15 
1 0.87  131.18 
1 0.81  131.21 
1 0.72  131.24 
0  131.27 
1 0.76  131.3 
0  131.32 
1 0.75  131.35 
1 0.82  131.38 
1 0.82  131.41 
1 0.8  131.44 
1 0.79  131.47 
1 0.79  131.5 
1 0.82  131.53 
1 0.84  131.55 
1 0.83  131.58 
1 0.84  131.61 
1 0.83  131.64 
1 0.82  131.67 
1 0.84  131.69 
1 0.88  131.72 
1 0.88  131.75 
1 0.89  131.78 
1 0.89  131.81 
1 0.87  131.83 
1 0.83  131.86 
1 0.81  131.89 
0  131.92 
0  131.94 
1 0.7  131.97 
1 0.71  132.0 
0  132.02 
0  132.05 
0  132.07 
0  132.09 
1 0.84  132.12 
1 0.81  132.15 
1 0.82  132.18 
1 0.82  132.2 
1 0.73  132.23 
1 0.75  132.26 
1 0.81  132.29 
1 0.82  132.32 
1 0.82  132.34 
1 0.84  132.37 
1 0.8  132.4 
1 0.81  132.43 
2 0.72 0.87  132.46 
1 0.85  132.48 
1 0.82  132.51 
1 0.92  132.54 
1 0.92  132.57 
1 0.9  132.6 
1 0.91  132.62 
1 0.88  132.65 
1 0.89  132.68 
1 0.88  132.71 
1 0.89  132.73 
2 0.74 0.89  132.76 
2 0.74 0.91  132.81 
2 0.85 0.9  132.84 
2 0.86 0.89  132.87 
2 0.79 0.86  132.9 
2 0.77 0.86  132.93 
1 0.9  132.96 
2 0.74 0.89  132.99 
1 0.76  133.02 
1 0.78  133.04 
1 0.79  133.07 
1 0.78  133.1 
1 0.81  133.13 
0  133.15 
1 0.74  133.18 
0  133.2 
1 0.78  133.23 
0  133.25 
0  133.28 
1 0.79  133.31 
1 0.8  133.33 
0  133.36 
0  133.38 
0  133.41 
0  133.43 
0  133.46 
0  133.48 
0  133.51 
0  133.53 
0  133.55 
0  133.58 
1 0.76  133.61 
0  133.63 
1 0.77  133.66 
1 0.79  133.69 
1 0.81  133.71 
1 0.81  133.74 
1 0.75  133.77 
1 0.82  133.8 
1 0.84  133.83 
1 0.87  133.85 
1 0.83  133.88 
1 0.85  133.91 
1 0.88  133.94 
1 0.84  133.97 
1 0.83  133.99 
1 0.88  134.02 
1 0.86  134.05 
1 0.85  134.08 
1 0.89  134.11 
1 0.87  134.13 
1 0.87  134.16 
1 0.86  134.19 
1 0.89  134.22 
1 0.9  134.25 
1 0.9  134.28 
1 0.91  134.3 
1 0.88  134.33 
1 0.89  134.36 
1 0.93  134.39 
1 0.92  134.41 
1 0.92  134.45 
1 0.93  134.47 
1 0.9  134.5 
1 0.91  134.53 
1 0.86  134.56 
1 0.87  134.59 
1 0.88  134.62 
1 0.87  134.64 
1 0.83  134.67 
1 0.85  134.7 
1 0.85  134.73 
1 0.86  134.75 
2 0.81 0.9  134.78 
2 0.82 0.9  134.81 
2 0.82 0.91  134.84 
2 0.83 0.9  134.87 
2 0.79 0.88  134.9 
2 0.79 0.86  134.93 
1 0.84  134.95 
1 0.81  134.98 
1 0.85  135.01 
1 0.88  135.04 
1 0.9  135.06 
1 0.91  135.09 
1 0.86  135.12 
1 0.87  135.15 
1 0.86  135.18 
1 0.86  135.2 
1 0.78  135.23 
0  135.26 
0  135.28 
0  135.31 
0  135.34 
0  135.36 
0  135.39 
0  135.41 
1 0.73  135.44 
1 0.78  135.47 
1 0.77  135.5 
1 0.73  135.53 
0  135.55 
1 0.72  135.58 
1 0.71  135.61 
0  135.63 
1 0.71  135.66 
2 0.71 0.71  135.69 
1 0.77  135.72 
1 0.8  135.75 
1 0.84  135.78 
2 0.79 0.85  135.81 
2 0.78 0.8  135.84 
2 0.77 0.78  135.86 
2 0.75 0.83  135.89 
2 0.75 0.83  135.92 
2 0.82 0.83  135.95 
2 0.77 0.84  135.98 
1 0.87  136.01 
1 0.87  136.03 
1 0.87  136.06 
1 0.87  136.09 
2 0.77 0.83  136.12 
1 0.78  136.15 
0  136.17 
1 0.71  136.2 
1 0.78  136.23 
1 0.8  136.26 
1 0.82  136.29 
1 0.8  136.32 
1 0.73  136.35 
1 0.71  136.37 
2 0.77 0.8  136.4 
1 0.86  136.44 
2 0.72 0.84  136.46 
2 0.71 0.79  136.49 
2 0.71 0.79  136.52 
1 0.79  136.55 
0  136.57 
0  136.6 
0  136.62 
0  136.65 
1 0.73  136.67 
1 0.72  136.7 
1 0.79  136.73 
1 0.73  136.76 
1 0.78  136.79 
1 0.77  136.81 
0  136.84 
0  136.86 
0  136.89 
0  136.91 
0  136.94 
0  136.96 
0  136.98 
0  137.01 
1 0.74  137.04 
1 0.8  137.06 
1 0.85  137.09 
2 0.79 0.87  137.12 
3 0.77 0.8 0.84  137.15 
2 0.83 0.83  137.17 
2 0.82 0.86  137.2 
2 0.87 0.89  137.23 
2 0.88 0.89  137.26 
3 0.71 0.85 0.9  137.29 
3 0.81 0.85 0.88  137.32 
3 0.71 0.74 0.86  137.35 
2 0.83 0.87  137.38 
2 0.71 0.85  137.4 
1 0.83  137.43 
1 0.8  137.46 
1 0.84  137.49 
2 0.8 0.86  137.52 
2 0.86 0.86  137.55 
2 0.86 0.89  137.57 
2 0.78 0.89  137.6 
2 0.74 0.88  137.63 
1 0.89  137.66 
1 0.88  137.69 
1 0.88  137.72 
1 0.88  137.75 
1 0.88  137.77 
0  137.8 
0  137.82 
0  137.85 
0  137.87 
0  137.89 
0  137.92 
0  137.94 
0  137.97 
0  137.99 
0  138.02 
0  138.04 
0  138.06 
0  138.09 
0  138.11 
0  138.14 
0  138.16 
0  138.18 
0  138.21 
0  138.23 
1 0.72  138.26 
0  138.28 
0  138.31 
1 0.71  138.34 
1 0.82  138.36 
1 0.85  138.39 
1 0.86  138.42 
1 0.86  138.45 
1 0.87  138.48 
1 0.85  138.5 
1 0.86  138.53 
1 0.87  138.56 
1 0.87  138.59 
1 0.84  138.61 
1 0.85  138.64 
1 0.85  138.67 
1 0.83  138.7 
1 0.81  138.72 
1 0.8  138.75 
1 0.82  138.78 
1 0.82  138.81 
1 0.83  138.83 
1 0.82  138.86 
1 0.8  138.89 
1 0.75  138.92 
1 0.83  138.95 
1 0.83  138.98 
1 0.82  139.0 
2 0.75 0.8  139.03 
2 0.76 0.77  139.06 
2 0.74 0.76  139.09 
1 0.78  139.12 
1 0.81  139.14 
1 0.86  139.17 
1 0.87  139.2 
1 0.89  139.23 
1 0.87  139.25 
2 0.77 0.85  139.28 
2 0.75 0.85  139.31 
2 0.74 0.88  139.34 
2 0.74 0.87  139.37 
1 0.86  139.39 
1 0.84  139.42 
1 0.82  139.45 
1 0.75  139.48 
1 0.7  139.51 
1 0.77  139.53 
1 0.81  139.56 
2 0.78 0.85  139.59 
1 0.79  139.62 
1 0.77  139.64 
0  139.67 
1 0.76  139.69 
2 0.71 0.81  139.72 
2 0.7 0.77  139.75 
0  139.78 
0  139.8 
0  139.83 
0  139.85 
0  139.87 
0  139.9 
0  139.92 
1 0.86  139.95 
1 0.82  139.98 
1 0.74  140.0 
1 0.82  140.03 
0  140.06 
0  140.08 
0  140.1 
0  140.13 
0  140.15 
0  140.18 
0  140.2 
0  140.22 
0  140.25 
0  140.27 
0  140.3 
0  140.32 
0  140.35 
0  140.37 
0  140.4 
0  140.42 
0  140.44 
0  140.47 
0  140.49 
0  140.52 
0  140.54 
0  140.57 
0  140.59 
0  140.61 
0  140.64 
0  140.66 
0  140.69 
1 0.7  140.71 
0  140.74 
0  140.76 
0  140.79 
0  140.81 
0  140.83 
0  140.86 
0  140.88 
0  140.91 
0  140.93 
0  140.96 
0  140.98 
0  141.0 
0  141.03 
0  141.05 
0  141.08 
0  141.1 
1 0.74  141.13 
1 0.74  141.16 
0  141.18 
1 0.73  141.21 
1 0.71  141.24 
1 0.77  141.27 
1 0.78  141.29 
0  141.32 
0  141.34 
0  141.37 
0  141.39 
1 0.82  141.42 
1 0.85  141.45 
1 0.82  141.48 
1 0.77  141.51 
1 0.84  141.53 
1 0.83  141.56 
2 0.72 0.81  141.59 
2 0.75 0.78  141.62 
1 0.84  141.65 
1 0.83  141.68 
1 0.83  141.71 
1 0.83  141.73 
1 0.86  141.76 
1 0.8  141.79 
1 0.73  141.82 
1 0.71  141.84 
1 0.82  141.87 
1 0.86  141.9 
1 0.86  141.93 
1 0.82  141.96 
1 0.89  141.99 
1 0.9  142.02 
1 0.88  142.04 
1 0.87  142.07 
1 0.82  142.1 
1 0.84  142.13 
1 0.74  142.16 
0  142.18 
0  142.2 
0  142.23 
0  142.25 
0  142.28 
0  142.3 
0  142.32 
0  142.35 
0  142.37 
0  142.4 
0  142.42 
0  142.45 
0  142.47 
0  142.49 
0  142.52 
1 0.77  142.55 
1 0.78  142.57 
1 0.79  142.6 
0  142.62 
1 0.78  142.65 
1 0.75  142.68 
1 0.77  142.71 
1 0.77  142.74 
1 0.71  142.76 
1 0.81  142.79 
1 0.76  142.82 
1 0.73  142.85 
0  142.87 
1 0.73  142.9 
0  142.92 
0  142.95 
0  142.97 
0  143.0 
0  143.02 
0  143.05 
0  143.07 
0  143.09 
1 0.8  143.12 
0  143.15 
1 0.71  143.17 
1 0.73  143.2 
0  143.22 
0  143.25 
0  143.27 
1 0.73  143.3 
0  143.33 
0  143.35 
0  143.38 
0  143.4 
0  143.42 
0  143.45 
0  143.47 
0  143.5 
0  143.52 
0  143.55 
0  143.57 
0  143.59 
0  143.62 
0  143.64 
0  143.67 
0  143.69 
0  143.71 
0  143.74 
0  143.76 
0  143.79 
0  143.81 
1 0.72  143.84 
1 0.75  143.86 
0  143.89 
0  143.91 
1 0.71  143.94 
0  143.97 
0  143.99 
1 0.76  144.02 
1 0.85  144.05 
1 0.77  144.07 
1 0.77  144.1 
0  144.13 
1 0.74  144.15 
1 0.7  144.18 
1 0.82  144.21 
1 0.83  144.24 
1 0.81  144.27 
1 0.84  144.29 
1 0.8  144.32 
0  144.34 
1 0.75  144.37 
1 0.8  144.4 
1 0.8  144.43 
1 0.81  144.46 
1 0.85  144.48 
1 0.85  144.51 
1 0.87  144.54 
1 0.86  144.57 
0  144.59 
0  144.62 
0  144.64 
0  144.66 
0  144.69 
0  144.71 
0  144.74 
0  144.76 
0  144.78 
0  144.81 
0  144.83 
0  144.86 
0  144.88 
0  144.9 
0  144.93 
0  144.95 
0  144.98 
0  145.0 
0  145.03 
0  145.05 
0  145.08 
0  145.1 
0  145.13 
0  145.15 
0  145.17 
0  145.2 
0  145.23 
0  145.26 
0  145.28 
0  145.31 
0  145.33 
0  145.35 
0  145.38 
0  145.4 
0  145.43 
0  145.45 
1 0.73  145.48 
0  145.51 
0  145.53 
0  145.55 
0  145.58 
0  145.6 
0  145.63 
0  145.65 
1 0.71  145.68 
0  145.7 
1 0.79  145.73 
1 0.79  145.76 
1 0.87  145.79 
1 0.87  145.81 
1 0.86  145.84 
1 0.81  145.87 
0  145.89 
0  145.92 
0  145.94 
0  145.97 
0  145.99 
0  146.01 
0  146.04 
0  146.06 
0  146.09 
0  146.11 
0  146.13 
0  146.16 
0  146.18 
0  146.21 
0  146.23 
0  146.26 
1 0.85  146.28 
0  146.31 
0  146.33 
0  146.36 
0  146.38 
0  146.41 
1 0.74  146.44 
1 0.78  146.46 
0  146.49 
1 0.74  146.52 
1 0.73  146.54 
0  146.57 
1 0.77  146.6 
1 0.75  146.63 
0  146.65 
0  146.67 
0  146.7 
0  146.72 
0  146.75 
0  146.77 
0  146.8 
0  146.82 
1 0.74  146.85 
0  146.87 
0  146.9 
1 0.73  146.93 
1 0.73  146.95 
0  146.98 
0  147.0 
1 0.76  147.03 
1 0.8  147.06 
1 0.86  147.09 
1 0.87  147.11 
1 0.87  147.14 
1 0.87  147.17 
1 0.79  147.2 
0  147.22 
0  147.24 
0  147.27 
0  147.29 
0  147.32 
0  147.34 
0  147.37 
1 0.78  147.39 
1 0.76  147.42 
1 0.8  147.45 
1 0.81  147.48 
2 0.73 0.83  147.51 
1 0.85  147.53 
1 0.78  147.56 
1 0.72  147.59 
0  147.61 
0  147.64 
0  147.66 
0  147.69 
0  147.71 
0  147.74 
1 0.76  147.76 
1 0.73  147.79 
1 0.75  147.82 
1 0.8  147.85 
1 0.84  147.87 
1 0.83  147.9 
1 0.81  147.93 
1 0.82  147.96 
1 0.83  147.99 
1 0.82  148.01 
1 0.79  148.04 
1 0.77  148.07 
1 0.79  148.1 
2 0.79 0.8  148.13 
2 0.77 0.83  148.16 
2 0.71 0.84  148.18 
1 0.83  148.21 
1 0.75  148.24 
1 0.71  148.27 
0  148.29 
0  148.32 
0  148.34 
0  148.36 
0  148.39 
0  148.41 
1 0.74  148.44 
1 0.81  148.47 
1 0.73  148.5 
0  148.52 
0  148.55 
0  148.57 
0  148.59 
0  148.62 
0  148.64 
1 0.7  148.67 
1 0.77  148.7 
0  148.72 
0  148.74 
0  148.77 
0  148.79 
0  148.82 
0  148.84 
0  148.87 
0  148.89 
0  148.91 
0  148.94 
0  148.96 
0  148.99 
0  149.01 
0  149.04 
0  149.06 
0  149.09 
0  149.11 
0  149.13 
0  149.16 
0  149.18 
0  149.21 
0  149.23 
0  149.26 
0  149.28 
1 0.77  149.31 
1 0.86  149.34 
0  149.36 
0  149.38 
0  149.41 
0  149.43 
0  149.46 
0  149.49 
0  149.51 
0  149.53 
0  149.56 
0  149.58 
0  149.61 
0  149.63 
0  149.66 
0  149.68 
0  149.71 
0  149.73 
1 0.86  149.76 
1 0.88  149.79 
1 0.88  149.82 
1 0.88  149.84 
1 0.86  149.87 
1 0.86  149.9 
1 0.87  149.93 
1 0.87  149.96 
1 0.87  149.98 
1 0.88  150.01 
1 0.88  150.04 
1 0.88  150.07 
1 0.89  150.1 
1 0.88  150.12 
1 0.89  150.15 
1 0.89  150.18 
2 0.71 0.91  150.21 
2 0.7 0.91  150.24 
1 0.92  150.27 
1 0.92  150.29 
2 0.71 0.92  150.32 
2 0.76 0.92  150.35 
2 0.83 0.92  150.38 
2 0.85 0.92  150.41 
2 0.85 0.92  150.44 
2 0.82 0.91  150.47 
2 0.76 0.9  150.5 
2 0.73 0.9  150.52 
2 0.71 0.9  150.55 
2 0.71 0.9  150.58 
1 0.92  150.61 
1 0.92  150.64 
1 0.92  150.66 
2 0.71 0.91  150.69 
1 0.91  150.72 
1 0.9  150.75 
1 0.83  150.78 
1 0.79  150.8 
1 0.8  150.83 
1 0.75  150.86 
1 0.76  150.89 
0  150.91 
0  150.94 
0  150.96 
0  150.98 
0  151.01 
0  151.03 
0  151.06 
0  151.08 
0  151.1 
0  151.13 
0  151.15 
0  151.18 
0  151.2 
0  151.22 
0  151.25 
0  151.27 
0  151.3 
0  151.32 
0  151.35 
0  151.37 
0  151.39 
0  151.42 
0  151.44 
0  151.47 
0  151.49 
0  151.52 
0  151.54 
0  151.56 
0  151.59 
0  151.61 
0  151.64 
0  151.66 
0  151.68 
0  151.71 
0  151.73 
0  151.76 
0  151.78 
1 0.72  151.81 
0  151.83 
0  151.86 
1 0.7  151.88 
0  151.91 
0  151.94 
0  151.96 
0  151.99 
1 0.72  152.02 
1 0.81  152.04 
1 0.82  152.07 
1 0.85  152.1 
1 0.88  152.13 
1 0.89  152.15 
1 0.88  152.18 
1 0.9  152.21 
1 0.9  152.24 
1 0.91  152.27 
1 0.92  152.29 
1 0.91  152.32 
1 0.88  152.35 
1 0.88  152.38 
1 0.89  152.4 
1 0.89  152.43 
1 0.84  152.46 
1 0.86  152.49 
1 0.86  152.52 
1 0.83  152.54 
1 0.74  152.57 
1 0.79  152.6 
1 0.79  152.63 
1 0.76  152.66 
1 0.77  152.68 
1 0.7  152.71 
1 0.78  152.74 
1 0.82  152.77 
1 0.83  152.8 
1 0.83  152.82 
1 0.83  152.85 
1 0.81  152.88 
1 0.8  152.91 
1 0.77  152.94 
1 0.78  152.96 
1 0.78  152.99 
1 0.78  153.02 
1 0.79  153.05 
0  153.07 
0  153.1 
0  153.12 
0  153.15 
0  153.17 
0  153.19 
0  153.22 
0  153.24 
0  153.27 
0  153.29 
0  153.32 
0  153.34 
0  153.36 
0  153.39 
0  153.41 
0  153.44 
0  153.48 
0  153.51 
0  153.54 
0  153.56 
0  153.59 
0  153.61 
0  153.64 
1 0.73  153.66 
0  153.69 
0  153.71 
0  153.74 
0  153.76 
0  153.78 
0  153.81 
0  153.83 
0  153.86 
0  153.88 
0  153.91 
0  153.93 
0  153.96 
0  153.98 
0  154.0 
0  154.03 
0  154.05 
0  154.08 
0  154.1 
0  154.13 
0  154.15 
0  154.18 
0  154.2 
0  154.22 
0  154.25 
0  154.27 
0  154.3 
0  154.32 
0  154.34 
0  154.39 
0  154.42 
0  154.45 
0  154.47 
0  154.5 
0  154.52 
0  154.54 
0  154.57 
0  154.59 
0  154.62 
0  154.64 
0  154.66 
0  154.69 
0  154.71 
0  154.73 
0  154.76 
0  154.78 
0  154.81 
0  154.83 
0  154.85 
0  154.88 
0  154.9 
0  154.93 
0  154.95 
0  154.98 
0  155.0 
0  155.02 
0  155.05 
0  155.07 
0  155.1 
0  155.12 
0  155.14 
0  155.17 
0  155.19 
0  155.22 
0  155.24 
0  155.26 
0  155.29 
0  155.31 
0  155.34 
0  155.36 
0  155.38 
0  155.41 
0  155.43 
0  155.46 
0  155.48 
0  155.51 
0  155.53 
0  155.55 
0  155.59 
0  155.63 
0  155.65 
0  155.67 
0  155.7 
0  155.72 
0  155.75 
0  155.77 
0  155.8 
0  155.82 
0  155.84 
0  155.87 
0  155.89 
0  155.92 
0  155.94 
0  155.97 
0  155.99 
0  156.02 
0  156.04 
0  156.07 
0  156.09 
0  156.12 
1 0.76  156.14 
0  156.17 
0  156.19 
0  156.22 
1 0.71  156.25 
1 0.81  156.27 
1 0.78  156.3 
1 0.83  156.33 
1 0.85  156.36 
1 0.88  156.39 
1 0.88  156.42 
1 0.83  156.45 
1 0.85  156.48 
1 0.9  156.51 
1 0.91  156.54 
1 0.88  156.56 
1 0.87  156.59 
1 0.89  156.62 
1 0.87  156.65 
2 0.72 0.85  156.68 
1 0.76  156.7 
3 0.76 0.81 0.81  156.73 
2 0.77 0.87  156.76 
2 0.73 0.88  156.79 
2 0.79 0.85  156.82 
2 0.76 0.86  156.85 
1 0.85  156.88 
2 0.77 0.84  156.9 
2 0.81 0.83  156.93 
2 0.8 0.85  156.96 
2 0.76 0.81  156.99 
2 0.74 0.76  157.02 
1 0.71  157.05 
1 0.76  157.08 
1 0.74  157.1 
1 0.76  157.13 
1 0.74  157.16 
0  157.19 
0  157.21 
0  157.23 
1 0.74  157.26 
0  157.28 
1 0.82  157.31 
1 0.87  157.34 
1 0.75  157.37 
1 0.76  157.4 
1 0.78  157.43 
1 0.82  157.46 
1 0.85  157.48 
1 0.88  157.51 
1 0.79  157.54 
1 0.76  157.57 
1 0.89  157.6 
1 0.84  157.62 
1 0.79  157.65 
1 0.76  157.68 
0  157.7 
0  157.73 
1 0.72  157.76 
1 0.71  157.79 
1 0.76  157.81 
1 0.8  157.84 
1 0.75  157.87 
0  157.89 
0  157.92 
0  157.94 
1 0.72  157.97 
1 0.72  158.0 
0  158.02 
1 0.74  158.05 
1 0.73  158.08 
1 0.8  158.11 
1 0.73  158.14 
0  158.16 
1 0.72  158.19 
0  158.21 
0  158.24 
0  158.26 
0  158.29 
0  158.31 
1 0.72  158.34 
1 0.76  158.36 
1 0.8  158.39 
1 0.84  158.42 
1 0.87  158.45 
1 0.87  158.48 
1 0.87  158.5 
1 0.8  158.53 
1 0.71  158.56 
1 0.78  158.59 
1 0.81  158.61 
1 0.79  158.64 
1 0.74  158.67 
0  158.7 
0  158.72 
0  158.74 
0  158.77 
0  158.79 
0  158.81 
0  158.84 
0  158.86 
0  158.89 
0  158.91 
0  158.93 
0  158.96 
0  158.98 
0  159.01 
0  159.03 
0  159.05 
0  159.08 
0  159.1 
0  159.13 
0  159.15 
0  159.18 
0  159.2 
0  159.23 
0  159.25 
1 0.73  159.28 
1 0.74  159.31 
1 0.77  159.33 
1 0.72  159.36 
1 0.75  159.39 
1 0.8  159.42 
1 0.78  159.45 
1 0.83  159.47 
1 0.76  159.5 
1 0.86  159.53 
1 0.83  159.56 
1 0.89  159.58 
1 0.87  159.61 
1 0.9  159.64 
1 0.9  159.67 
1 0.87  159.7 
1 0.85  159.72 
1 0.8  159.75 
1 0.82  159.78 
1 0.82  159.81 
0  159.83 
0  159.86 
1 0.81  159.88 
1 0.84  159.91 
1 0.87  159.94 
1 0.85  159.97 
1 0.86  160.0 
1 0.86  160.02 
1 0.91  160.05 
1 0.93  160.08 
1 0.93  160.11 
1 0.92  160.13 
1 0.91  160.16 
1 0.92  160.19 
1 0.92  160.22 
1 0.91  160.24 
1 0.85  160.27 
1 0.86  160.3 
1 0.88  160.33 
1 0.89  160.36 
1 0.89  160.38 
1 0.9  160.41 
1 0.9  160.44 
1 0.91  160.47 
1 0.9  160.5 
1 0.89  160.53 
1 0.89  160.55 
1 0.9  160.58 
1 0.88  160.61 
1 0.87  160.64 
1 0.86  160.66 
1 0.85  160.69 
1 0.85  160.72 
1 0.86  160.75 
1 0.86  160.78 
1 0.87  160.81 
2 0.88 0.89  160.84 
2 0.86 0.9  160.86 
2 0.81 0.89  160.89 
2 0.81 0.89  160.92 
2 0.88 0.89  160.95 
2 0.87 0.89  160.98 
2 0.88 0.89  161.01 
2 0.89 0.92  161.04 
2 0.87 0.89  161.06 
1 0.83  161.09 
0  161.12 
0  161.14 
0  161.16 
0  161.19 
0  161.21 
0  161.24 
0  161.26 
0  161.29 
0  161.31 
0  161.34 
0  161.36 
0  161.38 
0  161.41 
0  161.43 
0  161.46 
0  161.48 
0  161.51 
0  161.53 
0  161.55 
0  161.58 
0  161.6 
0  161.63 
0  161.65 
0  161.67 
0  161.7 
0  161.72 
0  161.75 
0  161.77 
0  161.79 
0  161.82 
0  161.84 
0  161.87 
0  161.89 
0  161.91 
0  161.94 
0  161.96 
0  161.99 
0  162.01 
0  162.04 
0  162.06 
0  162.08 
0  162.11 
0  162.13 
0  162.16 
0  162.18 
0  162.2 
0  162.23 
0  162.25 
0  162.28 
0  162.3 
0  162.32 
0  162.35 
1 0.71  162.38 
0  162.4 
1 0.74  162.43 
0  162.45 
1 0.8  162.48 
1 0.79  162.51 
0  162.54 
1 0.75  162.56 
0  162.59 
0  162.61 
0  162.64 
0  162.66 
0  162.69 
1 0.76  162.72 
2 0.81 0.82  162.74 
2 0.84 0.89  162.77 
1 0.87  162.8 
2 0.71 0.82  162.83 
1 0.76  162.86 
1 0.71  162.88 
1 0.8  162.91 
1 0.87  162.94 
1 0.91  162.97 
1 0.9  163.0 
1 0.88  163.03 
1 0.88  163.05 
2 0.81 0.87  163.08 
1 0.85  163.11 
2 0.75 0.85  163.14 
2 0.73 0.8  163.17 
1 0.75  163.2 
1 0.78  163.22 
0  163.25 
2 0.71 0.78  163.28 
0  163.3 
0  163.33 
0  163.35 
0  163.37 
0  163.4 
1 0.74  163.43 
1 0.78  163.46 
0  163.48 
1 0.75  163.51 
0  163.53 
0  163.56 
0  163.58 
0  163.6 
0  163.63 
0  163.65 
0  163.68 
0  163.7 
1 0.72  163.73 
1 0.79  163.76 
0  163.78 
0  163.8 
1 0.7  163.83 
0  163.86 
0  163.88 
0  163.9 
0  163.93 
0  163.95 
0  163.98 
0  164.0 
0  164.03 
0  164.05 
0  164.07 
0  164.1 
0  164.12 
0  164.15 
0  164.17 
0  164.19 
0  164.22 
0  164.24 
0  164.27 
0  164.29 
0  164.32 
0  164.34 
0  164.36 
0  164.39 
0  164.41 
0  164.44 
0  164.46 
0  164.49 
0  164.51 
0  164.54 
0  164.56 
0  164.58 
0  164.61 
0  164.63 
0  164.66 
0  164.68 
0  164.71 
1 0.76  164.73 
0  164.76 
1 0.72  164.79 
1 0.74  164.81 
1 0.77  164.84 
0  164.86 
0  164.89 
0  164.91 
0  164.94 
0  164.96 
0  164.99 
0  165.01 
1 0.79  165.04 
1 0.71  165.07 
1 0.74  165.09 
1 0.77  165.12 
0  165.15 
0  165.17 
0  165.19 
0  165.22 
0  165.24 
0  165.27 
0  165.29 
0  165.31 
0  165.35 
0  165.38 
0  165.4 
0  165.43 
0  165.46 
0  165.48 
0  165.51 
0  165.53 
0  165.56 
1 0.72  165.59 
0  165.61 
0  165.63 
0  165.66 
0  165.68 
0  165.71 
0  165.73 
0  165.75 
0  165.78 
0  165.8 
0  165.83 
0  165.86 
0  165.88 
0  165.91 
0  165.93 
0  165.96 
0  165.99 
0  166.01 
0  166.03 
0  166.06 
0  166.08 
0  166.11 
1 0.8  166.13 
0  166.16 
0  166.18 
0  166.21 
0  166.23 
0  166.25 
0  166.28 
0  166.3 
0  166.33 
0  166.35 
1 0.74  166.38 
0  166.4 
0  166.43 
0  166.45 
0  166.48 
0  166.5 
0  166.52 
0  166.55 
0  166.57 
0  166.6 
0  166.62 
0  166.64 
0  166.67 
0  166.69 
1 0.76  166.72 
1 0.79  166.75 
1 0.8  166.78 
1 0.76  166.8 
1 0.79  166.83 
1 0.75  166.86 
1 0.79  166.89 
1 0.82  166.91 
1 0.84  166.94 
1 0.8  166.97 
0  166.99 
0  167.02 
1 0.71  167.05 
1 0.75  167.08 
1 0.76  167.11 
1 0.79  167.13 
1 0.84  167.16 
1 0.86  167.2 
1 0.87  167.23 
1 0.88  167.26 
1 0.88  167.29 
1 0.89  167.32 
1 0.89  167.35 
1 0.89  167.38 
1 0.89  167.41 
1 0.9  167.44 
1 0.89  167.47 
1 0.89  167.5 
1 0.87  167.53 
1 0.85  167.56 
1 0.82  167.59 
1 0.84  167.62 
1 0.84  167.65 
1 0.81  167.68 
1 0.79  167.71 
1 0.83  167.74 
1 0.87  167.77 
1 0.88  167.8 
1 0.88  167.83 
1 0.87  167.85 
1 0.84  167.88 
1 0.87  167.91 
1 0.89  167.95 
1 0.9  167.98 
1 0.9  168.01 
1 0.9  168.03 
1 0.9  168.07 
1 0.91  168.09 
1 0.92  168.12 
1 0.92  168.15 
1 0.92  168.18 
1 0.92  168.21 
1 0.93  168.24 
1 0.93  168.27 
1 0.92  168.3 
1 0.92  168.32 
1 0.92  168.35 
1 0.9  168.38 
1 0.9  168.41 
1 0.91  168.44 
1 0.91  168.47 
1 0.91  168.5 
2 0.72 0.91  168.53 
1 0.91  168.56 
1 0.9  168.59 
1 0.88  168.62 
1 0.89  168.65 
1 0.89  168.67 
1 0.88  168.7 
1 0.82  168.73 
1 0.82  168.76 
1 0.84  168.79 
1 0.83  168.82 
0  168.85 
0  168.88 
0  168.9 
1 0.79  168.93 
0  168.96 
0  168.98 
0  169.02 
0  169.05 
0  169.08 
0  169.1 
1 0.71  169.14 
0  169.16 
0  169.19 
0  169.22 
0  169.24 
1 0.75  169.27 
0  169.3 
0  169.32 
0  169.35 
0  169.37 
0  169.4 
0  169.42 
0  169.45 
0  169.48 
0  169.5 
0  169.53 
0  169.55 
0  169.58 
0  169.6 
0  169.63 
0  169.65 
0  169.68 
0  169.71 
0  169.73 
0  169.76 
0  169.78 
0  169.81 
0  169.83 
0  169.86 
0  169.88 
0  169.91 
0  169.94 
0  169.96 
0  169.99 
0  170.01 
0  170.04 
0  170.07 
0  170.09 
0  170.12 
0  170.14 
0  170.17 
0  170.19 
0  170.22 
0  170.24 
0  170.27 
0  170.29 
0  170.32 
0  170.34 
0  170.37 
0  170.39 
1 0.71  170.42 
0  170.45 
0  170.47 
1 0.75  170.5 
0  170.53 
0  170.55 
1 0.73  170.58 
1 0.78  170.61 
1 0.82  170.64 
1 0.84  170.66 
1 0.84  170.69 
1 0.86  170.72 
1 0.89  170.75 
1 0.9  170.78 
1 0.89  170.81 
1 0.9  170.84 
1 0.88  170.87 
1 0.88  170.9 
1 0.86  170.93 
1 0.87  170.96 
2 0.73 0.75  170.99 
1 0.8  171.02 
0  171.04 
0  171.07 
0  171.09 
1 0.78  171.12 
1 0.82  171.15 
0  171.17 
1 0.74  171.2 
0  171.23 
1 0.74  171.26 
1 0.71  171.29 
1 0.73  171.31 
0  171.34 
0  171.37 
0  171.39 
0  171.42 
0  171.44 
0  171.47 
0  171.49 
0  171.52 
0  171.54 
0  171.57 
1 0.7  171.6 
0  171.62 
0  171.65 
0  171.67 
0  171.7 
0  171.72 
0  171.75 
0  171.77 
0  171.79 
0  171.82 
0  171.84 
0  171.87 
0  171.89 
1 0.71  171.92 
1 0.9  171.95 
1 0.91  171.98 
1 0.91  172.01 
1 0.91  172.04 
1 0.91  172.07 
1 0.91  172.1 
1 0.91  172.13 
1 0.91  172.15 
1 0.91  172.18 
1 0.9  172.21 
1 0.89  172.24 
0  172.27 
0  172.29 
0  172.32 
0  172.34 
0  172.37 
0  172.39 
0  172.42 
0  172.44 
0  172.47 
0  172.49 
0  172.52 
0  172.54 
0  172.57 
0  172.59 
0  172.62 
0  172.64 
0  172.67 
0  172.69 
0  172.72 
0  172.75 
0  172.77 
1 0.84  172.8 
1 0.88  172.83 
1 0.89  172.86 
1 0.9  172.88 
1 0.9  172.91 
1 0.9  172.94 
1 0.9  172.97 
1 0.9  173.0 
1 0.9  173.03 
1 0.91  173.06 
1 0.91  173.09 
1 0.91  173.11 
1 0.92  173.14 
1 0.92  173.17 
1 0.92  173.2 
1 0.92  173.23 
1 0.92  173.26 
1 0.92  173.28 
1 0.92  173.31 
1 0.92  173.34 
1 0.92  173.37 
1 0.92  173.4 
1 0.92  173.43 
1 0.93  173.46 
1 0.93  173.48 
1 0.93  173.51 
1 0.93  173.54 
1 0.92  173.57 
1 0.91  173.6 
1 0.92  173.63 
1 0.91  173.66 
1 0.9  173.69 
1 0.89  173.71 
1 0.88  173.74 
1 0.89  173.77 
1 0.89  173.8 
1 0.89  173.83 
1 0.87  173.86 
1 0.86  173.89 
1 0.87  173.92 
1 0.88  173.95 
1 0.88  173.98 
1 0.88  174.01 
1 0.87  174.03 
1 0.81  174.06 
1 0.81  174.09 
1 0.75  174.12 
0  174.14 
0  174.17 
1 0.71  174.2 
0  174.22 
1 0.75  174.25 
0  174.28 
0  174.3 
0  174.33 
0  174.35 
1 0.73  174.38 
1 0.72  174.41 
0  174.44 
0  174.46 
0  174.49 
0  174.51 
0  174.54 
0  174.56 
1 0.71  174.59 
1 0.77  174.62 
1 0.75  174.65 
0  174.67 
0  174.7 
0  174.72 
0  174.75 
0  174.77 
0  174.8 
0  174.82 
0  174.85 
0  174.88 
0  174.9 
0  174.93 
0  174.95 
0  174.98 
1 0.77  175.01 
1 0.76  175.04 
1 0.75  175.06 
1 0.73  175.09 
0  175.12 
0  175.14 
0  175.17 
0  175.19 
0  175.21 
0  175.24 
0  175.27 
0  175.29 
0  175.32 
0  175.34 
0  175.37 
0  175.39 
0  175.42 
0  175.44 
0  175.47 
0  175.5 
0  175.52 
0  175.55 
0  175.57 
0  175.6 
0  175.62 
0  175.65 
0  175.67 
0  175.7 
0  175.73 
0  175.75 
0  175.78 
0  175.8 
0  175.83 
0  175.86 
0  175.88 
0  175.91 
0  175.93 
0  175.96 
0  175.98 
0  176.01 
0  176.03 
0  176.06 
0  176.09 
0  176.11 
0  176.14 
0  176.16 
0  176.19 
0  176.21 
0  176.24 
0  176.26 
0  176.29 
0  176.31 
0  176.34 
0  176.37 
0  176.39 
0  176.42 
0  176.44 
0  176.47 
0  176.5 
0  176.52 
0  176.55 
0  176.57 
0  176.6 
0  176.62 
0  176.65 
0  176.67 
0  176.7 
0  176.72 
0  176.75 
0  176.78 
0  176.8 
0  176.83 
0  176.85 
0  176.88 
0  176.9 
0  176.93 
0  176.96 
0  176.98 
0  177.01 
0  177.03 
0  177.06 
0  177.08 
0  177.11 
0  177.13 
0  177.16 
0  177.18 
0  177.21 
0  177.23 
0  177.26 
0  177.28 
0  177.31 
0  177.33 
0  177.36 
0  177.38 
0  177.41 
0  177.43 
0  177.46 
0  177.48 
0  177.51 
0  177.54 
0  177.56 
0  177.59 
0  177.61 
0  177.64 
0  177.66 
0  177.69 
0  177.71 
0  177.74 
0  177.76 
0  177.79 
0  177.81 
0  177.84 
0  177.86 
0  177.89 
0  177.91 
0  177.94 
0  177.97 
0  177.99 
1 0.71  178.02 
1 0.76  178.05 
0  178.07 
0  178.1 
0  178.12 
0  178.15 
0  178.17 
0  178.2 
0  178.22 
0  178.25 
0  178.27 
0  178.3 
0  178.32 
0  178.35 
0  178.37 
0  178.4 
0  178.42 
0  178.45 
0  178.47 
0  178.5 
0  178.52 
0  178.55 
0  178.57 
0  178.6 
0  178.62 
0  178.65 
0  178.67 
0  178.7 
0  178.72 
0  178.75 
0  178.77 
0  178.8 
1 0.7  178.82 
0  178.85 
0  178.87 
0  178.9 
0  178.93 
0  178.95 
0  178.98 
0  179.0 
0  179.03 
0  179.05 
0  179.08 
0  179.1 
0  179.13 
0  179.15 
0  179.17 
0  179.2 
0  179.22 
0  179.25 
0  179.27 
0  179.3 
0  179.33 
0  179.35 
0  179.38 
1 0.71  179.4 
1 0.75  179.43 
1 0.77  179.46 
1 0.81  179.49 
1 0.87  179.52 
1 0.86  179.55 
1 0.87  179.58 
1 0.87  179.61 
1 0.84  179.64 
1 0.84  179.66 
1 0.83  179.69 
1 0.84  179.72 
1 0.79  179.75 
1 0.78  179.78 
1 0.77  179.81 
1 0.81  179.84 
1 0.87  179.87 
2 0.71 0.84  179.9 
2 0.71 0.86  179.92 
3 0.74 0.75 0.85  179.96 
3 0.75 0.77 0.84  179.99 
2 0.75 0.84  180.02 
3 0.79 0.8 0.88  180.05 
3 0.84 0.85 0.89  180.08 
3 0.85 0.86 0.87  180.11 
3 0.79 0.84 0.88  180.14 
2 0.78 0.89  180.17 
2 0.85 0.89  180.2 
2 0.85 0.89  180.23 
2 0.77 0.89  180.26 
2 0.71 0.88  180.28 
3 0.72 0.76 0.9  180.31 
3 0.79 0.81 0.9  180.34 
2 0.82 0.85  180.38 
2 0.8 0.81  180.4 
2 0.71 0.86  180.43 
1 0.84  180.46 
1 0.83  180.49 
2 0.76 0.79  180.52 
1 0.8  180.55 
2 0.75 0.75  180.58 
1 0.77  180.61 
1 0.72  180.64 
1 0.77  180.67 
2 0.73 0.81  180.69 
2 0.76 0.79  180.72 
1 0.81  180.75 
1 0.74  180.78 
0  180.81 
0  180.83 
0  180.86 
1 0.72  180.88 
2 0.71 0.83  180.91 
1 0.77  180.94 
1 0.8  180.97 
2 0.71 0.82  181.0 
2 0.77 0.79  181.03 
2 0.77 0.82  181.06 
2 0.8 0.82  181.09 
2 0.78 0.85  181.12 
2 0.81 0.87  181.15 
2 0.82 0.88  181.18 
2 0.84 0.86  181.21 
2 0.84 0.88  181.24 
2 0.85 0.89  181.27 
2 0.85 0.89  181.3 
2 0.83 0.87  181.33 
2 0.79 0.86  181.36 
1 0.85  181.39 
1 0.82  181.42 
1 0.8  181.45 
1 0.73  181.48 
0  181.51 
0  181.54 
2 0.7 0.73  181.57 
1 0.7  181.6 
1 0.8  181.63 
2 0.71 0.8  181.66 
1 0.83  181.68 
1 0.85  181.71 
2 0.79 0.83  181.74 
2 0.79 0.86  181.77 
2 0.81 0.88  181.8 
2 0.82 0.88  181.83 
2 0.84 0.88  181.86 
2 0.81 0.92  181.89 
2 0.78 0.94  181.92 
2 0.79 0.93  181.95 
2 0.8 0.94  181.98 
3 0.73 0.81 0.93  182.01 
3 0.74 0.84 0.92  182.04 
3 0.74 0.82 0.91  182.07 
2 0.75 0.89  182.1 
1 0.89  182.13 
1 0.88  182.17 
1 0.86  182.2 
2 0.8 0.88  182.23 
2 0.82 0.88  182.25 
2 0.85 0.89  182.28 
2 0.86 0.91  182.31 
2 0.86 0.91  182.34 
2 0.86 0.87  182.37 
2 0.81 0.88  182.4 
2 0.85 0.91  182.42 
2 0.77 0.93  182.45 
1 0.92  182.48 
2 0.71 0.91  182.51 
2 0.73 0.88  182.54 
1 0.79  182.56 
2 0.74 0.84  182.59 
2 0.74 0.83  182.62 
2 0.74 0.81  182.65 
1 0.75  182.68 
1 0.77  182.71 
1 0.8  182.73 
1 0.82  182.76 
1 0.82  182.79 
1 0.81  182.82 
1 0.77  182.84 
1 0.75  182.87 
0  182.9 
1 0.8  182.92 
0  182.95 
0  182.97 
0  183.0 
0  183.02 
0  183.05 
0  183.07 
0  183.1 
0  183.12 
0  183.14 
0  183.17 
0  183.19 
0  183.22 
1 0.76  183.24 
1 0.73  183.27 
1 0.75  183.3 
0  183.32 
0  183.35 
0  183.37 
0  183.4 
0  183.42 
0  183.45 
0  183.47 
0  183.49 
0  183.52 
0  183.54 
0  183.57 
0  183.59 
0  183.61 
0  183.64 
0  183.66 
0  183.69 
0  183.71 
0  183.73 
1 0.73  183.76 
0  183.79 
0  183.81 
0  183.83 
0  183.86 
0  183.88 
0  183.91 
0  183.93 
0  183.96 
0  183.98 
1 0.79  184.01 
1 0.75  184.04 
1 0.77  184.07 
1 0.76  184.09 
1 0.82  184.12 
1 0.81  184.15 
1 0.84  184.18 
0  184.2 
0  184.23 
0  184.25 
0  184.28 
0  184.3 
0  184.33 
0  184.35 
0  184.38 
0  184.4 
0  184.42 
0  184.45 
0  184.48 
1 0.75  184.5 
0  184.53 
0  184.55 
0  184.58 
0  184.6 
0  184.63 
0  184.65 
0  184.68 
0  184.7 
0  184.72 
0  184.75 
0  184.77 
0  184.8 
0  184.82 
0  184.85 
0  184.87 
0  184.9 
0  184.92 
0  184.95 
0  184.97 
0  185.0 
0  185.02 
0  185.05 
0  185.07 
0  185.09 
0  185.12 
0  185.14 
0  185.17 
0  185.19 
0  185.21 
0  185.24 
0  185.26 
0  185.28 
0  185.31 
0  185.33 
0  185.36 
0  185.38 
0  185.4 
0  185.43 
0  185.45 
0  185.48 
0  185.5 
0  185.53 
0  185.55 
0  185.57 
0  185.6 
0  185.62 
0  185.65 
0  185.67 
0  185.7 
0  185.72 
0  185.75 
0  185.77 
0  185.8 
0  185.82 
0  185.85 
0  185.87 
0  185.9 
0  185.92 
0  185.94 
0  185.97 
0  185.99 
0  186.02 
0  186.04 
1 0.77  186.07 
1 0.75  186.1 
1 0.79  186.13 
0  186.15 
0  186.18 
0  186.2 
0  186.23 
0  186.25 
0  186.28 
0  186.3 
0  186.32 
0  186.35 
0  186.37 
1 0.76  186.4 
1 0.74  186.43 
0  186.46 
0  186.49 
2 0.79 0.8  186.51 
2 0.78 0.87  186.54 
3 0.76 0.78 0.9  186.57 
3 0.73 0.84 0.88  186.6 
3 0.73 0.85 0.87  186.63 
3 0.79 0.84 0.87  186.66 
3 0.82 0.84 0.88  186.69 
3 0.84 0.84 0.88  186.72 
3 0.84 0.88 0.89  186.75 
3 0.85 0.86 0.87  186.78 
3 0.83 0.84 0.85  186.81 
3 0.83 0.84 0.85  186.83 
3 0.78 0.82 0.83  186.86 
3 0.74 0.8 0.8  186.89 
3 0.76 0.78 0.8  186.92 
2 0.72 0.8  186.95 
2 0.77 0.86  186.98 
2 0.75 0.88  187.01 
2 0.75 0.84  187.04 
2 0.75 0.77  187.06 
1 0.77  187.09 
1 0.8  187.12 
1 0.77  187.15 
1 0.79  187.18 
1 0.84  187.2 
1 0.86  187.23 
1 0.85  187.26 
1 0.78  187.29 
1 0.78  187.31 
1 0.81  187.34 
0  187.37 
1 0.74  187.39 
1 0.77  187.42 
1 0.84  187.45 
1 0.83  187.48 
1 0.79  187.51 
0  187.53 
0  187.56 
1 0.81  187.58 
0  187.61 
2 0.78 0.8  187.64 
1 0.86  187.66 
1 0.75  187.69 
0  187.72 
0  187.74 
0  187.76 
0  187.79 
0  187.81 
1 0.81  187.84 
0  187.86 
0  187.89 
0  187.91 
0  187.94 
0  187.96 
0  187.99 
0  188.01 
0  188.04 
0  188.06 
0  188.09 
0  188.11 
0  188.13 
0  188.16 
0  188.18 
0  188.21 
1 0.76  188.24 
0  188.26 
1 0.74  188.29 
1 0.86  188.32 
1 0.9  188.35 
1 0.89  188.37 
1 0.86  188.4 
1 0.81  188.43 
1 0.86  188.46 
1 0.88  188.49 
1 0.88  188.52 
1 0.89  188.54 
1 0.88  188.57 
1 0.87  188.6 
1 0.79  188.63 
1 0.74  188.65 
0  188.68 
1 0.79  188.7 
1 0.78  188.73 
1 0.87  188.76 
1 0.87  188.79 
1 0.9  188.82 
1 0.9  188.84 
2 0.77 0.87  188.87 
2 0.73 0.85  188.9 
1 0.84  188.93 
1 0.82  188.96 
1 0.84  188.99 
1 0.85  189.01 
1 0.88  189.04 
1 0.89  189.07 
1 0.9  189.1 
2 0.78 0.9  189.13 
2 0.74 0.89  189.16 
1 0.84  189.18 
1 0.83  189.21 
1 0.89  189.24 
1 0.89  189.27 
1 0.9  189.29 
1 0.89  189.32 
1 0.87  189.35 
1 0.86  189.38 
1 0.86  189.4 
1 0.86  189.43 
1 0.86  189.46 
1 0.86  189.49 
1 0.87  189.52 
1 0.87  189.54 
1 0.88  189.57 
1 0.88  189.6 
1 0.88  189.63 
1 0.87  189.65 
1 0.87  189.68 
1 0.85  189.71 
1 0.85  189.74 
1 0.85  189.76 
1 0.87  189.79 
1 0.87  189.82 
1 0.87  189.85 
1 0.88  189.88 
1 0.88  189.9 
1 0.87  189.93 
1 0.86  189.96 
1 0.86  189.99 
1 0.86  190.02 
1 0.82  190.04 
1 0.82  190.07 
1 0.79  190.1 
1 0.81  190.13 
1 0.78  190.15 
0  190.18 
0  190.2 
1 0.8  190.23 
1 0.83  190.26 
1 0.85  190.29 
1 0.8  190.32 
0  190.34 
0  190.36 
0  190.39 
0  190.41 
0  190.44 
0  190.46 
0  190.49 
0  190.51 
0  190.54 
0  190.56 
0  190.59 
1 0.71  190.61 
1 0.8  190.64 
1 0.82  190.67 
1 0.79  190.7 
1 0.82  190.72 
1 0.84  190.75 
1 0.84  190.78 
2 0.81 0.83  190.81 
2 0.71 0.87  190.84 
1 0.84  190.86 
0  190.89 
0  190.91 
0  190.94 
0  190.96 
0  190.99 
1 0.83  191.02 
1 0.87  191.04 
1 0.84  191.07 
0  191.1 
1 0.74  191.12 
1 0.7  191.15 
1 0.76  191.18 
1 0.73  191.21 
1 0.77  191.24 
1 0.83  191.26 
1 0.82  191.29 
0  191.32 
0  191.34 
0  191.36 
0  191.39 
1 0.79  191.42 
0  191.44 
0  191.47 
0  191.49 
0  191.51 
0  191.54 
1 0.76  191.57 
1 0.86  191.59 
1 0.86  191.62 
1 0.84  191.65 
1 0.73  191.68 
0  191.7 
0  191.73 
0  191.75 
0  191.78 
0  191.81 
0  191.83 
0  191.86 
0  191.88 
0  191.91 
0  191.93 
0  191.96 
1 0.74  191.98 
0  192.01 
0  192.03 
0  192.06 
0  192.08 
0  192.11 
0  192.13 
0  192.15 
0  192.18 
0  192.2 
0  192.23 
1 0.73  192.25 
1 0.74  192.28 
1 0.84  192.31 
1 0.75  192.34 
0  192.36 
0  192.39 
0  192.41 
0  192.44 
0  192.46 
0  192.49 
0  192.51 
0  192.53 
0  192.56 
0  192.58 
0  192.61 
0  192.63 
0  192.65 
0  192.68 
0  192.7 
0  192.73 
0  192.75 
0  192.77 
0  192.8 
0  192.82 
0  192.85 
0  192.87 
0  192.9 
0  192.92 
0  192.94 
0  192.97 
0  192.99 
0  193.02 
1 0.78  193.04 
0  193.07 
0  193.09 
0  193.12 
0  193.14 
0  193.17 
0  193.19 
0  193.21 
0  193.24 
0  193.27 
0  193.29 
0  193.31 
0  193.34 
0  193.36 
1 0.72  193.39 
1 0.72  193.42 
0  193.44 
1 0.75  193.47 
1 0.76  193.5 
0  193.52 
1 0.74  193.55 
2 0.73 0.76  193.58 
1 0.81  193.61 
1 0.78  193.64 
1 0.81  193.67 
1 0.83  193.69 
1 0.82  193.72 
1 0.79  193.75 
2 0.77 0.79  193.78 
2 0.74 0.79  193.81 
3 0.7 0.72 0.79  193.83 
2 0.79 0.79  193.86 
2 0.74 0.79  193.89 
1 0.81  193.92 
