{
        "options": {
                "basedir": "/home/jetson-nano/Documents/shark/countingshark/record-rtsp/nvr/",
                "openrtsp": "/usr/local/bin/openRTSP",
                "interval": 61,
                "runtime": 60
        },
        "cameras": [
                {
                        "name": "camera19.1",
                        "url": "rtsp://192.168.1.19:554/1/h264major",
                        "width": 1920,
                        "height": 1080
                },
                {
                        "name": "camera19.2",
                        "url": "rtsp://192.168.1.19:554/1/h264major",
                        "width": 1920,
                        "height": 1080
                },
                {
                        "name": "camera20.1",
                        "url": "rtsp://192.168.1.20:554/1/h264major",
                        "width": 1920,
                        "height": 1080
                },
                {
                        "name": "camera20.2",
                        "url": "rtsp://192.168.1.20:554/1/h264major",
                        "width": 1920,
                        "height": 1080
                }


        ]
}
