0  0.01 1
0  0.0 1
0  0.21 2
0  0.32 3
0  0.42 4
0  0.54 5
0  0.65 6
0  0.8 7
0  0.92 8
0  1.05 9
0  1.16 10
0  1.28 11
0  1.39 12
0  1.51 13
0  1.65 14
0  1.78 15
0  1.91 16
0  2.03 17
0  2.17 18
0  2.29 19
0  2.39 20
0  2.49 21
0  2.62 22
0  2.74 23
0  2.92 24
0  3.13 25
0  3.27 26
0  3.42 27
0  3.53 28
0  3.65 29
0  3.75 30
0  3.86 31
0  3.98 32
0  4.2 33
0  4.3 34
0  4.4 35
0  4.5 36
0  4.62 37
0  4.72 38
0  4.84 39
0  4.95 40
0  5.07 41
0  5.21 42
0  5.35 43
0  5.48 44
0  5.62 45
0  5.77 46
0  5.9 47
0  6.03 48
0  6.13 49
0  6.24 50
0  6.37 51
0  6.51 52
0  6.62 53
0  6.78 54
0  6.88 55
0  7.03 56
0  7.14 57
0  7.27 58
0  7.4 59
0  7.53 60
0  7.63 61
0  7.74 62
0  7.84 63
0  7.97 64
0  8.1 65
0  8.24 66
0  8.34 67
0  8.45 68
0  8.59 69
0  8.71 70
0  8.82 71
0  8.92 72
0  9.03 73
0  9.12 74
0  9.22 75
0  9.33 76
0  9.44 77
0  9.55 78
0  9.66 79
0  9.75 80
0  9.86 81
0  9.99 82
0  10.13 83
0  10.25 84
0  10.38 85
0  10.51 86
0  10.62 87
0  10.72 88
0  10.85 89
0  10.95 90
0  11.09 91
0  11.19 92
0  11.35 93
0  11.46 94
0  11.59 95
0  11.75 96
0  11.86 97
0  11.97 98
0  12.11 99
0  12.23 100
0  12.34 101
0  12.47 102
0  12.56 103
0  12.67 104
0  12.78 105
0  12.89 106
0  12.99 107
0  13.09 108
0  13.18 109
1 0.52  13.49 110
1 0.57  13.61 111
1 0.57  13.76 112
1 0.72  13.88 113
1 0.55  14.03 114
0  14.18 115
0  14.34 116
1 0.54  14.49 117
0  14.62 118
0  14.77 119
0  14.93 120
0  15.1 121
0  15.23 122
0  15.36 123
0  15.48 124
0  15.61 125
0  15.75 126
0  15.86 127
0  15.98 128
0  16.13 129
0  16.23 130
0  16.32 131
1 0.68  16.44 132
0  16.56 133
0  16.67 134
1 0.71  16.78 135
1 0.71  16.9 136
0  16.99 137
0  17.14 138
0  17.25 139
0  17.37 140
0  17.5 141
1 0.57  17.66 142
1 0.57  17.87 143
0  18.02 144
0  18.13 145
0  18.26 146
0  18.37 147
0  18.48 148
0  18.6 149
0  18.74 150
0  18.88 151
0  19.01 152
0  19.15 153
0  19.25 154
0  19.38 155
1 0.58  19.5 156
0  19.62 157
0  19.77 158
0  19.88 159
0  19.98 160
0  20.11 161
0  20.25 162
0  20.38 163
0  20.52 164
0  20.65 165
0  20.77 166
0  20.87 167
0  20.96 168
0  21.08 169
0  21.17 170
0  21.32 171
0  21.44 172
0  21.55 173
0  21.68 174
0  21.81 175
0  22.0 176
0  22.11 177
1 0.52  22.23 178
1 0.52  22.35 179
0  22.44 180
0  22.55 181
0  22.65 182
0  22.75 183
0  22.85 184
0  22.95 185
0  23.04 186
0  23.12 187
0  23.22 188
0  23.32 189
0  23.46 190
0  23.59 191
0  23.71 192
0  23.82 193
0  23.97 194
0  24.1 195
1 0.66  24.22 196
1 0.66  24.37 197
1 0.58  24.53 198
0  24.64 199
1 0.52  24.78 200
1 0.52  24.91 201
0  25.01 202
0  25.16 203
0  25.26 204
0  25.42 205
0  25.55 206
0  25.66 207
0  25.78 208
0  25.92 209
1 0.51  26.01 210
1 0.51  26.15 211
1 0.72  26.29 212
1 0.67  26.43 213
1 0.67  26.55 214
0  26.68 215
1 0.61  26.8 216
1 0.61  26.95 217
1 0.61  27.07 218
1 0.58  27.2 219
1 0.58  27.32 220
0  27.4 221
0  27.54 222
0  27.62 223
0  27.74 224
0  27.84 225
0  27.97 226
0  28.08 227
0  28.19 228
0  28.33 229
0  28.46 230
0  28.6 231
0  28.73 232
0  28.83 233
1 0.57  28.98 234
1 0.57  29.11 235
1 0.6  29.22 236
1 0.6  29.36 237
0  29.47 238
0  29.57 239
0  29.71 240
0  29.8 241
0  29.93 242
0  30.02 243
0  30.16 244
0  30.28 245
1 0.57  30.41 246
1 0.57  30.56 247
0  30.68 248
0  30.78 249
0  30.9 250
0  30.99 251
0  31.1 252
0  31.18 253
0  31.28 254
0  31.39 255
0  31.49 256
0  31.59 257
0  31.69 258
0  31.78 259
0  31.89 260
0  31.98 261
0  32.06 262
0  32.16 263
0  32.26 264
0  32.33 265
0  32.43 266
0  32.56 267
0  32.66 268
0  32.78 269
0  32.9 270
0  33.0 271
0  33.14 272
0  33.22 273
0  33.37 274
0  33.49 275
0  33.62 276
0  33.75 277
0  33.86 278
1 0.66  33.97 279
1 0.66  34.12 280
0  34.21 281
0  34.35 282
0  34.47 283
0  34.57 284
0  34.67 285
0  34.76 286
0  34.86 287
0  34.96 288
1 0.52  35.08 289
1 0.66  35.21 290
1 0.66  35.36 291
0  35.46 292
0  35.59 293
0  35.71 294
0  35.83 295
0  35.93 296
0  36.02 297
0  36.16 298
0  36.27 299
0  36.38 300
0  36.51 301
0  36.7 302
0  36.9 303
0  37.07 304
0  37.16 305
0  37.29 306
0  37.38 307
0  37.49 308
0  37.57 309
0  37.71 310
0  37.81 311
0  37.95 312
0  38.04 313
0  38.15 314
1 0.53  38.27 315
0  38.37 316
0  38.51 317
0  38.59 318
0  38.76 319
0  38.84 320
0  38.96 321
0  39.04 322
0  39.14 323
0  39.24 324
0  39.34 325
0  39.44 326
0  39.56 327
0  39.67 328
0  39.78 329
0  39.9 330
0  39.99 331
0  40.12 332
0  40.21 333
0  40.33 334
0  40.44 335
0  40.56 336
1 0.6  40.67 337
0  40.81 338
0  40.92 339
0  41.02 340
0  41.12 341
0  41.2 342
0  41.37 343
0  41.45 344
0  41.56 345
0  41.68 346
0  41.78 347
0  41.92 348
0  42.02 349
0  42.16 350
0  42.27 351
0  42.37 352
0  42.51 353
0  42.59 354
0  42.75 355
0  42.86 356
0  42.97 357
0  43.11 358
0  43.21 359
0  43.34 360
0  43.43 361
1 0.58  43.57 362
1 0.67  43.71 363
1 0.67  43.82 364
0  43.96 365
0  44.14 366
0  44.29 367
0  44.4 368
0  44.49 369
1 0.71  44.6 370
1 0.71  44.71 371
1 0.73  44.82 372
1 0.73  44.93 373
1 0.73  45.04 374
1 0.73  45.16 375
1 0.71  45.27 376
1 0.71  45.38 377
1 0.77  45.5 378
1 0.73  45.62 379
1 0.73  45.75 380
0  45.83 381
0  45.97 382
0  46.07 383
0  46.18 384
0  46.31 385
1 0.59  46.46 386
1 0.59  46.6 387
0  46.7 388
1 0.7  46.82 389
1 0.7  46.96 390
1 0.67  47.06 391
1 0.67  47.21 392
0  47.31 393
0  47.4 394
0  47.53 395
0  47.62 396
0  47.74 397
0  47.86 398
0  47.95 399
0  48.05 400
0  48.15 401
0  48.25 402
0  48.36 403
0  48.46 404
0  48.55 405
0  48.66 406
0  48.77 407
0  48.87 408
0  48.97 409
1 0.65  49.08 410
1 0.65  49.19 411
0  49.29 412
0  49.39 413
0  49.49 414
0  49.58 415
0  49.69 416
0  49.78 417
0  49.87 418
0  49.97 419
0  50.07 420
0  50.17 421
1 0.61  50.29 422
1 0.57  50.41 423
1 0.57  50.55 424
0  50.64 425
0  50.81 426
0  50.91 427
0  51.02 428
0  51.16 429
0  51.23 430
0  51.37 431
0  51.46 432
0  51.57 433
0  51.69 434
0  51.78 435
0  51.92 436
0  52.0 437
0  52.12 438
1 0.6  52.23 439
1 0.6  52.34 440
1 0.53  52.44 441
1 0.53  52.58 442
0  52.68 443
0  52.78 444
0  52.93 445
0  53.02 446
0  53.16 447
0  53.25 448
0  53.35 449
1 0.54  53.46 450
1 0.54  53.59 451
1 0.53  53.74 452
0  53.85 453
0  53.98 454
0  54.11 455
0  54.22 456
0  54.35 457
0  54.48 458
0  54.61 459
0  54.75 460
0  54.85 461
0  54.99 462
0  55.11 463
0  55.21 464
0  55.33 465
0  55.43 466
0  55.57 467
0  55.66 468
0  55.8 469
0  55.91 470
0  56.02 471
0  56.15 472
0  56.24 473
0  56.38 474
0  56.48 475
0  56.6 476
0  56.72 477
0  56.84 478
0  56.97 479
0  57.07 480
0  57.17 481
0  57.29 482
0  57.39 483
0  57.53 484
0  57.63 485
0  57.74 486
0  57.85 487
0  57.94 488
0  58.03 489
0  58.14 490
0  58.23 491
0  58.36 492
0  58.46 493
0  58.56 494
0  58.69 495
0  58.81 496
1 0.63  58.95 497
1 0.51  59.09 498
0  59.19 499
0  59.33 500
0  59.42 501
0  59.56 502
0  59.67 503
0  59.78 504
0  59.9 505
0  59.99 506
0  60.12 507
0  60.21 508
0  60.34 509
0  60.43 510
0  60.57 511
0  60.67 512
0  60.8 513
0  60.93 514
0  61.03 515
0  61.14 516
1 0.51  61.24 517
1 0.51  61.35 518
1 0.51  61.46 519
1 0.51  61.57 520
0  61.66 521
0  61.78 522
0  61.91 523
0  62.0 524
0  62.13 525
0  62.22 526
0  62.36 527
0  62.5 528
0  62.61 529
0  62.74 530
0  62.85 531
0  62.98 532
0  63.1 533
0  63.2 534
0  63.32 535
0  63.4 536
0  63.54 537
0  63.62 538
0  63.75 539
0  63.86 540
0  63.99 541
0  64.11 542
0  64.24 543
0  64.34 544
0  64.43 545
0  64.53 546
0  64.61 547
0  64.72 548
0  64.81 549
0  64.91 550
0  65.02 551
0  65.12 552
0  65.21 553
0  65.31 554
0  65.4 555
1 0.55  65.5 556
1 0.55  65.61 557
0  65.7 558
0  65.79 559
0  65.89 560
0  65.99 561
0  66.07 562
0  66.17 563
1 0.6  66.28 564
1 0.6  66.39 565
1 0.71  66.48 566
1 0.71  66.6 567
1 0.59  66.71 568
1 0.55  66.84 569
1 0.55  66.98 570
0  67.1 571
0  67.2 572
0  67.32 573
0  67.43 574
0  67.58 575
0  67.7 576
0  67.81 577
0  67.95 578
0  68.04 579
0  68.18 580
0  68.27 581
0  68.4 582
0  68.5 583
0  68.6 584
0  68.69 585
0  68.78 586
0  68.87 587
0  68.96 588
0  69.04 589
0  69.15 590
0  69.23 591
0  69.31 592
0  69.41 593
0  69.51 594
0  69.62 595
0  69.74 596
0  69.83 597
0  69.96 598
0  70.06 599
0  70.18 600
0  70.3 601
0  70.43 602
0  70.55 603
0  70.65 604
0  70.78 605
0  70.88 606
0  70.99 607
0  71.1 608
0  71.2 609
0  71.33 610
0  71.43 611
0  71.55 612
0  71.64 613
0  71.74 614
0  71.83 615
0  71.92 616
0  72.06 617
0  72.19 618
0  72.3 619
0  72.42 620
0  72.55 621
0  72.64 622
0  72.78 623
0  72.91 624
0  73.03 625
0  73.16 626
0  73.25 627
0  73.39 628
0  73.51 629
0  73.61 630
0  73.74 631
0  73.82 632
0  73.96 633
0  74.04 634
0  74.16 635
0  74.25 636
0  74.36 637
0  74.46 638
0  74.55 639
0  74.64 640
0  74.75 641
0  74.84 642
0  74.94 643
0  75.05 644
0  75.15 645
0  75.24 646
0  75.34 647
0  75.43 648
0  75.55 649
0  75.64 650
0  75.74 651
0  75.85 652
0  75.96 653
0  76.04 654
0  76.14 655
0  76.24 656
0  76.34 657
0  76.44 658
0  76.54 659
0  76.63 660
0  76.75 661
0  76.84 662
0  76.97 663
0  77.08 664
0  77.19 665
0  77.3 666
0  77.41 667
0  77.53 668
0  77.61 669
0  77.77 670
0  77.88 671
0  77.99 672
0  78.11 673
0  78.21 674
0  78.35 675
0  78.43 676
0  78.54 677
0  78.63 678
0  78.73 679
0  78.84 680
0  78.95 681
0  79.04 682
0  79.14 683
0  79.23 684
0  79.37 685
0  79.48 686
0  79.6 687
0  79.73 688
0  79.83 689
0  79.98 690
1 0.64  80.11 691
0  80.22 692
0  80.36 693
0  80.44 694
0  80.57 695
0  80.68 696
0  80.77 697
0  80.89 698
0  80.98 699
0  81.11 700
1 0.57  81.25 701
1 0.57  81.39 702
0  81.5 703
0  81.61 704
0  81.71 705
0  81.8 706
0  81.89 707
0  81.97 708
0  82.06 709
0  82.16 710
0  82.24 711
0  82.34 712
0  82.43 713
0  82.52 714
0  82.62 715
0  82.74 716
0  82.82 717
0  82.96 718
0  83.04 719
0  83.18 720
0  83.27 721
0  83.39 722
0  83.51 723
0  83.61 724
0  83.74 725
0  83.83 726
0  83.99 727
0  84.09 728
0  84.2 729
0  84.31 730
1 0.52  84.42 731
1 0.52  84.54 732
1 0.6  84.63 733
1 0.6  84.76 734
0  84.85 735
0  84.94 736
0  85.02 737
0  85.12 738
0  85.19 739
0  85.32 740
0  85.4 741
0  85.55 742
0  85.63 743
0  85.76 744
0  85.85 745
0  85.97 746
1 0.58  86.09 747
1 0.58  86.23 748
0  86.38 749
0  86.54 750
1 0.53  86.83 751
0  86.96 752
0  87.06 753
0  87.17 754
1 0.54  87.27 755
1 0.54  87.38 756
0  87.49 757
0  87.59 758
0  87.69 759
0  87.8 760
0  87.95 761
0  88.08 762
0  88.2 763
0  88.29 764
0  88.38 765
0  88.48 766
0  88.6 767
0  88.73 768
0  88.89 769
0  89.02 770
0  89.14 771
0  89.24 772
0  89.35 773
0  89.45 774
0  89.56 775
0  89.66 776
0  89.77 777
0  89.85 778
0  89.95 779
0  90.06 780
0  90.2 781
0  90.31 782
0  90.42 783
1 0.55  90.55 784
1 0.55  90.65 785
0  90.79 786
0  90.91 787
0  91.02 788
0  91.12 789
0  91.24 790
1 0.57  91.38 791
1 0.57  91.49 792
1 0.52  91.63 793
0  91.77 794
0  91.89 795
0  92.01 796
0  92.13 797
0  92.25 798
0  92.36 799
0  92.45 800
0  92.56 801
0  92.65 802
0  92.77 803
0  92.94 804
1 0.7  93.05 805
1 0.7  93.22 806
1 0.73  93.32 807
0  93.42 808
0  93.54 809
1 0.57  93.64 810
1 0.57  93.78 811
0  93.9 812
0  94.04 813
0  94.16 814
0  94.29 815
0  94.4 816
0  94.51 817
0  94.62 818
0  94.77 819
0  94.93 820
0  95.11 821
0  95.2 822
1 0.51  95.32 823
0  95.45 824
0  95.57 825
0  95.65 826
0  95.79 827
0  95.88 828
0  96.02 829
0  96.14 830
0  96.22 831
0  96.38 832
0  96.46 833
0  96.6 834
0  96.71 835
0  96.84 836
0  96.96 837
0  97.05 838
0  97.17 839
0  97.25 840
0  97.41 841
0  97.49 842
0  97.64 843
0  97.74 844
0  97.85 845
0  97.94 846
0  98.03 847
0  98.14 848
0  98.22 849
0  98.36 850
1 0.5  98.46 851
1 0.5  98.59 852
1 0.54  98.72 853
1 0.57  98.83 854
1 0.57  98.97 855
1 0.55  99.08 856
1 0.55  99.21 857
0  99.34 858
0  99.48 859
0  99.6 860
1 0.63  99.74 861
1 0.57  99.87 862
1 0.57  100.0 863
0  100.11 864
0  100.23 865
0  100.34 866
1 0.66  100.45 867
1 0.66  100.58 868
0  100.69 869
0  100.82 870
0  100.97 871
0  101.07 872
0  101.2 873
0  101.3 874
0  101.47 875
0  101.58 876
0  101.74 877
0  101.91 878
0  102.04 879
0  102.19 880
0  102.27 881
0  102.41 882
0  102.52 883
0  102.62 884
0  102.76 885
0  102.85 886
0  102.96 887
0  103.06 888
0  103.21 889
1 0.51  103.32 890
0  103.44 891
0  103.58 892
0  103.68 893
0  103.79 894
0  103.91 895
0  104.02 896
0  104.16 897
0  104.24 898
0  104.37 899
0  104.48 900
0  104.64 901
0  104.74 902
1 0.67  104.89 903
1 0.67  105.03 904
1 0.59  105.16 905
1 0.61  105.3 906
0  105.46 907
0  105.57 908
0  105.67 909
0  105.79 910
0  105.9 911
0  106.0 912
0  106.09 913
0  106.19 914
0  106.28 915
0  106.38 916
0  106.48 917
0  106.59 918
0  106.71 919
0  106.8 920
0  106.9 921
0  107.0 922
0  107.1 923
0  107.2 924
0  107.29 925
0  107.4 926
0  107.5 927
0  107.62 928
0  107.73 929
0  107.82 930
1 0.68  107.93 931
0  108.04 932
0  108.13 933
0  108.23 934
0  108.39 935
1 0.67  108.5 936
1 0.67  108.64 937
1 0.68  108.77 938
0  108.9 939
0  109.05 940
0  109.18 941
0  109.3 942
0  109.41 943
0  109.56 944
0  109.65 945
0  109.8 946
0  109.9 947
0  110.01 948
0  110.13 949
0  110.23 950
0  110.34 951
0  110.48 952
0  110.6 953
0  110.72 954
0  110.81 955
0  110.92 956
0  111.0 957
0  111.15 958
0  111.25 959
0  111.35 960
0  111.45 961
0  111.55 962
0  111.64 963
0  111.74 964
0  111.83 965
0  111.94 966
0  112.06 967
0  112.18 968
0  112.27 969
0  112.41 970
0  112.55 971
0  112.65 972
0  112.79 973
0  112.9 974
0  113.03 975
0  113.14 976
0  113.25 977
0  113.38 978
0  113.5 979
0  113.61 980
0  113.7 981
0  113.8 982
0  113.89 983
0  113.99 984
0  114.09 985
0  114.18 986
0  114.27 987
0  114.39 988
0  114.47 989
0  114.56 990
0  114.65 991
0  114.75 992
0  114.82 993
0  114.92 994
0  115.03 995
0  115.12 996
0  115.2 997
0  115.28 998
0  115.38 999
0  115.47 1000
0  115.59 1001
1 0.8  115.69 1002
1 0.8  115.82 1003
0  115.95 1004
0  116.05 1005
0  116.15 1006
1 0.67  116.25 1007
1 0.67  116.36 1008
1 0.57  116.48 1009
1 0.57  116.64 1010
0  116.76 1011
1 0.73  116.88 1012
1 0.73  117.0 1013
1 0.73  117.11 1014
1 0.73  117.21 1015
1 0.56  117.33 1016
0  117.45 1017
0  117.57 1018
0  117.67 1019
0  117.77 1020
0  117.86 1021
0  117.97 1022
0  118.09 1023
0  118.18 1024
0  118.29 1025
0  118.4 1026
0  118.51 1027
0  118.61 1028
0  118.71 1029
0  118.81 1030
0  118.93 1031
0  119.02 1032
0  119.16 1033
0  119.26 1034
0  119.42 1035
0  119.56 1036
0  119.67 1037
0  119.82 1038
0  119.94 1039
0  120.05 1040
0  120.16 1041
0  120.28 1042
0  120.41 1043
0  120.52 1044
0  120.64 1045
0  120.74 1046
0  120.84 1047
0  120.94 1048
0  121.03 1049
0  121.12 1050
0  121.21 1051
0  121.3 1052
0  121.4 1053
0  121.48 1054
0  121.59 1055
0  121.68 1056
0  121.78 1057
0  121.87 1058
0  121.98 1059
0  122.07 1060
0  122.17 1061
0  122.27 1062
0  122.38 1063
0  122.47 1064
0  122.58 1065
0  122.68 1066
0  122.79 1067
0  122.88 1068
0  122.98 1069
0  123.07 1070
0  123.18 1071
0  123.26 1072
0  123.35 1073
0  123.43 1074
0  123.53 1075
0  123.62 1076
0  123.72 1077
0  123.81 1078
0  123.93 1079
0  124.01 1080
0  124.1 1081
0  124.21 1082
0  124.37 1083
0  124.48 1084
0  124.64 1085
0  124.83 1086
0  125.01 1087
0  125.22 1088
0  125.39 1089
0  125.53 1090
0  125.68 1091
0  125.87 1092
0  126.02 1093
0  126.18 1094
0  126.37 1095
0  126.54 1096
1 0.51  126.74 1097
0  126.86 1098
0  126.99 1099
1 0.56  127.1 1100
1 0.56  127.24 1101
1 0.71  127.36 1102
1 0.58  127.49 1103
1 0.58  127.63 1104
1 0.63  127.74 1105
1 0.54  127.89 1106
1 0.54  128.0 1107
1 0.58  128.11 1108
1 0.58  128.21 1109
1 0.57  128.32 1110
1 0.57  128.43 1111
0  128.53 1112
0  128.64 1113
0  128.76 1114
0  128.88 1115
0  129.0 1116
0  129.09 1117
0  129.2 1118
0  129.3 1119
0  129.37 1120
0  129.48 1121
0  129.62 1122
1 0.51  129.74 1123
0  129.85 1124
0  129.97 1125
1 0.56  130.06 1126
1 0.56  130.2 1127
0  130.28 1128
0  130.42 1129
0  130.54 1130
0  130.65 1131
0  130.77 1132
0  130.87 1133
0  130.98 1134
0  131.09 1135
0  131.19 1136
0  131.28 1137
1 0.77  131.39 1138
1 0.77  131.5 1139
1 0.63  131.6 1140
1 0.79  131.71 1141
1 0.79  131.82 1142
1 0.65  131.92 1143
1 0.65  132.03 1144
1 0.65  132.14 1145
1 0.65  132.25 1146
1 0.74  132.35 1147
1 0.74  132.45 1148
1 0.61  132.56 1149
1 0.61  132.7 1150
0  132.81 1151
0  132.95 1152
0  133.06 1153
0  133.16 1154
0  133.28 1155
0  133.42 1156
0  133.54 1157
0  133.65 1158
0  133.77 1159
0  133.89 1160
0  134.01 1161
0  134.12 1162
0  134.23 1163
0  134.32 1164
0  134.44 1165
0  134.55 1166
0  134.66 1167
0  134.78 1168
0  134.87 1169
0  134.98 1170
0  135.07 1171
0  135.2 1172
0  135.33 1173
0  135.43 1174
0  135.54 1175
0  135.63 1176
0  135.76 1177
0  135.86 1178
0  136.0 1179
0  136.08 1180
0  136.24 1181
0  136.33 1182
0  136.48 1183
0  136.63 1184
0  136.74 1185
0  136.86 1186
0  136.98 1187
0  137.06 1188
0  137.2 1189
0  137.29 1190
0  137.41 1191
0  137.52 1192
0  137.75 1193
0  137.99 1194
0  138.22 1195
0  138.48 1196
0  138.6 1197
0  138.7 1198
0  138.8 1199
0  138.9 1200
0  139.01 1201
0  139.1 1202
0  139.19 1203
0  139.27 1204
0  139.37 1205
0  139.47 1206
0  139.56 1207
0  139.64 1208
0  139.74 1209
0  139.84 1210
0  139.95 1211
0  140.05 1212
0  140.14 1213
0  140.23 1214
0  140.32 1215
0  140.42 1216
0  140.52 1217
0  140.63 1218
0  140.73 1219
0  140.83 1220
0  140.93 1221
0  141.02 1222
0  141.12 1223
0  141.21 1224
0  141.29 1225
0  141.4 1226
0  141.49 1227
0  141.6 1228
0  141.68 1229
0  141.78 1230
0  141.88 1231
0  141.98 1232
0  142.08 1233
0  142.19 1234
0  142.28 1235
0  142.38 1236
0  142.47 1237
0  142.57 1238
0  142.69 1239
0  142.88 1240
0  143.07 1241
0  143.21 1242
0  143.31 1243
0  143.4 1244
0  143.48 1245
0  143.61 1246
1 0.53  143.74 1247
1 0.53  143.86 1248
0  143.99 1249
0  144.09 1250
0  144.22 1251
0  144.32 1252
0  144.43 1253
0  144.55 1254
0  144.63 1255
0  144.73 1256
0  144.83 1257
0  144.94 1258
0  145.05 1259
0  145.19 1260
0  145.27 1261
1 0.52  145.42 1262
1 0.52  145.51 1263
0  145.67 1264
0  145.79 1265
0  145.88 1266
0  145.98 1267
0  146.06 1268
0  146.19 1269
0  146.27 1270
0  146.41 1271
0  146.51 1272
0  146.65 1273
1 0.7  146.76 1274
1 0.56  146.89 1275
1 0.56  147.02 1276
0  147.11 1277
0  147.2 1278
0  147.3 1279
0  147.41 1280
1 0.52  147.53 1281
1 0.52  147.64 1282
0  147.74 1283
0  147.84 1284
0  147.94 1285
0  148.03 1286
0  148.12 1287
0  148.22 1288
0  148.32 1289
0  148.42 1290
0  148.52 1291
0  148.6 1292
0  148.71 1293
0  148.81 1294
0  148.89 1295
0  149.0 1296
0  149.08 1297
0  149.17 1298
0  149.25 1299
0  149.35 1300
1 0.78  149.47 1301
2 0.53 0.78  149.58 1302
2 0.53 0.61  149.68 1303
1 0.61  149.79 1304
0  149.9 1305
0  149.99 1306
0  150.08 1307
0  150.2 1308
0  150.29 1309
0  150.39 1310
0  150.48 1311
0  150.58 1312
0  150.67 1313
0  150.81 1314
0  150.9 1315
0  151.05 1316
0  151.17 1317
1 0.79  151.27 1318
1 0.79  151.4 1319
1 0.52  151.51 1320
1 0.52  151.66 1321
1 0.74  151.78 1322
0  151.9 1323
0  152.02 1324
0  152.14 1325
0  152.25 1326
0  152.35 1327
0  152.44 1328
0  152.53 1329
1 0.59  152.66 1330
0  152.75 1331
0  152.84 1332
0  152.94 1333
0  153.04 1334
0  153.13 1335
0  153.22 1336
0  153.34 1337
0  153.44 1338
0  153.57 1339
0  153.69 1340
0  153.82 1341
0  153.9 1342
0  154.0 1343
0  154.11 1344
0  154.22 1345
0  154.33 1346
0  154.47 1347
0  154.58 1348
0  154.7 1349
0  154.86 1350
0  154.96 1351
0  155.06 1352
0  155.15 1353
0  155.28 1354
0  155.4 1355
0  155.47 1356
1 0.78  155.65 1357
0  155.75 1358
0  155.87 1359
0  155.97 1360
0  156.06 1361
0  156.19 1362
0  156.28 1363
0  156.4 1364
0  156.5 1365
0  156.64 1366
0  156.74 1367
0  156.84 1368
0  156.96 1369
0  157.08 1370
0  157.19 1371
0  157.33 1372
0  157.41 1373
0  157.53 1374
0  157.64 1375
0  157.74 1376
0  157.83 1377
0  157.91 1378
0  158.05 1379
0  158.15 1380
0  158.24 1381
0  158.33 1382
0  158.42 1383
0  158.51 1384
0  158.62 1385
0  158.71 1386
0  158.8 1387
0  158.88 1388
0  159.0 1389
0  159.09 1390
0  159.21 1391
0  159.29 1392
0  159.39 1393
0  159.48 1394
0  159.57 1395
0  159.65 1396
0  159.73 1397
0  159.83 1398
0  159.92 1399
0  160.01 1400
0  160.1 1401
1 0.7  160.21 1402
2 0.7 0.54  160.32 1403
1 0.54  160.41 1404
1 0.66  160.52 1405
1 0.66  160.64 1406
1 0.76  160.75 1407
1 0.76  160.85 1408
1 0.68  160.97 1409
1 0.62  161.07 1410
1 0.62  161.17 1411
1 0.72  161.27 1412
1 0.72  161.41 1413
1 0.52  161.52 1414
1 0.52  161.66 1415
1 0.65  161.77 1416
1 0.6  161.89 1417
1 0.6  162.04 1418
1 0.75  162.14 1419
1 0.75  162.25 1420
0  162.39 1421
1 0.75  162.51 1422
1 0.75  162.65 1423
1 0.52  162.77 1424
1 0.53  162.89 1425
1 0.53  163.03 1426
1 0.55  163.14 1427
1 0.55  163.25 1428
1 0.57  163.36 1429
1 0.57  163.46 1430
1 0.56  163.58 1431
0  163.68 1432
0  163.81 1433
0  163.9 1434
0  164.05 1435
0  164.16 1436
0  164.26 1437
0  164.38 1438
0  164.48 1439
0  164.57 1440
1 0.55  164.68 1441
1 0.55  164.8 1442
0  164.88 1443
0  165.0 1444
0  165.09 1445
0  165.23 1446
1 0.72  165.38 1447
0  165.53 1448
0  165.63 1449
0  165.71 1450
0  165.81 1451
0  165.9 1452
0  166.01 1453
0  166.1 1454
0  166.19 1455
0  166.28 1456
0  166.42 1457
0  166.6 1458
0  166.69 1459
0  166.82 1460
0  166.92 1461
0  167.06 1462
1 0.58  167.18 1463
0  167.28 1464
0  167.43 1465
0  167.53 1466
0  167.7 1467
0  167.83 1468
0  167.93 1469
0  168.07 1470
0  168.18 1471
2 0.57 0.66  168.3 1472
2 0.57 0.66  168.44 1473
1 0.58  168.55 1474
0  168.68 1475
0  168.82 1476
1 0.79  169.11 1477
2 0.53 0.71  169.32 1478
0  169.58 1479
0  169.84 1480
1 0.76  170.12 1481
0  170.35 1482
0  170.54 1483
0  170.66 1484
0  170.75 1485
0  170.85 1486
0  170.95 1487
0  171.11 1488
0  171.21 1489
0  171.3 1490
0  171.41 1491
0  171.5 1492
0  171.59 1493
0  171.68 1494
0  171.78 1495
0  171.87 1496
0  171.97 1497
0  172.08 1498
0  172.16 1499
0  172.27 1500
0  172.36 1501
0  172.47 1502
0  172.6 1503
0  172.69 1504
0  172.83 1505
0  172.92 1506
0  173.03 1507
0  173.13 1508
0  173.25 1509
0  173.37 1510
0  173.47 1511
0  173.56 1512
0  173.66 1513
0  173.77 1514
0  173.85 1515
0  173.92 1516
0  174.04 1517
0  174.11 1518
0  174.19 1519
0  174.27 1520
0  174.37 1521
0  174.45 1522
0  174.55 1523
0  174.66 1524
0  174.8 1525
0  174.92 1526
0  175.22 1527
0  175.35 1528
0  175.55 1529
1 0.61  175.69 1530
0  175.79 1531
0  175.89 1532
0  175.99 1533
0  176.08 1534
0  176.16 1535
0  176.27 1536
0  176.35 1537
0  176.44 1538
0  176.53 1539
0  176.63 1540
0  176.71 1541
0  176.81 1542
0  176.91 1543
0  177.02 1544
0  177.12 1545
0  177.22 1546
0  177.31 1547
0  177.43 1548
0  177.51 1549
0  177.62 1550
0  177.71 1551
0  177.82 1552
1 0.71  177.95 1553
1 0.71  178.09 1554
1 0.83  178.21 1555
1 0.84  178.35 1556
1 0.84  178.48 1557
1 0.69  178.61 1558
0  178.71 1559
0  178.86 1560
0  178.96 1561
0  179.09 1562
0  179.21 1563
0  179.3 1564
0  179.44 1565
0  179.52 1566
1 0.59  179.64 1567
1 0.59  179.73 1568
0  179.84 1569
0  179.93 1570
0  180.02 1571
0  180.12 1572
0  180.23 1573
0  180.33 1574
0  180.44 1575
0  180.54 1576
0  180.65 1577
0  180.75 1578
0  180.85 1579
0  180.97 1580
1 0.51  181.12 1581
1 0.51  181.25 1582
1 0.63  181.37 1583
0  181.49 1584
0  181.63 1585
0  181.71 1586
0  181.84 1587
0  181.94 1588
0  182.05 1589
0  182.17 1590
0  182.28 1591
0  182.42 1592
0  182.52 1593
0  182.64 1594
0  182.73 1595
0  182.88 1596
1 0.76  182.98 1597
0  183.08 1598
0  183.19 1599
0  183.27 1600
0  183.39 1601
0  183.47 1602
0  183.55 1603
0  183.66 1604
0  183.76 1605
0  183.85 1606
0  183.94 1607
0  184.06 1608
0  184.15 1609
0  184.26 1610
0  184.36 1611
0  184.46 1612
0  184.55 1613
0  184.67 1614
0  184.76 1615
0  184.84 1616
0  184.94 1617
0  185.04 1618
0  185.13 1619
0  185.24 1620
1 0.73  185.34 1621
1 0.73  185.46 1622
0  185.55 1623
0  185.64 1624
0  185.73 1625
0  185.83 1626
1 0.52  185.93 1627
1 0.52  186.04 1628
0  186.12 1629
0  186.21 1630
0  186.3 1631
0  186.41 1632
0  186.49 1633
0  186.58 1634
0  186.68 1635
0  186.78 1636
0  186.87 1637
0  187.03 1638
0  187.11 1639
0  187.24 1640
0  187.34 1641
0  187.46 1642
0  187.57 1643
0  187.67 1644
0  187.76 1645
0  187.89 1646
0  188.04 1647
0  188.13 1648
0  188.3 1649
0  188.4 1650
0  188.52 1651
0  188.62 1652
0  188.72 1653
0  188.81 1654
1 0.57  188.92 1655
1 0.57  189.04 1656
0  189.13 1657
0  189.29 1658
0  189.39 1659
1 0.51  189.52 1660
1 0.51  189.66 1661
0  189.74 1662
0  189.98 1663
0  190.1 1664
0  190.26 1665
0  190.5 1666
0  190.66 1667
0  190.86 1668
0  190.97 1669
0  191.12 1670
0  191.23 1671
0  191.34 1672
0  191.44 1673
0  191.51 1674
0  191.64 1675
0  191.71 1676
0  191.85 1677
0  191.93 1678
0  192.05 1679
0  192.13 1680
0  192.26 1681
0  192.37 1682
0  192.48 1683
1 0.5  192.63 1684
0  192.74 1685
0  192.88 1686
0  193.0 1687
0  193.12 1688
0  193.24 1689
0  193.34 1690
0  193.46 1691
0  193.55 1692
0  193.65 1693
0  193.74 1694
0  193.85 1695
0  193.94 1696
0  194.09 1697
0  194.2 1698
0  194.31 1699
0  194.43 1700
0  194.53 1701
0  194.66 1702
0  194.74 1703
0  194.88 1704
0  194.98 1705
0  195.07 1706
0  195.17 1707
0  195.27 1708
0  195.4 1709
0  195.53 1710
0  195.65 1711
0  195.76 1712
0  195.86 1713
0  195.97 1714
0  196.07 1715
0  196.16 1716
0  196.26 1717
0  196.35 1718
0  196.45 1719
1 0.58  196.55 1720
1 0.58  196.66 1721
0  196.75 1722
0  196.85 1723
0  196.93 1724
0  197.03 1725
0  197.12 1726
0  197.2 1727
0  197.28 1728
0  197.38 1729
0  197.46 1730
0  197.54 1731
0  197.64 1732
0  197.72 1733
0  197.82 1734
0  197.9 1735
0  198.0 1736
0  198.09 1737
0  198.17 1738
0  198.28 1739
0  198.35 1740
0  198.44 1741
0  198.55 1742
0  198.63 1743
0  198.72 1744
0  198.86 1745
0  198.95 1746
0  199.06 1747
0  199.15 1748
0  199.29 1749
0  199.4 1750
0  199.51 1751
0  199.67 1752
0  199.77 1753
0  199.87 1754
0  199.99 1755
0  200.11 1756
0  200.23 1757
0  200.31 1758
1 0.5  200.45 1759
0  200.54 1760
0  200.64 1761
0  200.73 1762
0  200.83 1763
0  200.92 1764
0  201.02 1765
0  201.12 1766
0  201.23 1767
0  201.32 1768
1 0.6  201.44 1769
0  201.54 1770
0  201.63 1771
0  201.74 1772
0  201.84 1773
0  201.93 1774
0  202.03 1775
0  202.11 1776
0  202.21 1777
0  202.29 1778
0  202.41 1779
0  202.5 1780
0  202.6 1781
0  202.69 1782
0  202.79 1783
0  202.88 1784
0  202.97 1785
0  203.07 1786
0  203.18 1787
0  203.29 1788
0  203.38 1789
0  203.48 1790
1 0.61  203.59 1791
1 0.61  203.73 1792
0  203.82 1793
0  203.96 1794
0  204.08 1795
0  204.18 1796
0  204.32 1797
0  204.44 1798
0  204.56 1799
0  204.68 1800
0  204.77 1801
0  204.88 1802
0  204.97 1803
0  205.1 1804
0  205.18 1805
0  205.28 1806
1 0.53  205.4 1807
1 0.53  205.49 1808
0  205.57 1809
0  205.67 1810
0  205.77 1811
0  205.87 1812
0  205.95 1813
0  206.06 1814
0  206.15 1815
0  206.24 1816
0  206.32 1817
0  206.43 1818
0  206.52 1819
0  206.61 1820
0  206.69 1821
0  206.78 1822
0  206.86 1823
0  206.95 1824
0  207.04 1825
0  207.11 1826
0  207.22 1827
0  207.29 1828
0  207.38 1829
0  207.47 1830
0  207.55 1831
0  207.63 1832
0  207.71 1833
0  207.82 1834
0  207.91 1835
0  208.02 1836
0  208.12 1837
0  208.26 1838
0  208.35 1839
0  208.5 1840
0  208.58 1841
0  208.73 1842
0  208.85 1843
0  208.95 1844
0  209.1 1845
0  209.21 1846
0  209.35 1847
0  209.49 1848
1 0.73  209.63 1849
1 0.54  209.75 1850
1 0.54  209.89 1851
1 0.53  210.01 1852
0  210.13 1853
0  210.23 1854
0  210.32 1855
0  210.42 1856
0  210.52 1857
0  210.61 1858
0  210.69 1859
0  210.8 1860
0  210.88 1861
0  210.96 1862
0  211.09 1863
0  211.19 1864
0  211.28 1865
0  211.38 1866
0  211.49 1867
0  211.6 1868
0  211.72 1869
0  211.82 1870
0  211.91 1871
0  212.01 1872
0  212.1 1873
0  212.19 1874
0  212.3 1875
0  212.39 1876
0  212.5 1877
0  212.6 1878
0  212.69 1879
0  212.78 1880
0  212.88 1881
0  212.98 1882
0  213.08 1883
0  213.18 1884
0  213.3 1885
0  213.42 1886
0  213.54 1887
0  213.66 1888
0  213.76 1889
0  213.89 1890
0  214.02 1891
1 0.69  214.15 1892
1 0.69  214.29 1893
1 0.51  214.41 1894
2 0.53 0.62  214.56 1895
2 0.53 0.62  214.71 1896
1 0.73  214.84 1897
0  214.96 1898
0  215.07 1899
0  215.16 1900
1 0.82  215.29 1901
0  215.37 1902
0  215.49 1903
0  215.63 1904
0  215.74 1905
0  215.85 1906
1 0.5  215.97 1907
1 0.51  216.1 1908
1 0.51  216.23 1909
1 0.53  216.34 1910
1 0.53  216.48 1911
0  216.58 1912
0  216.73 1913
0  216.88 1914
0  217.0 1915
2 0.52 0.68  217.14 1916
2 0.52 0.68  217.28 1917
0  217.37 1918
0  217.51 1919
0  217.61 1920
0  217.73 1921
0  217.82 1922
0  217.91 1923
0  218.01 1924
0  218.1 1925
1 0.61  218.22 1926
0  218.33 1927
0  218.43 1928
0  218.53 1929
0  218.66 1930
0  218.79 1931
0  218.89 1932
0  219.0 1933
0  219.12 1934
0  219.25 1935
0  219.32 1936
0  219.48 1937
0  219.59 1938
0  219.69 1939
0  219.8 1940
0  219.91 1941
0  220.04 1942
0  220.13 1943
0  220.28 1944
0  220.4 1945
0  220.5 1946
0  220.58 1947
0  220.74 1948
0  220.85 1949
0  220.96 1950
0  221.08 1951
0  221.2 1952
0  221.32 1953
0  221.43 1954
1 0.5  221.55 1955
1 0.5  221.69 1956
1 0.58  221.79 1957
1 0.58  221.93 1958
0  222.02 1959
0  222.14 1960
0  222.24 1961
0  222.34 1962
0  222.47 1963
0  222.56 1964
0  222.7 1965
0  222.8 1966
0  222.91 1967
0  222.99 1968
0  223.09 1969
0  223.18 1970
0  223.28 1971
0  223.38 1972
0  223.47 1973
0  223.55 1974
0  223.65 1975
0  223.76 1976
0  223.87 1977
0  223.96 1978
0  224.07 1979
1 0.56  224.18 1980
1 0.56  224.31 1981
1 0.55  224.41 1982
0  224.51 1983
0  224.62 1984
0  224.72 1985
0  224.81 1986
0  224.9 1987
1 0.61  225.0 1988
1 0.61  225.11 1989
0  225.22 1990
0  225.33 1991
0  225.43 1992
0  225.53 1993
0  225.63 1994
0  225.75 1995
0  225.87 1996
0  225.95 1997
0  226.08 1998
0  226.16 1999
0  226.26 2000
0  226.35 2001
0  226.44 2002
0  226.53 2003
0  226.63 2004
0  226.76 2005
0  226.87 2006
1 0.62  226.97 2007
1 0.62  227.1 2008
0  227.21 2009
0  227.34 2010
0  227.45 2011
0  227.56 2012
0  227.69 2013
1 0.74  227.8 2014
0  227.94 2015
0  228.04 2016
0  228.12 2017
0  228.25 2018
1 0.61  228.34 2019
1 0.61  228.46 2020
0  228.54 2021
0  228.66 2022
0  228.77 2023
0  228.87 2024
0  228.96 2025
0  229.08 2026
0  229.18 2027
0  229.32 2028
0  229.43 2029
0  229.52 2030
0  229.65 2031
0  229.73 2032
0  229.85 2033
0  229.95 2034
0  230.06 2035
0  230.15 2036
0  230.25 2037
0  230.35 2038
0  230.47 2039
0  230.59 2040
0  230.72 2041
0  230.87 2042
1 0.71  230.99 2043
1 0.54  231.13 2044
1 0.54  231.27 2045
0  231.37 2046
0  231.5 2047
0  231.61 2048
0  231.71 2049
0  231.8 2050
0  231.91 2051
0  232.01 2052
0  232.11 2053
0  232.2 2054
0  232.3 2055
0  232.39 2056
0  232.48 2057
0  232.58 2058
0  232.68 2059
1 0.65  232.8 2060
1 0.65  232.92 2061
0  233.03 2062
0  233.12 2063
0  233.22 2064
0  233.32 2065
0  233.43 2066
0  233.52 2067
0  233.62 2068
0  233.74 2069
0  233.87 2070
0  233.97 2071
0  234.08 2072
1 0.56  234.19 2073
1 0.56  234.31 2074
0  234.42 2075
0  234.52 2076
0  234.62 2077
0  234.73 2078
0  234.82 2079
0  234.93 2080
0  235.06 2081
0  235.16 2082
0  235.28 2083
0  235.37 2084
0  235.5 2085
0  235.6 2086
0  235.72 2087
0  235.85 2088
0  235.95 2089
0  236.09 2090
0  236.19 2091
0  236.3 2092
0  236.41 2093
0  236.54 2094
2 0.56 0.63  236.65 2095
1 0.57  236.75 2096
1 0.57  236.87 2097
1 0.53  236.96 2098
2 0.55 0.53  237.07 2099
1 0.55  237.17 2100
0  237.26 2101
0  237.34 2102
1 0.54  237.46 2103
1 0.54  237.56 2104
0  237.65 2105
0  237.74 2106
0  237.84 2107
0  237.93 2108
0  238.04 2109
0  238.12 2110
0  238.24 2111
0  238.33 2112
0  238.46 2113
0  238.56 2114
0  238.71 2115
1 0.69  238.82 2116
1 0.69  238.93 2117
0  239.04 2118
1 0.66  239.16 2119
1 0.66  239.29 2120
1 0.75  239.4 2121
1 0.71  239.55 2122
1 0.71  239.69 2123
1 0.7  239.82 2124
1 0.76  239.94 2125
2 0.62 0.76  240.09 2126
2 0.59 0.82  240.21 2127
2 0.59 0.82  240.35 2128
2 0.64 0.78  240.46 2129
2 0.64 0.57  240.59 2130
2 0.83 0.57  240.71 2131
2 0.81 0.59  240.82 2132
2 0.81 0.59  240.94 2133
1 0.59  241.03 2134
1 0.59  241.15 2135
1 0.61  241.3 2136
1 0.61  241.4 2137
0  241.55 2138
0  241.66 2139
0  241.78 2140
0  241.96 2141
0  242.08 2142
0  242.22 2143
0  242.34 2144
0  242.47 2145
0  242.59 2146
0  242.74 2147
0  242.84 2148
0  242.97 2149
0  243.1 2150
0  243.19 2151
0  243.32 2152
0  243.43 2153
0  243.57 2154
0  243.7 2155
0  243.82 2156
1 0.56  243.96 2157
1 0.56  244.11 2158
0  244.21 2159
0  244.33 2160
1 0.57  244.46 2161
1 0.76  244.59 2162
1 0.76  244.75 2163
2 0.52 0.52  244.87 2164
1 0.56  245.02 2165
1 0.86  245.16 2166
1 0.86  245.3 2167
1 0.83  245.43 2168
2 0.69 0.7  245.57 2169
2 0.69 0.7  245.71 2170
2 0.72 0.75  245.82 2171
2 0.72 0.75  245.96 2172
2 0.56 0.75  246.1 2173
2 0.65 0.74  246.23 2174
1 0.72  246.36 2175
1 0.72  246.47 2176
1 0.73  246.57 2177
1 0.73  246.69 2178
2 0.65 0.7  246.8 2179
2 0.65 0.7  246.92 2180
2 0.61 0.7  247.03 2181
2 0.71 0.78  247.14 2182
2 0.71 0.78  247.25 2183
2 0.71 0.78  247.36 2184
1 0.55  247.47 2185
0  247.57 2186
0  247.66 2187
1 0.64  247.76 2188
1 0.64  247.87 2189
0  247.95 2190
0  248.04 2191
0  248.13 2192
0  248.25 2193
0  248.33 2194
0  248.44 2195
0  248.54 2196
0  248.64 2197
0  248.75 2198
0  248.9 2199
0  249.0 2200
0  249.12 2201
0  249.22 2202
0  249.33 2203
0  249.44 2204
0  249.54 2205
0  249.66 2206
0  249.76 2207
0  249.9 2208
0  249.99 2209
0  250.13 2210
0  250.24 2211
0  250.35 2212
0  250.45 2213
0  250.54 2214
0  250.68 2215
0  250.76 2216
0  250.9 2217
0  250.98 2218
0  251.1 2219
0  251.21 2220
0  251.34 2221
0  251.48 2222
0  251.59 2223
0  251.73 2224
0  251.84 2225
0  251.94 2226
0  252.11 2227
0  252.2 2228
0  252.3 2229
0  252.43 2230
0  252.51 2231
0  252.62 2232
0  252.74 2233
0  252.84 2234
0  252.96 2235
0  253.07 2236
0  253.17 2237
0  253.33 2238
0  253.45 2239
0  253.54 2240
0  253.67 2241
0  253.76 2242
0  253.9 2243
0  254.0 2244
0  254.1 2245
0  254.21 2246
0  254.32 2247
0  254.44 2248
0  254.54 2249
0  254.66 2250
0  254.75 2251
0  254.88 2252
0  254.96 2253
0  255.05 2254
0  255.13 2255
0  255.22 2256
0  255.3 2257
0  255.43 2258
1 0.58  255.55 2259
1 0.58  255.69 2260
1 0.6  255.79 2261
1 0.6  255.9 2262
1 0.53  256.03 2263
0  256.25 2264
0  256.39 2265
0  256.49 2266
0  256.64 2267
0  256.75 2268
0  256.86 2269
0  256.94 2270
0  257.09 2271
0  257.18 2272
0  257.33 2273
0  257.43 2274
1 0.79  257.6 2275
1 0.52  257.83 2276
1 0.74  258.03 2277
1 0.7  258.19 2278
0  258.41 2279
0  258.52 2280
0  258.62 2281
0  258.83 2282
0  259.02 2283
0  259.17 2284
0  259.38 2285
0  259.63 2286
0  259.83 2287
0  260.02 2288
0  260.17 2289
1 0.54  260.43 2290
1 0.6  260.61 2291
1 0.6  260.73 2292
0  260.83 2293
0  260.93 2294
1 0.84  261.05 2295
1 0.66  261.17 2296
1 0.66  261.28 2297
1 0.73  261.38 2298
1 0.73  261.49 2299
1 0.84  261.58 2300
1 0.84  261.68 2301
1 0.73  261.78 2302
1 0.73  261.88 2303
1 0.87  261.99 2304
1 0.87  262.09 2305
0  262.18 2306
0  262.28 2307
0  262.37 2308
0  262.49 2309
1 0.52  262.59 2310
1 0.52  262.73 2311
0  262.81 2312
0  262.95 2313
0  263.06 2314
1 0.74  263.17 2315
1 0.74  263.32 2316
1 0.77  263.44 2317
1 0.64  263.59 2318
1 0.64  263.73 2319
0  263.83 2320
0  263.95 2321
0  264.08 2322
0  264.19 2323
0  264.32 2324
0  264.42 2325
0  264.55 2326
0  264.66 2327
0  264.76 2328
0  264.87 2329
0  264.98 2330
0  265.07 2331
0  265.16 2332
0  265.24 2333
0  265.34 2334
0  265.45 2335
0  265.55 2336
0  265.64 2337
0  265.74 2338
0  265.87 2339
0  265.96 2340
0  266.07 2341
0  266.15 2342
0  266.3 2343
0  266.38 2344
0  266.56 2345
1 0.81  266.69 2346
0  266.81 2347
0  266.95 2348
1 0.54  267.06 2349
0  267.18 2350
0  267.35 2351
0  267.45 2352
0  267.57 2353
0  267.7 2354
0  267.79 2355
0  267.9 2356
0  267.99 2357
0  268.09 2358
0  268.19 2359
0  268.3 2360
0  268.4 2361
0  268.5 2362
0  268.59 2363
0  268.69 2364
0  268.77 2365
0  268.91 2366
0  269.0 2367
0  269.12 2368
0  269.21 2369
0  269.32 2370
0  269.43 2371
0  269.52 2372
0  269.65 2373
0  269.76 2374
0  269.9 2375
0  270.01 2376
0  270.12 2377
0  270.24 2378
0  270.33 2379
0  270.43 2380
0  270.55 2381
1 0.57  270.64 2382
0  270.74 2383
0  270.83 2384
0  270.93 2385
0  271.02 2386
0  271.12 2387
1 0.52  271.22 2388
1 0.52  271.34 2389
0  271.42 2390
0  271.5 2391
0  271.59 2392
0  271.69 2393
0  271.78 2394
0  271.86 2395
1 0.58  271.97 2396
1 0.58  272.07 2397
0  272.15 2398
0  272.26 2399
0  272.36 2400
0  272.46 2401
0  272.55 2402
1 0.51  272.66 2403
1 0.51  272.76 2404
0  272.87 2405
0  272.96 2406
0  273.1 2407
0  273.21 2408
0  273.32 2409
0  273.4 2410
0  273.53 2411
1 0.53  273.66 2412
1 0.5  273.78 2413
1 0.5  273.92 2414
1 0.68  274.03 2415
2 0.53 0.77  274.15 2416
3 0.61 0.53 0.77  274.31 2417
2 0.61 0.68  274.42 2418
1 0.68  274.53 2419
0  274.63 2420
0  274.74 2421
1 0.69  274.85 2422
1 0.69  274.96 2423
2 0.52 0.6  275.09 2424
0  275.21 2425
0  275.32 2426
0  275.43 2427
0  275.54 2428
1 0.61  275.65 2429
0  275.76 2430
0  275.91 2431
0  275.99 2432
0  276.12 2433
0  276.2 2434
0  276.36 2435
0  276.49 2436
0  276.58 2437
1 0.56  276.72 2438
2 0.56 0.59  276.83 2439
1 0.59  276.98 2440
1 0.7  277.08 2441
1 0.54  277.19 2442
1 0.54  277.32 2443
1 0.52  277.43 2444
1 0.52  277.58 2445
0  277.69 2446
0  277.8 2447
0  277.94 2448
0  278.04 2449
0  278.16 2450
0  278.29 2451
0  278.37 2452
0  278.52 2453
0  278.61 2454
0  278.73 2455
0  278.87 2456
0  278.97 2457
0  279.08 2458
0  279.18 2459
0  279.31 2460
0  279.41 2461
0  279.54 2462
0  279.63 2463
0  279.75 2464
1 0.72  279.88 2465
1 0.57  279.99 2466
1 0.57  280.11 2467
1 0.66  280.23 2468
1 0.66  280.36 2469
0  280.47 2470
0  280.59 2471
0  280.71 2472
0  280.81 2473
0  280.95 2474
0  281.05 2475
0  281.15 2476
1 0.58  281.27 2477
1 0.8  281.38 2478
1 0.8  281.53 2479
1 0.66  281.65 2480
1 0.66  281.77 2481
1 0.66  281.91 2482
1 0.64  282.01 2483
1 0.64  282.14 2484
1 0.72  282.26 2485
1 0.77  282.37 2486
1 0.77  282.48 2487
1 0.71  282.61 2488
1 0.71  282.72 2489
1 0.6  282.83 2490
1 0.7  282.99 2491
1 0.7  283.12 2492
0  283.2 2493
0  283.35 2494
0  283.44 2495
0  283.56 2496
0  283.69 2497
1 0.65  283.78 2498
1 0.65  283.91 2499
1 0.74  284.02 2500
1 0.74  284.13 2501
1 0.8  284.25 2502
1 0.67  284.35 2503
1 0.67  284.48 2504
1 0.67  284.59 2505
1 0.68  284.7 2506
1 0.74  284.84 2507
1 0.73  284.95 2508
1 0.73  285.06 2509
1 0.73  285.15 2510
1 0.8  285.25 2511
1 0.8  285.35 2512
1 0.65  285.49 2513
0  285.6 2514
0  285.72 2515
0  285.81 2516
1 0.64  285.94 2517
1 0.64  286.04 2518
0  286.19 2519
0  286.3 2520
1 0.54  286.41 2521
0  286.56 2522
0  286.68 2523
0  286.77 2524
0  286.9 2525
0  287.01 2526
0  287.14 2527
0  287.23 2528
0  287.36 2529
0  287.46 2530
0  287.58 2531
0  287.72 2532
0  287.8 2533
0  287.94 2534
0  288.03 2535
0  288.14 2536
0  288.25 2537
0  288.35 2538
0  288.48 2539
0  288.57 2540
0  288.69 2541
0  288.76 2542
0  288.88 2543
0  288.98 2544
0  289.1 2545
0  289.18 2546
0  289.3 2547
0  289.39 2548
0  289.51 2549
0  289.6 2550
0  289.73 2551
0  289.83 2552
0  289.94 2553
1 0.52  290.07 2554
0  290.19 2555
0  290.31 2556
0  290.42 2557
0  290.56 2558
0  290.69 2559
1 0.69  290.81 2560
1 0.69  290.94 2561
1 0.53  291.07 2562
1 0.52  291.23 2563
1 0.6  291.39 2564
1 0.6  291.52 2565
0  291.61 2566
0  291.77 2567
0  291.86 2568
0  292.01 2569
0  292.12 2570
0  292.2 2571
0  292.31 2572
1 0.59  292.42 2573
1 0.59  292.54 2574
1 0.6  292.64 2575
1 0.6  292.85 2576
1 0.6  293.08 2577
1 0.7  293.23 2578
1 0.73  293.49 2579
1 0.73  293.63 2580
1 0.73  293.82 2581
1 0.84  293.96 2582
1 0.83  294.1 2583
1 0.51  294.23 2584
1 0.54  294.39 2585
1 0.54  294.51 2586
1 0.85  294.63 2587
1 0.85  294.78 2588
1 0.83  294.97 2589
1 0.78  295.13 2590
1 0.75  295.3 2591
1 0.73  295.43 2592
1 0.78  295.6 2593
1 0.78  295.74 2594
0  295.85 2595
0  295.98 2596
1 0.85  296.14 2597
1 0.87  296.29 2598
1 0.7  296.42 2599
1 0.7  296.56 2600
1 0.81  296.66 2601
0  296.78 2602
