{
  "settings": {
    "title": "MY PROFILE",
    "title2": "USER DETAILS",
    "form": {
      "firstname": "First Name",
      "firstname.placeholder": "Your first name",
      "lastname": "Last Name",
      "lastname.placeholder": "Your last name",
      "language": "Language",
      "language.placeholder": "Language",
      "button.save": "Save",
      "button.save.list": "Save and proceed to LEI list",
      "button.setup2fa": "Setup 2-Factor Authentication",
      "personalIdentificationCode.placeholder": "Personal Identification Code",
      "personalIdentificationCode": "Personal Identification Code",
      "company": "Company",
      "company.placeholder": "Company",
      "jobTitle": "Job Title",
      "jobTitle.placeholder": "Job Title",
      "phoneCountry": "Phone Country",
      "phoneCountry.select.placeholder": "--- Select ---",
      "phoneCountry.placeholder": "Phone Country",
      "phoneNumber": "Phone Number",
      "phoneNumber.placeholder": "Phone Number",
      "country": "Country",
      "country.placeholder": "Country",
      "country.select.placeholder": "--- Select ---",
      "country.optgroup": "Operated by NCSD",
      "countryOther.optgroup": "Other",
      "region": "Region",
      "region.placeholder": "Region",
      "region.select.placeholder": "--- Select ---",
      "city": "City",
      "city.placeholder": "City",
      "zip": "ZIP",
      "zip.placeholder": "ZIP",
      "street": "Street",
      "street.placeholder": "Street",
      "house": "House",
      "house.placeholder": "House",
      "building": "Suite",
      "building.placeholder": "Suite"
    },
    "messages": {
      "info": {
        "complete": "Please complete Your profile."
      },
      "error": {
        "fail": "<strong>An error has occurred!</strong> Settings could not be saved.",
        "emailexists": "<strong>Email is already in use!</strong> Please choose another one."
      },
      "success": "<strong>Settings saved!</strong>",
      "validate": {
        "firstname": {
          "required": "Your first name is required.",
          "minlength": "Your first name is required to be at least 1 character",
          "maxlength": "Your first name cannot be longer than 50 characters"
        },
        "lastname": {
          "required": "Your last name is required.",
          "minlength": "Your last name is required to be at least 1 character",
          "maxlength": "Your last name cannot be longer than 50 characters"
        },
        "personalIdentificationCode": {
          "minlength": "This field is required to be at least 1 character",
          "maxlength": "This field cannot be longer than 256 characters"
        },
        "company": {
          "minlength": "This field is required to be at least 1 character",
          "maxlength": "This field cannot be longer than 256 characters"
        },
        "jobTitle": {
          "minlength": "This field is required to be at least 1 character",
          "maxlength": "This field cannot be longer than 256 characters"
        },
        "phoneCountry": {
          "required": "This field is required.",
          "minlength": "This field is required to be at least 1 character",
          "maxlength": "This field cannot be longer than 256 characters"
        },
        "phoneNumber": {
          "required": "This field is required.",
          "minlength": "This field is required to be at least 1 character",
          "maxlength": "This field cannot be longer than 256 characters",
          "pattern": "This field should follow phone pattern '{{pattern}}' without country code."
        },
        "country": {
          "required": "This field is required.",
          "minlength": "This field is required to be at least 1 character",
          "maxlength": "This field cannot be longer than 256 characters"
        },
        "region": {
          "required": "This field is required.",
          "minlength": "This field is required to be at least 1 character",
          "maxlength": "This field cannot be longer than 256 characters"
        },
        "city": {
          "required": "This field is required.",
          "minlength": "This field is required to be at least 1 character",
          "maxlength": "This field cannot be longer than 256 characters"
        },
        "zip": {
          "minlength": "This field is required to be at least 1 character",
          "maxlength": "This field cannot be longer than 256 characters",
          "pattern": "This field should follow pattern for 'ZIP'."
        },
        "street": {
          "required": "This field is required.",
          "minlength": "This field is required to be at least 1 character",
          "maxlength": "This field cannot be longer than 256 characters"
        }
      }
    }
  }
}
