{
  "leiApp": {
    "contactUs": {
      "home": {
        "title": "Contact requests",
        "createLabel": "Create a new Contact request",
        "createOrEditLabel": "Create or edit a Contact request",
        "search": "Search for Contact request"
      },
      "created": "A new Contact request is created with identifier {{ param }}",
      "updated": "A Contact request is updated with identifier {{ param }}",
      "deleted": "A Contact request is deleted with identifier {{ param }}",
      "delete": {
        "question": "Are you sure you want to delete Contact request {{ id }}?"
      },
      "detail": {
        "title": "Contact Us"
      },
      "contactName": "Name",
      "contactEmail": "Email",
      "issueSubject": "Subject",
      "issueMessage": "Description"
    }
  }
}
