{
  "activate": {
    "title": "Activation",
    "title.setup2fa": "Setup 2-Factor Authentication",
    "title.complete": "Registration",
    "messages": {
      "processing": "Your user account is being activated...",
      "activated": "Your user account has been activated.",
      "success": "This service requires 2-factor authentication. Please download the Google Authenticator app and install it on your smartphone: <a href=\"https://play.google.com/store/apps/details?id=com.google.android.apps.authenticator2\">Android</a> or <a href=\"https://itunes.apple.com/us/app/google-authenticator/id388497605\">iPhone</a>. To associate Google Authenticator with your account, scan the QR-code below with your Google Authenticator app on your smartphone.",
      "skip": "If you do not wish to set up Google Authenticator right now, you can request one time code via email once logging in. Please note that you will be able to set up Google Authenticator later on.",
      "skipped": "<strong>Thank you for registering to NasdaqLEI! You chose to setup Google Authenticator later, so now you can log in to your account using one time code via email, setup Google Authenticator to complete registration and start managing LEI codes.</strong>",
      "complete": "<strong>Thank you for registering to NasdaqLEI! Now you can log in to your account and start managing LEI codes.</strong>",
      "reactivated": "<strong>Your user account activation has been expired.</strong> Please check your email for new confirmation and proceed user activation within 30 minutes.",
      "error": "<strong>Your user could not be activated.</strong> Please use the registration form to sign up."
    },
    "form": {
      "skip": "Skip",
      "complete": "Complete registration",
      "login": "Go to Login"
    }
  }
}
