{
  "leiApp": {
    "dataQualityAudit": {
      "home": {
        "title": "Data Quality Audit",
        "search": "Search for Data Quality Audit entries",
        "description": "Displays tracked user activity for LEI records and user actions (maximum 100 entries)."
      },
      "view": {
        "title": "View data quality audit track entry"
      },
      "leiSearch": {
        "title": "Search for LEI",
        "info": "Select one LEI from list by criteria.",
        "search": "Search",
        "placeholder": "Search for LEI"
      },
      "userSearch": {
        "title": "Search for user",
        "info": "Select one user from list by criteria.",
        "search": "Search",
        "placeholder": "Search for user"
      },
      "login": "Username",
      "lei": "LEI",
      "changeDate": "Track date",
      "fromDate": "Tracked from",
      "toDate": "Tracked to",
      "fromTime": "Time from",
      "toTime": "Time to",
      "changeType": "Type",
      "changeReason": "Reason",
      "changeJson": "Data",
      "added": "Data added",
      "updatedFrom": "Data updated from",
      "updatedTo": "Data updated to",
      "deleted": "Data deleted",
      "user": "User Data",
      "leiData": "LEI",
      "rrDacData": "Direct Parent Relationship",
      "rrUacData": "Ultimate Parent Relationship",
      "repexDacData": "Direct Parent Exception",
      "repexUacData": "Ultimate Parent Exception",
      "pniDacData": "Direct Parent PNI",
      "pniUacData": "Ultimate Parent PNI",
      "attribute": "Attribute",
      "value": "Value"
    }
  }
}
