{
    "version": "1.0",
    "status": "Activated",
    "operation": "Scale In",
    "context": {
        "timestamp": "2021-05-16T20:47:16.3197297Z",
        "id": "\/subscriptions\/4f32e39b-6c30-4a81-9ca6-30edf8e9f6aa\/resourceGroups\/aegirWebhookTest\/providers\/microsoft.insights\/autoscalesettings\/aegirWebhookTestScaleSet-Autoscale-66",
        "name": "aegirWebhookTestScaleSet-Autoscale-66",
        "details": "Autoscale successfully started scale operation for resource 'aegirWebhookTestScaleSet' from capacity '2' to capacity '1'",
        "subscriptionId": "4f32e39b-6c30-4a81-9ca6-30edf8e9f6aa",
        "resourceGroupName": "aegirwebhooktest",
        "resourceName": "aegirWebhookTestScaleSet",
        "resourceType": "microsoft.compute\/virtualmachinescalesets",
        "resourceId": "\/subscriptions\/4f32e39b-6c30-4a81-9ca6-30edf8e9f6aa\/resourceGroups\/aegirWebhookTest\/providers\/Microsoft.Compute\/virtualMachineScaleSets\/aegirWebhookTestScaleSet",
        "portalLink": "https:\/\/portal.azure.com\/#resource\/subscriptions\/4f32e39b-6c30-4a81-9ca6-30edf8e9f6aa\/resourceGroups\/aegirWebhookTest\/providers\/Microsoft.Compute\/virtualMachineScaleSets\/aegirWebhookTestScaleSet",
        "resourceRegion": "canadaeast",
        "oldCapacity": "2",
        "newCapacity": "1"
    },
    "properties": {}
}
