0001	1	0726001:10
0007	1	0721263:0.5
0064	1	0725016:0.0075
0015	1	1080001:2.5
0018	2	1060100:0.075	1060101:0.075
0019	2	1060100:0.075	1060101:0.075
0058	1	0723030:0.85
0110	1	0725028:0.1
0111	1	0725018:0.015
0112	1	0725019:0.015
0113	1	0725020:0.015
0120	1	0725021:0.015
0121	1	0725022:0.015
0122	1	0725023:0.015
0124	1	0725024:0.015
3032	1	0721120:15
3102	6	1088000:100	1088000:90	1088000:80	1088000:75	1088000:50	1088000:25
3120	1	1088000:100
3130	1	0723017:50
3131	1	0723017:52
3132	1	0723017:54
3133	1	0723017:56
3134	1	0723017:58
3135	1	0723017:60
3136	1	0723017:62
3137	1	0723017:65
3141	1	0721533:0.75
3142	1	0721537:0.25
3143	1	0721540:0.85
3144	1	0721534:0.75
3145	1	0721538:0.25
3146	1	0721540:0.85
3147	1	0721535:0.75
3148	1	0721539:0.25
3149	1	0721540:0.85
3155	1	0721536:0.75
3156	1	0721540:0.85
5045	1	0723085:1.85
5046	1	0723085:1.85
5049	1	0723085:1.85
5050	1	0723085:1.85
5051	1	0723085:15
5055	1	0725016:0.25
5059	1	0723088:100
6000	1	0721010:5
6001	1	0721011:5
6002	1	0721012:5
6003	1	0721013:5
6004	1	0721014:5
6005	1	0721015:5
7001	1	0726011:100
7002	1	0726012:100
7003	1	0726015:100
7004	1	0726013:100
7005	1	0726014:100
7006	5	1088000:100	1088000:100	1088000:100	1088000:100	1088000:100
8415	5	1088001:100	1088001:100	1088001:100	1088001:100	1088001:100
8416	1	1088001:2.5
8500	1	0721258:75