﻿0001 Faisant 0001 0104 0001 33 0005 0006 0000 0036 0001 0006 1000 0500 0000 0000 0005 1000000 1001000 0
0002 Tourterelle 0001 0304 0007 81 0015 0016 0000 0037 0001 0006 1000 0500 0000 0000 0012 1000000 1001000 0
0003 Rouge-Gorge 0001 0132 0012 183 0031 0035 0000 0036 0001 0008 1000 0500 0000 0000 0016 1000000 1001000 0
0004 Apparition 0001 0108 0017 303 0042 0046 0000 0069 0001 0008 1000 0500 0000 0000 0020 1000000 1001000 0
0005 Fantôme 0001 0108 0022 548 0053 0060 0000 0071 0001 0008 1000 0500 0000 0000 0022 1000010 1001010 0
0006 SerpentAilé 0001 0203 0027 667 0065 0073 0000 0073 0001 0008 1000 0500 0000 0000 0027 1000010 1001010 0
0007 Bandit 0001 0201 0032 817 0081 0089 0000 0075 0001 0008 1000 0500 0000 0000 0031 1000010 1001010 0
0008 RatDeFeu 0001 0202 0037 999 0103 0114 0000 0078 0001 0008 1000 0500 0000 0000 0036 1000010 1001010 0
0009 EspritDuFeu 0001 0202 0042 1828 0119 0133 0000 0075 0001 0008 1000 0500 0000 0000 0052 1000020 1001020 0
0010 Macaque 0001 0156 0047 2199 0156 0173 0000 0078 0001 0008 1000 0500 0000 0000 0058 1000020 1001020 0
0011 Gorille 0001 0156 0052 2643 0200 0222 0000 0079 0001 0008 1000 0500 0000 0000 0063 1000020 1001020 0
0012 GibbonFoudre 0001 0103 0057 3184 0253 0281 0000 0082 0001 0008 1000 0500 0000 0000 0069 1000020 1001020 0
0013 HommeSerpent 0001 0204 0062 4771 0315 0350 0000 0083 0001 0008 1000 0500 0000 0000 0089 1000030 1001030 0
0014 MonstreSable 0001 0131 0067 5760 0397 0439 0000 0087 0001 0008 1000 0500 0000 0000 0098 1000030 1001030 0
0015 MonstreHerbe 0001 0105 0072 7358 0448 0496 0000 0083 0001 0008 1000 0500 0000 0000 0106 1000030 1001030 0
0016 MonstreRoc 0001 0105 0077 8459 0532 0589 0000 0086 0001 0008 1000 0500 0000 0000 0114 1000030 1001030 0
0017 FantômeSang 0001 0200 0082 11673 0624 0691 0000 0087 0001 0012 1000 0500 0000 0000 0140 1002000 1001040 0
0018 HommeOiseau 0001 0205 0087 13422 0731 0810 0000 0085 0001 0008 1000 0500 0000 0000 0149 1002000 1001040 0
0019 RoiAigle 0001 0205 0092 15432 0855 0946 0000 0085 0001 0010 1000 1000 0000 0000 0156 1002000 1001040 0
0020 BatTombale 0001 0206 0102 24472 1134 1253 0000 0086 0001 0010 1000 1000 0000 0000 0176 1002010 1002030 0
0021 PouleVolante 0001 0304 0003 33 0007 0008 0004 0036 0001 0008 1000 1000 0000 0070 0005 1000000 1001000 0
0022 TétrasBleu 0001 0304 0010 81 0019 0020 0012 0037 0001 0008 1000 1000 0000 0070 0012 1000010 1001000 0
0023 Grive 0001 0332 0015 183 0039 0044 0034 0036 0001 0008 1000 1000 0000 0070 0016 1000020 1001000 0
0024 FantômeDeGuerre 0001 0308 0020 303 0053 0058 0048 0069 0001 0008 1000 1000 0000 0070 0020 1000020 1001010 0
0025 FantômeDeCombat 0001 0308 0025 548 0067 0075 0074 0071 0001 0008 1000 1000 0000 0070 0022 1000030 1001010 0
0026 SerpentDeFeu 0001 0403 0030 667 0082 0092 0098 0073 0001 0008 1000 0500 0000 0070 0027 1000030 1001020 0
0027 Forban-Maitre 0001 0401 0035 817 0102 0112 0120 0075 0001 0008 1000 0500 0000 0070 0031 1000030 1001020 0
0028 ElfeBleu 0001 0402 0040 999 0129 0143 0160 0078 0001 0008 1000 0500 0000 0070 0036 1002000 1001020 0
0029 RoiElfe 0001 0402 0045 1828 0149 0167 0200 0075 0001 0008 1000 0500 0000 0070 0052 1002000 1001020 0
0030 SingeFuté 0001 0356 0050 2199 0195 0217 0250 0078 0009 0008 1000 0500 1001 0070 0058 1002000 1001020 0
0031 GorilleHurleur 0001 0356 0055 2643 0250 0278 0300 0079 0009 0008 1000 0500 1150 0070 0063 1002010 1001020 0
0032 GibbonDesNeige 0001 0303 0060 3184 0317 0352 0350 0082 0001 0008 1000 0500 0000 0070 0069 1002010 1001020 0
0033 Medusa 0001 0404 0065 4771 0394 0438 0400 0083 0001 0008 1000 0500 0000 0070 0089 1002010 1001020 0
0034 DémonDeSable 0001 0131 0070 5760 0497 0549 0450 0087 0001 0008 1000 0500 0000 0060 0098 1002010 1001020 0
0035 MonstreTerre 0001 0305 0075 7358 0560 0620 0450 0083 0001 0008 1000 0500 0000 0060 0106 1002010 1001020 0
0037 MonstreSanglant 0001 0400 0085 11673 0780 0864 0550 0087 0001 0008 1000 0500 0000 0060 0140 1002020 1001020 0
0038 Roioiseau 0001 0405 0090 13422 0914 1013 0600 0091 0009 0008 1000 0500 1002 0060 0149 1002020 1001020 0
0039 AigleArgenté 0001 0405 0095 15432 1069 1183 0700 0092 0001 0010 1000 1000 0000 0060 0156 1002020 1001020 0
0040 BanditDeCanneb 0001 0401 0100 20697 1125 1504 0800 0086 0001 0010 1000 1000 0000 0060 0167 1002020 1001020 0
0051 MonstrePierre 0001 0136 0042 7358 0120 0140 0000 0083 0001 0015 1000 0500 0000 0000 0064 0000 0000 0
0055 BanditL97 0001 0201 0097 20697 0900 1203 0000 0086 0001 0010 1000 1000 0000 0000 0167 1002010 1002030 0
0056 BatSanglant 0001 0148 0107 28140 1200 1602 0000 0085 0001 0010 1000 1000 0000 0000 0184 1002010 1002030 0
0057 MonstreTaureau 0001 0117 0112 35050 1300 1880 0000 0086 0001 0010 1000 1000 0000 0000 0198 1002020 1002040 0
0058 DémonRougeL117 0001 0197 0117 60460 1500 2228 0000 0086 0001 0010 1000 1000 0000 0000 0298 1002020 1002040 0
0064 FantômeLourdL23 0001 0508 0023 1096 0056 0063 0000 0071 0002 0015 1000 0500 0000 0000 0022 1000030 1001010 0
0065 SerpentAiléL28 0001 0603 0028 1334 0069 0077 0000 0073 0002 0015 1000 0250 0000 0000 0027 1000030 1001020 0
0066 BanditL33 0001 0601 0033 2451 0086 0094 0000 0075 0002 0015 1000 0250 0000 0000 0031 1000030 1001020 0
0067 RatDeFeuL38 0001 0602 0038 2997 0109 0120 0000 0078 0002 0015 1000 0250 0000 0000 0036 1002000 1001020 0
0068 EspritDuFeuL43 0001 0602 0043 5484 0125 0140 0000 0075 0002 0015 1000 0250 0000 0000 0052 1002000 1001020 0
0069 MacaqueL48 0001 0556 0048 6597 0164 0182 0000 0078 0002 0015 1000 0250 0000 0000 0058 1002000 1001020 0
0070 GorilleL53 0001 0556 0053 7929 0210 0234 0000 0079 0002 0015 1000 0250 0000 0000 0063 1002010 1001020 0
0071 GibbonFoudreL58 0001 0503 0058 9552 0266 0296 0000 0082 0002 0015 1000 0250 0000 0000 0069 1002010 1001020 0
0072 HommeSerpentL63 0001 0604 0063 14313 0331 0368 0000 0083 0002 0015 1000 0250 0000 0000 0089 1002010 1001020 0
0073 MonstreSableL68 0001 0531 0068 17280 0417 0461 0000 0087 0002 0015 1000 0250 0000 0000 0098 1002010 1001020 0
0074 MonstreHerbeL73 0001 0505 0073 22074 0471 0521 0000 0083 0002 0015 1000 0250 0000 0000 0106 1002010 1001020 0
0075 MonstreRocL78 0001 0505 0078 16918 0559 0619 0000 0086 0002 0015 1000 0250 0000 0000 0114 1002010 1001020 0
0076 SanguinaireL83 0001 0200 0083 23346 0656 0726 0000 0087 0002 0015 1000 0250 0000 0000 0140 1002020 1001020 0
0077 HommeOiseauL88 0001 0605 0088 26844 0768 0851 0000 0091 0002 0015 1000 0250 0000 0000 0149 1002020 1001020 0
0078 RoiAigleL93 0001 0605 0093 30864 0898 0994 0000 0092 0002 0018 1000 0250 0000 0000 0156 1002020 1001020 0
0079 BanditL98 0001 0601 0098 41394 0945 1263 0000 0086 0001 0018 1000 0500 0000 0000 0167 1002020 1001020 0
0080 BatTombalL103 0001 0606 0103 48944 1191 1316 0000 0086 0002 0018 1000 0500 0000 0000 0176 1002020 1001020 0
0081 BatSanglantL108 0001 0548 0108 56280 1260 1682 0000 0089 0001 0018 1000 0500 0000 0000 0184 1002020 1001020 0
0082 MinotaureL113 0001 0517 0113 65535 1365 1974 0000 0086 0001 0018 1000 0500 0000 0000 0198 1002020 1001020 0
0083 DémonRougeL118 0001 0597 0118 65535 1575 2339 0000 0086 0001 0018 1000 0500 0000 0000 0298 1002020 1001020 0
0084 Brigand 0001 0201 0098 40000 0992 1326 0900 0086 0001 0010 1000 0500 0000 0060 0167 1002020 1001020 0
0085 RoiBandit 0001 0201 0103 45000 1039 1389 1000 0086 0001 0020 1000 0500 0000 0070 0167 1002020 1001020 0
0086 Vampire 0001 0148 0108 50000 1323 1766 0900 0089 0001 0010 1000 0500 0000 0060 0184 1002020 1001020 0
0087 RoiVampire 0001 0148 0113 55000 1386 1850 1000 0089 0001 0020 1000 0500 0000 0070 0184 1002020 1001020 0
0088 DiableSanglant 0001 0197 0118 60000 1653 2455 0900 0086 0001 0010 1000 0500 0000 0060 0298 1002020 1001020 0
0089 RoiDémon 0001 0197 0120 65000 1732 2572 1000 0086 0001 0020 1000 0500 0000 0070 0298 1002020 1001020 0
0090 BatVolant 0001 0406 0105 24472 1418 1567 0900 0086 0001 0010 1000 1000 0000 0060 0176 1002020 1001020 0
0091 RoiBatSanglant 0001 0348 0110 28140 1500 2003 1000 0089 0001 0010 1000 1000 0000 0060 0184 1002020 1001020 0
0092 DiableTaureau 0001 0317 0115 35050 1625 2350 1200 0086 0001 0010 1000 1000 0000 0060 0198 1002020 1001020 0
0093 DémonVert 0001 0397 0120 60460 1875 2785 1200 0086 0001 0010 1000 1000 0000 0060 0298 1002020 1001020 0
0105 MonstreRocL17 0001 0136 0017 606 0042 0050 0000 0069 0001 0010 1000 1000 0000 0000 0020 1000020 1001010 0
0106 MonstreRocL42 0001 0136 0042 3656 0119 0146 0000 0075 0001 0010 1000 1000 0000 0000 0052 1002000 1001020 0
0107 MonstreRocL72 0001 0136 0072 14716 0448 0545 0000 0083 0001 0015 1000 1000 0000 0000 0106 1002010 1001020 0
0108 MonstreRocL92 0001 0136 0092 30864 0855 1040 0000 0092 0001 0015 1000 1000 0000 0000 0156 1002020 1001020 0
0110 Vipère 0001 0203 0027 400 0065 0073 0000 0073 0001 0008 1000 0500 0000 0000 0027 1000010 1001010 0
0111 Larron 0001 0201 0032 600 0081 0089 0000 0075 0001 0008 1000 0500 0000 0000 0031 1000010 1001010 0
0112 RatDifférent 0001 0202 0037 800 0103 0114 0000 0078 0001 0008 1000 0500 0000 0000 0036 1000010 1001010 0
0113 GénieDuFeu 0001 0202 0042 1500 0119 0133 0000 0075 0001 0008 1000 0500 0000 0000 0052 1000020 1001020 0
0120 PetitMacaque 0001 0156 0047 1759 0156 0173 0000 0078 0001 0008 1000 0500 0000 0000 0058 1000020 1001020 0
0121 GorilleElfique 0001 0156 0052 2114 0200 0222 0000 0079 0001 0008 1000 0500 0000 0000 0063 1000020 1001020 0
0122 GorilleLent 0001 0103 0057 2547 0253 0281 0000 0082 0001 0008 1000 0500 0000 0000 0069 1000020 1001020 0
0123 MonstreSerpent 0001 0204 0062 3817 0315 0350 0000 0083 0001 0008 1000 0500 0000 0000 0089 1000030 1001030 0
0124 ElfeDeSable 0001 0131 0067 4608 0397 0439 0000 0087 0001 0008 1000 0500 0000 0000 0048 1000030 1001030 0
0125 MonstrePrimitif 0001 0105 0072 5886 0448 0496 0000 0083 0001 0008 1000 0500 0000 0000 0056 1000030 1001030 0
0126 MonstrePuissant 0001 0105 0077 6767 0532 0589 0000 0086 0001 0008 1000 0500 0000 0000 0056 1000030 1001030 0
0127 SabreDemoniaque 0001 0200 0082 9338 0624 0691 0000 0087 0001 0012 1000 0500 0000 0000 0072 1002000 1001040 0
0900 Garde 0004 0900 0200 50000 50000 50000 0000 0085 0015 0015 1000 1000 8036 0000 0000 1002020 1001020 0
0910 GardePatrouille 0004 0910 0060 5000 0500 1000 50000 0085 0002 0015 1000 1000 8036 0000 0000 0000 0000 0
0911 GardePatrouille 0004 0910 0060 5000 2000 5000 50000 0085 0002 0015 1000 1000 0000 0000 0000 0000 0000 0
0920 Reviver 0005 0910 0500 50000 0000 0000 5000 0100 0015 0015 1000 1000 1100 0100 0000 0000 0000 400
1400 SerpentEnorme 0002 0203 0042 1828 0060 0060 0020 0070 0001 0008 2000 0500 1000 0000 0000 1000020 1001020 0
1401 Bandit-Leader 0002 0201 0052 2643 0100 0100 0020 0070 0001 0008 2000 0500 1000 0020 0000 1000020 1001020 0
1402 GénieEnorme 0002 0202 0057 3184 0160 0160 0050 0070 0001 0008 2000 0500 1000 0020 0000 1002010 1001020 0
1403 Forban-Acolyte 0002 0401 0062 4771 0220 0220 0050 0070 0001 0008 2000 0500 1000 0020 0000 1002010 1001020 0
1404 VieuxForban 0002 0401 0067 5760 0260 0260 0080 0070 0001 0008 2000 0500 1000 0020 0000 1002010 1001020 0
1405 Forban-Leader 0002 0211 0072 7358 0300 0300 0080 0070 0001 0008 2000 0500 1000 0020 0000 1002010 1001020 0
1406 Forban-Chef 0002 0211 0078 8459 0360 0360 0100 0070 0001 0008 2000 0500 1000 0020 0000 1002010 1001020 0
1407 GorilleEnorme 0002 0156 0082 11673 0440 0440 0100 0070 0001 0008 2000 0500 1000 0020 0000 1002020 1001020 0
1408 VieuxGorille 0002 0103 0088 13422 0500 0500 0150 0070 0009 0008 2000 0500 1000 0020 0000 1002020 1001020 0
1409 GorilleEtrange 0002 0503 0092 15432 0600 0600 0150 0070 0001 0010 2000 1000 1000 0020 0000 1002020 1001020 0
1410 VielHommeSerp. 0002 0204 0097 20697 0620 0620 0200 0070 0001 0010 2000 1000 1000 0020 0000 1002020 1001020 0
1411 SerpentDeLaNuit 0002 0404 0102 24472 0700 0700 0200 0070 0001 0010 2000 1000 1000 0020 0000 1002020 1001020 0
1412 VieuxSerpent 0002 0604 0107 28140 0800 0800 0250 0070 0001 0010 2000 1000 1000 0020 0000 1002020 1001020 0
1413 SerpentEtrange 0002 0244 0112 35050 0900 0900 0250 0070 0001 0010 2000 1000 1000 0020 0000 1002020 1001020 0
1414 Basilic 0002 0244 0117 60460 1000 1000 0300 0070 0001 0010 2000 1000 1000 0020 0000 1002020 1001020 0
3120 BêteDeGuilde 0006 0240 0120 65535 5000 5000 60000 0100 0010 0010 3000 0500 0000 0099 0000 0000 0000 0
5045 SoldatTorve 0001 0263 0120 6902 1903 2114 4311 0090 0001 0020 2000 0500 0000 0000 0500 1002050 1002040 0
5046 SoldatD`enfers 0001 0363 0120 6902 1903 2114 4311 0090 0001 0020 2000 0500 0000 0000 0500 1002050 1002040 0
5049 DémonD`enfers 0001 0165 0121 10353 1903 2114 5174 0090 0003 0025 1200 0500 0000 0000 0500 1002050 1002040 0
5050 LanceD`enfers 0001 0265 0121 10272 1903 2115 5175 0090 0003 0025 1200 0500 0000 0000 0500 1002050 1002040 0
5051 ComteInfernal 0001 0266 0123 8217 2379 2643 4743 0090 0006 0025 1200 0500 0000 0035 0500 1002050 1002040 0
5053 ChatD`enfers 0001 0230 0122 6794 2085 2317 4314 0090 0001 0025 0600 0500 0000 0000 0500 1002050 1002040 0
5054 ChienD`enfers 0001 0179 0122 6794 2085 2317 4314 0090 0001 0025 0500 0500 0000 0000 0500 1002050 1002040 0
5055 GardienD`enfer 0002 0327 0122 3934 0569 0569 1724 0060 0005 0025 2500 0500 4075 0000 0500 1002050 1002040 0
5056 TrollInfernal 0001 0353 0123 20368 2085 2316 5175 0090 0002 0025 1000 0500 0000 0000 0500 1002050 1002040 0
5057 SerpentD`enfers 0001 0262 0122 6794 2085 2317 4314 0090 0003 0025 1000 0500 0000 0000 0500 1002050 1002040 0
5058 Dryade 0002 0152 0124 20707 0985 0985 7473 0080 0010 0025 2000 0500 4076 0080 0000 0000 0000 0
5059 PlutoFinal 0003 0168 0126 65535 2850 3950 7927 0090 0003 0025 1000 0500 0000 0090 0000 0000 0000 0
8100 HumainMessager 0002 0108 0022 1100 0120 0120 0025 0009 0009 0010 1300 0500 3000 0052 0048 1002050 1001040 0
8101 SerpentMessager 0002 0243 0027 1200 0150 0150 0033 0010 0009 0010 1300 0500 3001 0062 0060 1002050 1001040 0
8102 BanditMessager 0002 0241 0032 1600 0200 0200 0037 0012 0009 0010 1300 0500 3002 0072 0068 1002050 1001040 0
8103 RatMessager 0002 0242 0037 2000 0240 0260 0085 0013 0009 0010 1300 0500 3003 0084 0080 1002050 1001040 0
8104 ElfeMessager 0002 0242 0042 3600 0280 0280 0100 0015 0009 0010 1300 0500 3004 0086 0096 1002050 1001040 0
8105 SingeMessager 0002 0196 0047 4400 0300 0300 0105 0016 0009 0010 1300 0500 3005 0087 0120 1002050 1001040 0
8106 GorilleMessager 0002 0196 0052 5300 0330 0330 0140 0018 0009 0010 1300 0500 3006 0087 0144 1002050 1001040 0
8107 GibbonFoudrMsgr 0002 0103 0057 6300 0380 0380 0270 0019 0009 0010 1300 0500 3007 0089 0168 1002050 1001040 0
8108 HommeSerp.Msgr 0002 0244 0062 9500 0450 0450 0320 0021 0009 0010 1300 0500 3008 0091 0200 1002050 1001040 0
8109 MonstreSablMsgr 0002 0171 0067 11000 0539 0539 0400 0022 0009 0010 1300 0500 3009 0092 0240 1002050 1001040 0
8110 MonstreHerbMsgr 0002 0145 0072 14000 0590 0590 0405 0024 0009 0010 1300 0500 3010 0094 0264 1002050 1001040 0
8111 MonstreRocMsgr 0002 0145 0077 17000 0680 0680 0410 0025 0009 0010 1300 0500 3011 0094 0288 1002050 1001040 0
8112 FantômeSangMsgr 0002 0240 0082 22000 0760 0760 0415 0027 0009 0010 1300 0500 3012 0095 0320 1002050 1001040 0
8113 HommeOiseauMsgr 0002 0245 0087 26000 0780 0780 0420 0028 0009 0010 1300 0500 3013 0096 0336 1002050 1001040 0
8114 AigleMessager 0002 0245 0092 30000 0890 0890 0425 0030 0009 0010 1000 0500 3014 0096 0360 1002050 1001040 0
8115 VoleurMessager 0002 0241 0097 40000 1050 1050 0430 0030 0009 0010 1300 0500 3015 0097 0400 1002050 1001040 0
8116 BatMessager 0002 0246 0102 45000 1200 1200 0435 0033 0009 0010 1300 0500 3016 0097 0424 1002050 1001040 0
8117 BatSanglantMsgr 0002 0188 0107 50000 1600 1600 0440 0033 0009 0010 1300 0500 3017 0097 0440 1002050 1001040 0
8118 TaureauMessager 0002 0117 0112 55000 1800 1800 0445 0035 0009 0010 1300 0500 3018 0098 0480 1002050 1001040 0
8119 DémonMessager 0002 0197 0117 60460 2150 2150 2000 0037 0009 0010 1000 0500 3019 0099 0520 1002050 1001040 0
8200 Aide-Humain 0001 0108 0022 1100 0100 0150 0086 0009 0001 0009 1000 0500 0000 0000 0048 1002050 1001040 0
8201 Aide-Serpent 0001 0243 0027 1200 0150 0160 0110 0010 0001 0009 1000 0500 0000 0000 0060 1002050 1001040 0
8202 Aide-Bandit 0001 0241 0032 1600 0190 0220 0136 0012 0001 0009 1000 0500 0000 0000 0068 1002050 1001040 0
8203 Aide-Rat 0001 0242 0037 2000 0250 0250 0175 0013 0001 0009 1000 0500 0000 0000 0080 1002050 1001040 0
8204 Aide-Elfe 0001 0242 0042 3600 0250 0280 0205 0015 0001 0009 1000 0500 0000 0000 0096 1002050 1001040 0
8205 Aide-Singe 0001 0196 0047 4400 0280 0320 0243 0016 0001 0009 1000 0500 0000 0000 0120 1002050 1001040 0
8206 Aide-Gorille 0001 0196 0052 5300 0310 0350 0283 0018 0001 0009 1000 0500 0000 0000 0144 1002050 1001040 0
8207 AideGibbonFoudr 0001 0103 0057 6300 0360 0400 0378 0019 0001 0009 1000 0500 0000 0000 0168 1002050 1001040 0
8208 Aide-HommeSerp. 0001 0244 0062 9500 0430 0470 0434 0021 0001 0009 1000 0500 0000 0000 0200 1002050 1001040 0
8209 Aide-Mon.Sable 0001 0171 0067 11000 0520 0550 0534 0022 0001 0009 1000 0500 0000 0000 0240 1002050 1001040 0
8210 Aide-Mon.Herbe 0001 0145 0072 14000 0570 0610 0593 0024 0001 0009 1000 0500 0000 0000 0264 1002050 1001040 0
8211 Aide-MonstreRoc 0001 0145 0077 17000 0660 0700 0686 0025 0001 0009 1000 0500 0000 0000 0288 1002050 1001040 0
8212 AideFantômeSang 0001 0240 0082 22000 0740 0780 0769 0027 0001 0009 1000 0500 0000 0000 0320 1002050 1001040 0
8213 AideHommeOiseau 0001 0245 0087 26000 0770 0800 0934 0028 0001 0009 1000 0500 0000 0000 0336 1002050 1001040 0
8214 Aide-Aigle 0001 0245 0092 30000 0870 0910 1059 0030 0001 0009 1000 0500 0000 0000 0360 1002050 1001040 0
8215 Aide-Voleur 0001 0241 0097 40000 1020 1100 1252 0030 0001 0009 1000 0500 0000 0000 0400 1002050 1001040 0
8216 Aide-Bat 0001 0246 0102 45000 1150 1250 1375 0033 0001 0009 1000 0500 0000 0000 0424 1002050 1001040 0
8217 AideBatSanglant 0001 0188 0107 50000 1550 1650 1630 0033 0001 0009 1000 0500 0000 0000 0440 1002050 1001040 0
8218 Aide-Taureau 0001 0117 0112 55000 1700 1900 1979 0035 0001 0009 1000 0500 0000 0000 0480 1002050 1001040 0
8219 Aide-Démon 0001 0197 0117 60460 2050 2250 4000 0037 0001 0009 0700 0500 0000 0050 0520 1002050 1001040 0
8300 RoiFantôme 0001 0108 0022 30000 0150 0160 0540 0018 0001 0009 1000 0500 0000 0096 0048 1002050 1001040 0
8301 Roi-SerpentAilé 0001 0443 0027 40000 0180 0200 0600 0019 0001 0009 1000 0500 0000 0096 0060 1002050 1001040 0
8303 RoiRat 0001 0442 0037 45000 0270 0300 0800 0022 0001 0009 1000 0500 0000 0095 0080 1002050 1001040 0
8304 Elfe-Maître 0001 0442 0042 45000 0300 0330 0815 0024 0001 0009 1000 0500 0000 0094 0096 1002050 1001040 0
8305 RoiSinge 0001 0196 0047 45000 0350 0370 0860 0025 0001 0009 1000 0500 0000 0095 0120 1002050 1001040 0
8306 RoiGorille 0001 0196 0052 45000 0400 0420 1050 0027 0001 0009 1000 0500 0000 0094 0144 1002050 1001040 0
8307 RoiGibbonFoudre 0001 0103 0057 45000 0460 0480 1140 0028 0001 0009 1000 0500 0000 0094 0168 1002050 1001040 0
8308 RoiHommeSerpent 0001 0244 0062 46000 0530 0550 1205 0030 0001 0009 1000 0500 0000 0095 0200 1002050 1001040 0
8309 RoiMonstreSable 0001 0171 0067 47000 0610 0630 1668 0030 0001 0009 1000 0500 0000 0093 0240 1002050 1001040 0
8310 RoiMonstreHerbe 0001 0145 0072 47000 0670 0690 1700 0033 0001 0009 1000 0500 0000 0093 0264 1002050 1001040 0
8311 RoiMonstreRoc 0001 0145 0077 48000 0760 0780 1940 0033 0001 0009 1000 0500 0000 0093 0288 1002050 1001040 0
8312 RoiFantômeSang 0001 0240 0082 50000 0840 0860 1968 0035 0001 0009 1000 0500 0000 0092 0320 1002050 1001040 0
8313 RoiHommeOiseau 0001 0245 0087 60460 0880 0880 1770 0037 0001 0009 1000 0500 0000 0090 0336 1002050 1001040 0
8314 Aigle-Maître 0001 0245 0092 65535 0990 0990 1730 0037 0001 0009 1000 0500 0000 0091 0360 1002050 1001040 0
8315 RoiVoleur 0001 0241 0097 65535 1150 1150 1850 0039 0001 0009 1000 0500 0000 0091 0400 1002050 1001040 0
8316 RoiBat 0001 0246 0102 65535 1350 1350 30000 0041 0001 0009 1000 0500 0000 0091 0424 1002050 1001040 0
8317 RoiSanguinaire 0001 0188 0107 65535 1750 1750 30000 0043 0001 0009 1000 0500 0000 0092 0440 1002050 1001040 0
8318 RoiTaureau 0001 0117 0112 65535 2000 2000 30000 0045 0001 0009 1000 0500 0000 0092 0480 1002050 1001040 0
8319 RoiDiable 0001 0197 0117 65535 2250 2400 40000 0047 0001 0009 0600 0500 0000 0092 0520 1002050 1001040 0
8415 CoqD`étoile 0002 0304 0032 10000 2000 2000 0000 0075 0005 0008 1000 0500 1000 0010 0000 1000010 1001010 0
8416 CoqD`étoile 0002 0304 0032 10000 0081 0089 0000 0075 0001 0008 1000 0500 1000 0020 0000 1000010 1001010 0
8417 FantômeInfernal 0002 0274 0103 48944 0500 0500 1000 0086 0002 0018 1000 0500 1000 0020 0200 1002020 1001020 0
8418 DémonDeNuit 0002 0277 0120 60460 2000 2000 3000 0086 0001 0010 1000 1000 1000 0020 0200 1002020 1001020 0
8419 DémonD`eau 0002 0273 0120 30000 0700 0700 1200 0086 0001 0010 1000 1000 1000 0020 0000 1002020 1001020 0
8420 DémonD`eau 0002 0273 0120 30000 3000 4000 0000 0086 0001 0010 1000 1000 0000 0000 0000 1002020 1001020 0
8421 DémonD`eau 0002 0273 0120 30000 60000 60000 1200 0086 0010 0015 1000 1000 1000 0060 0240 1002020 1001020 0
8422 DémonD`eau 0001 0273 0120 30000 4875 5785 1200 0086 0005 0015 2000 1000 0000 0060 0160 1002020 1001020 0
8500 SeigneurD`eau 0002 0273 0120 60000 1400 1400 2400 0086 0001 0010 1000 1000 1000 0040 0000 1002020 1001020 200