Name,Sex,Age,Division,Equipment,BodyweightKg,WeightClassKg,Squat1Kg,Squat2Kg,Squat3Kg,Best3SquatKg,Bench1Kg,Bench2Kg,Bench3Kg,Bench4Kg,Best3BenchKg,Deadlift1Kg,Deadlift2Kg,Deadlift3Kg,Best3DeadliftKg,TotalKg,Event,Place,Country
Tanja van Huizen,F,,Junior,Single-ply,63,67.5,130,145,-157.5,145,65,70,72.5,,72.5,120,-132.5,132.5,132.5,350,SBD,1,Netherlands
Angelika Jensch,F,,M45-49,Single-ply,56.3,60,,,,,60,62.5,67.5,,67.5,,,,,67.5,B,1,Germany
Karin Heindl,F,,M50-54,Single-ply,50,52,,,,,,,,,,90,100,105,105,105,D,1,Austria
Angela McNamara,F,,Open,Single-ply,65.8,67.5,145,155,-166,155,-80,80,86,87.5,86,160,170,177.5,177.5,418.5,SBD,1,Ireland
Jodi Law,F,,Open,Single-ply,71.8,75,120,130,-137.5,130,55,60,-65,,60,120,132.5,-142.5,132.5,322.5,SBD,2,England
Bianca van Beugen,F,,Open,Single-ply,71.6,75,120,130,-140,130,85,-90,-90,,85,150,160,-170,160,375,SBD,1,Netherlands
Sigrid Vlak,F,,Open,Single-ply,45.5,48,,,,,52.5,57.5,-60,,57.5,,,,,57.5,B,1,Netherlands
Beatrice Benecke,F,,Open,Single-ply,58,60,,,,,65,-70,-70,,65,,,,,65,B,1,Germany
Daniela Gollnik,F,,Open,Single-ply,66.7,67.5,,,,,-60,-65,65,,65,,,,,65,B,2,Germany
Angela McNamara,F,,Open,Single-ply,67.1,67.5,,,,,80,85,90,,90,,,,,90,B,1,Ireland
Violette Wycisk,F,,Open,Single-ply,60.6,67.5,,,,,,,,,,110,120,127.5,127.5,127.5,D,2,Germany
Angela McNamara,F,,Open,Single-ply,67.1,67.5,,,,,,,,,,150,,,150,150,D,1,Ireland
Alina Schmidt,F,,Teen,Single-ply,81.5,82.5,,,,,60,65,-70,,65,,,,,65,B,1,Germany
Barry Keehan,M,,Junior,Single-ply,67.3,67.5,210,225,-227.5,225,-120,120,127.5,,127.5,210,220,-222.5,220,572.5,SBD,1,Ireland
Darren Quinn,M,,Junior,Single-ply,74.2,75,-210,-220,-220,,,,,,,,,,,,SBD,DQ,Ireland
Vahan Harutyunyan,M,,Junior,Single-ply,78.9,82.5,210,222.5,232.5,232.5,140,150,155,,155,240,255,-262.5,255,642.5,SBD,1,Armenia
John Quinn,M,,Junior,Single-ply,88.3,90,-210,210,220,220,120,125,127.5,,127.5,-200,-200,-200,,,SBD,DQ,Ireland
Paul Fitzgerald,M,,Junior,Single-ply,99,100,220,-235,250,250,-175,-175,175,,175,-250,250,275,275,700,SBD,2,Ireland
Oliver Williamson,M,,Junior,Single-ply,99.1,100,260,-280,290,290,201,205,210,215,210,290,-305,-305,290,790,SBD,1,England
Stefan Raimund Irmer,M,,Junior,Single-ply,144.9,140+,,,,,,,,,,230,-255,-255,230,230,D,1,Germany
Barry Keehan,M,,Junior,Single-ply,69.3,75,,,,,,,,,,202.5,-220,220,220,220,D,1,Ireland
Lars Penther,M,,Junior,Single-ply,75.2,82.5,,,,,,,,,,170,185,-192.5,185,185,D,2,Germany
Darren Quinn,M,,Junior,Single-ply,77.4,82.5,,,,,,,,,,-180,180,200,200,200,D,1,Ireland
John Quinn,M,,Junior,Single-ply,89.4,90,,,,,110,120,130,,130,,,,,130,B,1,Ireland
John Quinn,M,,Junior,Single-ply,89.4,90,,,,,,,,,,170,-190,,170,170,D,1,Ireland
Rocco Göpfarth,M,,M40-44,Single-ply,80.9,82.5,220,240,-250,240,152.5,160,-162.5,,160,195,207.5,-215,207.5,607.5,SBD,1,Germany
Boris Sendatzki,M,,M40-44,Single-ply,120.8,125,300,320,-330,320,195,207.5,210,,210,270,-282.5,,270,800,SBD,2,Germany
Peter Bongers,M,,M40-44,Single-ply,114.4,125,325,345,-352.5,345,185,195,202.5,,202.5,285,300,310,310,857.5,SBD,1,Netherlands
Gunnar F Runnarsson,M,,M40-44,Single-ply,106.8,110,,,,,-170,170,-200,,170,,,,,170,B,1,Iceland
Gunnar F Runnarsson,M,,M40-44,Single-ply,106.8,110,,,,,,,,,,250,275,-290,275,275,D,1,Iceland
Dirk Schumann,M,,M40-44,Single-ply,74.3,75,,,,,140,150,155,,155,,,,,155,B,1,Germany
Waldemar Freiberg,M,,M40+,Single-ply,96.3,100,,,,,,,,,,260,-270,,260,260,D,1,Germany
Bernd Lage,M,,M45-49,Single-ply,75,75,150,160,,160,120,-127.5,-127.5,,120,150,165,172.5,172.5,452.5,SBD,1,Germany
Peter Malfa,M,,M45-49,Single-ply,94.4,100,255,270,-282.5,270,140,147.5,152.5,,152.5,260,,,260,682.5,SBD,2,Germany
David Smith,M,,M45-49,Single-ply,98.5,100,300,320,340,340,-215,215,-222.5,,215,240,260,-280,260,815,SBD,1,Ireland
Klaus Cech,M,,M45-49,Single-ply,102.3,110,180,200,207.5,207.5,105,115,117.5,,117.5,190,205,215,215,540,SBD,1,Germany
Günter Fuchs,M,,M45-49,Single-ply,114,125,-160,160,180,180,130,145,160,,160,165,180,192.5,192.5,532.5,SBD,1,Germany
Marco Capitani,M,,M45-49,Single-ply,98.4,100,,,,,135,140,145,,145,,,,,145,B,2,Luxembourg
Hermann Haraldsson,M,,M45-49,Single-ply,100,100,,,,,195,-207.5,-207.5,,195,,,,,195,B,1,Iceland
Andreas Hofmann,M,,M45-49,Single-ply,106.5,110,,,,,150,155,160,,160,,,,,160,B,5,Germany
Albert Hoekstra,M,,M45-49,Single-ply,103.8,110,,,,,180,190,195,,195,,,,,195,B,4,Netherlands
Paul Edmonds,M,,M45-49,Single-ply,106.5,110,,,,,200,210,220,,220,,,,,220,B,3,England
Tony Brown,M,,M45-49,Single-ply,106.6,110,,,,,245,-255,-255,,245,,,,,245,B,2,England
Ingvar Jóel Ingvarsson,M,,M45-49,Single-ply,109.8,110,,,,,240,253,260,,260,,,,,260,B,1,Iceland
Johan Kleijboer,M,,M45-49,Single-ply,122.8,125,,,,,180,-190,190,,190,,,,,190,B,3,Netherlands
Sigfried Scholder,M,,M45-49,Single-ply,110.4,125,,,,,180,190,200,,200,,,,,200,B,2,Germany
Frank Jungmann,M,,M45-49,Single-ply,117.4,125,,,,,190,205,-212.5,,205,,,,,205,B,1,Germany
Richard Fricker,M,,M45-49,Single-ply,151,140+,,,,,165,180,,,180,,,,,180,B,1,England
Richard Fricker,M,,M45-49,Single-ply,151,140+,,,,,,,,,,180,225,-242.5,225,225,D,1,England
Richard Fricker,M,,M45-49,Single-ply,151,140+,260,300,332.5,332.5,165,185,-200,,185,180,220,240,240,757.5,SBD,1,England
Markus Knetsch,M,,M45-49,Single-ply,53.6,56,,,,,70,80,-85,,80,,,,,80,B,1,Germany
Sergey Lopatin,M,,M45-49,Single-ply,74.1,75,,,,,140,-150.5,-150.5,,140,,,,,140,B,1,Russia
Vladimir Reshetkinov,M,,M45-49,Single-ply,80.3,82.5,,,,,170,190,-202.5,,190,,,,,190,B,1,Russia
Peter Malfa,M,,M45+,Single-ply,96.6,100,,,,,,,,,,250,-265,,250,250,D,1,Germany
Stefan Hillen,M,,M45+,Single-ply,82.1,82.5,,,,,,,,,,165,-175,185,185,185,D,1,Germany
Coert Hoppenbrouwers,M,,M50-54,Single-ply,80.6,82.5,210,-230,,210,140,150,155,,155,180,200,220,220,585,SBD,1,Netherlands
Ben Hartigan,M,,M50-54,Single-ply,88.6,90,-230,-245,245,245,110,117.5,122.5,,122.5,180,200,210,210,577.5,SBD,1,Ireland
Bernd Bucher,M,,M50-54,Single-ply,91,100,165,180,190,190,142.5,-150,-150,,142.5,-165,180,190,190,522.5,SBD,1,Germany
Harry Whale,M,,M50-54,Single-ply,107.9,110,-220,-230,230,230,160,180,-201,,180,180,200,230,230,640,SBD,1,England
Colin Payne,M,,M50-54,Single-ply,99.1,100,,,,,150,-170,170,,170,,,,,170,B,1,England
Harry Whale,M,,M50-54,Single-ply,107.9,110,,,,,140,175,190,,190,,,,,190,B,1,England
Calin Eschenasy,M,,M50-54,Single-ply,74.2,75,,,,,130,140,-150,,140,,,,,140,B,1,Germany
Martin Heindl,M,,M50-54,Single-ply,72.3,75,,,,,,,,,,215,225,-230,225,225,D,1,Austria
Horst Fischer,M,,M50-54,Single-ply,88.7,90,,,,,-145,145,150,,150,,,,,150,B,2,Germany
Michael Winklareth,M,,M50-54,Single-ply,88.7,90,,,,,165,170,175,,175,,,,,175,B,1,Germany
Salih Meryem,M,,M50+,Single-ply,66.9,67.5,,,,,,,,,,130,140,-150,140,140,D,1,Germany
Calin Eschenasy,M,,M50+,Single-ply,74.2,75,,,,,,,,,,217.5,-227.5,-227.5,217.5,217.5,D,1,Germany
Kári Elíson,M,,M55-59,Single-ply,75,75,180,190,-200,190,115,,,,115,200,220,-240,220,525,SBD,1,Iceland
Ken Wiliams,M,,M55-59,Single-ply,97.4,100,200,220,-235,220,140,150,152.5,,152.5,-210,210,,210,582.5,SBD,1,England
Thomas Beck,M,,M55-59,Single-ply,137.8,140,230,255,-280,255,-165,165,-185,,165,220,-250,250,250,670,SBD,1,Germany
Peter Berghmans,M,,M55-59,Single-ply,95,100,,,,,130,135,140,,140,,,,,140,B,2,Netherlands
Axel Gersdorf,M,,M55-59,Single-ply,97.3,100,,,,,-215,215,-220,,215,,,,,215,B,1,Germany
Walter Kurda,M,,M55-59,Single-ply,112.6,125,,,,,160,180,190,,190,,,,,190,B,1,Germany
Reinhold Schaumann-Kelch,M,,M55-59,Single-ply,83.3,90,,,,,125,132.5,-140,,132.5,,,,,132.5,B,1,Germany
David Carter #1,M,,M60-64,Single-ply,122.9,125,275,300,320,320,160,-165.5,-165.5,,160,275,300,320,320,800,SBD,1,England
Lothar Hildebrandt,M,,M65-69,Single-ply,100.3,110,,,,,-160,160,-165,,160,,,,,160,B,1,Germany
Dominic Avo,M,,M70-74,Single-ply,88.4,90,-150,150,158,158,100,105,108,,108,160,165,170,170,436,SBD,1,England
Alexej Lysenko,M,,Open,Single-ply,79.2,82.5,167.5,-180,180,180,112.5,120,-130,,120,75,,,75,375,SBD,4,Germany
Paul Fishlock,M,,Open,Single-ply,79.7,82.5,200,220,-230,220,120,125,-130,,125,200,220,-225,220,565,SBD,3,England
Max Cerepanov,M,,Open,Single-ply,79.5,82.5,240,-250,250,250,-150,150,-170,,150,240,250,-255,250,650,SBD,2,Germany
Stanislav Pryakhin,M,,Open,Single-ply,81.2,82.5,305,-335,340,340,-180,180,-200,,180,280,300.5,,300.5,820.5,SBD,1,
Giorgi Tsasidze,M,,Open,Single-ply,82.6,90,180,-200,-200,180,110,-130,-140,,110,180,,,180,470,SBD,3,Georgia
Shane Brodie,M,,Open,Single-ply,89.6,90,320,332.5,-340,332.5,175,180,187.5,,187.5,265,-275,-275,265,785,SBD,2,Ireland
Bernard Delany,M,,Open,Single-ply,89.9,90,290,310,-320,310,240,251,260,,260,-280,280,-290,280,850,SBD,1,Ireland
Pall Agust Sigurdarson,M,,Open,Single-ply,99.7,100,175,190,-200,190,115,125,135,,135,200,-220,230,230,555,SBD,3,Iceland
Thomas Romberg,M,,Open,Single-ply,99.4,100,255,-270,270,270,180,-190,190,,190,270,-290,-290,270,730,SBD,2,Germany
Aleksander Kyurchev,M,,Open,Single-ply,95.4,100,320,340,-360,340,235,-250,250,,250,280,300,-310,300,890,SBD,1,Bulgaria
Sean Enwright,M,,Open,Single-ply,97.9,100,-290,-300,-300,-290,180,,,,180,250,,,250,,SBD,DQ,Ireland
David Satsjelasjvili,M,,Open,Single-ply,106.7,110,280,290,-300,290,200,210,220,,220,200,260,270,270,780,SBD,1,Netherlands
Alexander Mittag,M,,Open,Single-ply,109.1,110,-280,-310,-320,-280,165,,,,165,240,,,240,,SBD,DQ,Germany
Daniel Sauer,M,,Open,Single-ply,102.2,110,-270,-280,-280,-270,180,,,,180,300,,,300,,SBD,DQ,Germany
Dave van der Veen,M,,Open,Single-ply,111.9,125,330,350,-360,350,230,-240,-240,,230,250,-275,275,275,855,SBD,1,Netherlands
Andrew Cairney,M,,Open,Single-ply,131.3,140,290,312.5,325,325,190,215,222.5,,222.5,260,-290,290,290,837.5,SBD,1,England
Thomas Elfner,M,,Open,Single-ply,93.5,100,,,,,175,182.5,-195,,182.5,,,,,182.5,B,4,Austria
Jochen Puchmelter,M,,Open,Single-ply,95.4,100,,,,,180,190,200,,200,,,,,200,B,3,Germany
Patrick McNamara,M,,Open,Single-ply,94.3,100,,,,,207.5,-212.5,,,207.5,,,,,207.5,B,2,Ireland
Aleksander Kyurchev,M,,Open,Single-ply,95.5,100,,,,,235,245,252.5,,252.5,,,,,252.5,B,1,Bulgaria
Micheal Vaughan,M,,Open,Single-ply,98.2,100,,,,,,,,,,240,255,270,270,270,D,2,Ireland
Aleksander Kyurchev,M,,Open,Single-ply,95.5,100,,,,,,,,,,280,295,-302.5,295,295,D,1,Bulgaria
Martin Baumbach,M,,Open,Single-ply,105.1,110,,,,,-250,-250,-250,,,,,,,,B,DQ,Germany
Raymond van Deventer,M,,Open,Single-ply,107.3,110,,,,,240,250,-260.5,,250,,,,,250,B,1,Netherlands
Oliver Glänzer,M,,Open,Single-ply,100.5,110,,,,,,,,,,230,-250,-250,230,230,D,1,Germany
Wladimir Funkner,M,,Open,Single-ply,123.2,125,,,,,150,-210,-210,,150,,,,,150,B,2,Germany
Kakhaber Kapiani,M,,Open,Single-ply,116.9,125,,,,,200,230,250,,250,,,,,250,B,1,Georgia
Heiko Fiegel,M,,Open,Single-ply,113.3,125,,,,,,,,,,-230,230,-250,230,230,D,2,Germany
Andre Scheller,M,,Open,Single-ply,114.8,125,,,,,,,,,,-250,250,260,260,260,D,1,Germany
George Chakvetadze,M,,Open,Single-ply,127.1,140,,,,,-210,210,235,,235,,,,,235,B,1,Georgia
Frank Binger,M,,Open,Single-ply,64.6,67.5,,,,,,,,,,202.5,215,,215,215,D,1,Germany
Sergej Worontow,M,,Open,Single-ply,75,75,,,,,105,-112.5,-112.5,,105,,,,,105,B,3,Austria
Henri Batterink,M,,Open,Single-ply,72.1,75,,,,,127.5,-132.5,-132.5,,127.5,,,,,127.5,B,2,Netherlands
Lucas Gijsbertsen,M,,Open,Single-ply,68.9,75,,,,,170,-180,-180,,170,,,,,170,B,1,Netherlands
Mathias Stach,M,,Open,Single-ply,81,82.5,,,,,150,162.5,-167.5,,162.5,,,,,162.5,B,3,Germany
Robert Truscott,M,,Open,Single-ply,79.1,82.5,,,,,170,-185,-190,,170,,,,,170,B,2,England
Paul Kraft,M,,Open,Single-ply,81.8,82.5,,,,,200,210,-215,,210,,,,,210,B,1,Germany
Giorgi Tsasidze,M,,Open,Single-ply,80.1,82.5,,,,,,,,,,170,,,170,170,D,2,Georgia
Kay Berger,M,,Open,Single-ply,82.2,82.5,,,,,,,,,,160,175,185,185,185,D,1,Germany
Bas de Vries,M,,Open,Single-ply,85.9,90,,,,,132.5,137.5,142.5,,142.5,,,,,142.5,B,4,Netherlands
Stanislav Pryakhin,M,,Open,Single-ply,83.5,90,,,,,180,-195,-195,,180,,,,,180,B,3,Russia
Roman Kwitek,M,,Open,Single-ply,88.7,90,,,,,-185,190,-197.5,,190,,,,,190,B,2,Poland
Uwe Schmutzler,M,,Open,Single-ply,87.6,90,,,,,205,-222.5,-222.5,,205,,,,,205,B,1,Germany
Stanislaw Pryakin,M,,Open,Single-ply,83.5,90,,,,,,,,,,280,295,-305.5,295,295,D,1,Russia
Mark Higgins,M,,Teen,Single-ply,69.1,75,120,140,-160,140,90,100,-110,,100,150,160,175,175,415,SBD,2,Ireland
Nick Cerepanov,M,,Teen,Single-ply,68,75,180,-190,-190,180,100,-110,-110,,100,200,-210,,200,480,SBD,1,Germany
Dominique Bohrmann,M,,Teen,Single-ply,87.2,90,225,235,-240,235,130,140,145,,145,230,250.5,-255,250.5,630.5,SBD,1,Germany
Ryan Law,M,,Teen,Single-ply,104.2,110,115,130,145,145,60,-65,65,,65,145,155,-165,155,365,SBD,2,England
Patrick Menger,M,,Teen,Single-ply,103.8,110,150,170,185,185,90,-100,100,,100,150,167.5,177.5,177.5,462.5,SBD,1,Germany
Ben Tickle,M,,Teen,Single-ply,97.3,100,,,,,110,115,-120,,115,,,,,115,B,1,England
Patrick Nyberg,M,,Teen,Single-ply,70.5,75,,,,,,,,,,130,140,-160,140,140,D,3,Germany
Simon Cal,M,,Teen,Single-ply,68.5,75,,,,,,,,,,150,165,-175,165,165,D,2,Germany
Niko Josifidis,M,,Teen,Single-ply,69.9,75,,,,,,,,,,165,175,200,200,200,D,1,Germany
Rene Henn,M,,Teen,Single-ply,77.8,82.5,,,,,90,-100,-100,,90,,,,,90,B,2,Germany
Ivan Anuchin,M,,Teen,Single-ply,80.2,82.5,,,,,125,147.5,155,,155,,,,,155,B,1,Russia
Artem Logunov,M,,Teen,Single-ply,89.4,90,,,,,155,180,185,,185,,,,,185,B,1,Russia
Thorben Sardory,M,,Teen,Single-ply,,,,,,,,,,,,,,,,,D,DQ,Germany
Shane Nugent,M,,Teen,Single-ply,,,,,,,,,,,,,,,,,D,DQ,Ireland
