"Atlanta Graduation 2019 Registrations"
" "
studentid,fullname,street,city,state,zipcode,phone,email,gender,gpa,veteran,branch,sheight,sweight,ldegree,rprogram,tickets,graddate,datersvp
1406001101,"Kelly Flynn","363 Havenbrook Way NW",Concord,NC,"28027     ","(980)297-8417   ",kflynn7382@yahoo.com,female,2.98,Yes,na,"5 Ft 6 In",150,Completer,"Resp Care Mgmt BS Completer",15,2019-06-08,2019-02-08
1406002109,"Edward Pabon","1520 Eagle Watch Lane",Kernersville,NC,"27284     ","(336)416-1624   ",edward.pabon07@gmail.com,male,3.97,Yes,na,"5 Ft 5 In",210,Masters,"Master in Public Health",11,2019-03-17,2019-03-01
1406002233,"Christiana Amoakohene","7 fomalhaut ct ","Turnersville ",NJ,"08012     ","(347)607-6798   ",camoakohene@yahoo.com,female,3.80,Yes,na,"5 Ft 4 In",157,Completer,"Respiratory Therapy AS",4,2019-06-01,2019-05-30
1406005881,"Jerena Brooks","1302 Cahaba Dr. Sw",Atlanta,GA,"30311     ","(678)851-5995   ",jerena.brooks@aol.com,female,3.82,Yes,na,"5 Ft 2 In",270,Masters,"Bus Admin MS",8,2019-06-09,2019-05-27
1406008545,"Richard Jose","1812 Gettysburgh Rd.","Virginia Beach",VA,"23464     ","                ",footbalcoachfather@yahoo.com,male,2.34,Yes,army,"5 Ft 6 In",182,Bachelors,"Bus Admin HR BS",4,2019-08-10,2019-02-21
1406011245,"Patricia Turner","1423 Clarkson Ave",Newberry,SC,"29108     ","(803)271-8400   ",trishturner1900@gmail.com,female,3.68,Yes,na,"5 Ft 5 In",198,Completer,"Respiratory Therapy AS",6,2019-02-20,2019-03-26
1406012429,"Bill Young","1103 Marley Cannon",Dublin,GA,"31021     ","(478)290-3218   ",yby137@yahoo.com,male,2.35,Yes,na,"5 Ft 9 In",190,Bachelors,"Health Information Mgmt BS",4,2019-04-14,2019-05-28
1406013911,"Whitney Barron","324 Hannover Pl",Stockbridge,GA,"30281     ","(470)893-5045   ",barronwhitney@yahoo.com,female,2.48,Yes,na,"5 Ft 4 In",190,Associates,"Med Spec AOS",12,2019-08-10,2019-03-18
1406013956,"Lisa Harper","Po Box 804","Lake Placid",FL,"33862     ","8638400180        ",lisee413@yahoo.com,female,3.91,Yes,na,"5 Ft 4 In",250,Masters,"Bus Admin MS",4,2018-09-17,2019-03-30
1406015971,"Heather Wisen","1767 Stonehaven Road",Madison,OH,"44057     ","(440)417-6039   ",heather.wisen@gmail.com,female,4.00,Yes,nationalguard,"5 Ft 7 In",135,Masters,"Healthcare Admin MS",5,2019-05-14,2019-04-14
1406019498,"NiKohl Cotton","6118 Glenview Dr Apt 66","North Richland Hills",TX,"76180     ","(817)901-0768   ",nikojennings81@gmail.com,female,4.00,Yes,airforce,"5 Ft 8 In",275,Masters,"Healthcare Admin MS",2,2019-03-17,2019-03-05
1406022207,"Candace Beasley","122 Fieldstone Parkway",Jonesboro,GA,"30236     ","(313)286-9093   ",candy217.cp@gmail.com,female,2.96,Yes,na,"5 Ft 4 In",160,Completer,"Resp Care Adv Clinical Pract BS Completer",10,2019-02-16,2019-05-29
1406028159,"Steve Cannon","1132 Downs Rd.","West Monroe",LA,"71292     ","(318)680-6247   ",sacannon76@gmail.com,male,3.98,Yes,na,"6 Ft 4 In",245,Masters,"Healthcare Admin MS",2,2019-01-20,2019-04-04
1406033268,"Simon Phillips","6595 south Greenmeadow way apt. 10U",Murray,UT,"84107     ","(801)754-4455   ",simph1@hotmail.com,male,3.98,Yes,na,"5 Ft 11 In",265,Masters,"Bus Admin MS",6,2019-02-14,2019-02-14
1406036638,"Tieash Lawrence","307 Assembly Point Ct",Odenton,MD,"21113     ","(303)522-2080   ",tieashlawrence@gmail.com,female,3.02,Yes,na,"5 Ft 5 In",138,Bachelors,"Bus Admin BS",8,2019-09-01,2019-03-27
1406088313,"Nakia Jackson","1705 Washington Blvd.",Lyndon,KY,"40242     ","(202)716-9125   ",kia06wcmm@gmail.com,female,3.51,Yes,na,"5 Ft 4 In",190,Bachelors,"Health Services Mgt BS",15,2018-07-31,2019-02-21
1406089095,"Wanda Bryant","2860 Woodland Hills Drive, #205","Colorado Springs",CO,"80918     ","(719)535-2924   ",webryant_2000@yahoo.com,female,3.98,Yes,na,"5 Ft 9 In",250,Bachelors,"Graphic Arts ID BS",10,2018-12-17,2019-05-29
1406092876,"Barbara Menardy","607 Kerri Cove Ct Apt 302",Midlothian,VA,"23113     ","(561)827-3643   ",bmap4evr@yahoo.com,female,3.11,Yes,na,"5 Ft 3 In",190,Completer,"Resp Care ACP BS Completer",6,2016-10-11,2019-04-08
1406111710,"Lisa Brewer","221 Tincino ct","New Bern",NC,"28562     ","(252)670-2327   ",lbrewer5@suddenlink.net,female,3.57,Yes,na,"5 Ft 5 In",130,Masters,"Healthcare Admin MS",4,2019-06-01,2019-02-08
1406120381,"Richard Coleman","225 Ojeda St",Arvin,CA,"93203     ","       4242431030         ",richardcoleman2017@yahoo.com,male,3.34,Yes,na,"5 Ft 9 In",218,Bachelors,"Acct Forensic BS",3,2018-10-18,2019-03-25
1406121944,"Daniel Connor","4249 Sterling Pointe Dr.",Douglasville,GA,"30135     ","(972)207-5874   ",dannic114@gmail.com,male,2.65,Yes,na,"6 Ft 2 In",295,Bachelors,"Bus Admin BS",6,2018-07-28,2019-05-21
1407122538,"Dominique Pegues","849 Green Rd Apt 201",Ypsilanti,MI,"48198     ","(734)239-0803   ",peguesdominique@gmail.com,female,2.21,Yes,na,"5 Ft 5 In",170,Bachelors,"Bus Admin BS",4,2019-02-17,2019-02-08
1409127328,"Charity Tanner","51 Cameron Circle",Newnan,GA,"30263     ",770-658-0097,tanner_tanner3@aol.com,female,3.82,Yes,na,"5 Ft 0 In",120,Bachelors,"Graphic Arts BS",20,2019-08-10,2019-05-14
1409127689,"Priscilla Nelson","2704 Valley Rd lot 58","Meridian ",MS,39307,"(601)227-6491   ",prissi90@yahoo.com,female,3.42,Yes,na,"5 Ft 5 In",230,Associates,"Med Spec AOS",4,2019-08-10,2019-02-08
1411133657,"Kiplyn Angelain","33 Veterans Blvd",Kenner,LA,"70062     ","(504)621-1005   ",iuresp0930@gmail.com,female,3.20,Yes,army,"5 Ft 4 In",180,Masters,"Master in Public Health",10,2019-08-10,2019-02-13
1411134448,"Wilbur Jackson","9114 Edmonston Ct Apt 304",Greenbelt,MD,"20770     ",202-738-3486,liteskin.country@gmail.com,male,2.81,Yes,army,"6 Ft 5 In",200,Bachelors,"Graphic Arts BS",10,2018-12-05,2019-02-13
1501138051,"Cassandra Gregory","5319 Twin Valley Ln",Memphis,TN,"38135     ",9012197007,cgregory51@gmail.com,female,2.16,Yes,na,"5 Ft 8 In",160,Bachelors,"Health Services Mgt BS",12,2019-08-10,2019-02-08
1501139188,"Yvonne Angelique","24909 Madison Ave Unit 2411",Murrieta,CA,"92563     ","(619)993-3805   ",ygarris75@yahoo.com,female,3.91,Yes,na,"5 Ft 6 In",220,Masters,"Bus Admin MS",30,2019-04-14,2019-02-08
1501139623,"Erica Peterson","10 New York Blvd","Beverly Hills",FL,"34465     ","(352)476-3686   ",ericapeterson724@gmail.com,female,3.37,Yes,na,"5 Ft 1 In",215,Completer,"Respiratory Therapy AS",11,2019-05-12,2019-02-08
1502141995,"Dwayne Sippio","10010 Birdie Lane","Upper Marlboro",MD,"20774     ","(443)473-5557   ",sippiodwayne@gmail.com,male,3.94,Yes,na,"5 Ft 11 In",220,Masters,"Bus Admin MS",5,2019-08-04,2019-02-27
1502142293,"Ahialindaaudrey Kouame","611 Wharton Dr.",Newark,DE,"19711     ","(302)781-2112   ",evecatlili@gmail.com,female,3.67,Yes,na,"5 Ft 9 In",118,Masters,"Healthcare Admin MS",2,2019-05-12,2019-05-11
1502142440,"Elvia Morrison","504 North Cass Street Apt. 7",Corinth,MS,"38834     ","(662)603-7726   ",kimasidta@outlook.com,female,3.42,Yes,na,"5 Ft 2 In",240,Completer,"Respiratory Therapy AS",7,2018-07-25,2019-04-03
1503144950,"Kimberly Sanftner","612 Maney Ln",Dalton,GA,"30720     ","7069134499 ",klwadsworth1989@gmail.com,female,3.22,Yes,na,"5 Ft 10 In",300,Bachelors,"Health Services Mgt BS",15,2019-05-12,2019-02-17
1503148060,"Bryant Smith","280 John Knox Road Apt.128",Tallahassee,FL,"32303     ","          850-524-5848      ",Redding2011@gmail.com,male,2.37,Yes,na,"6 Ft 1 In",220,Associates,"Bus Mgmt & Acct AAS",25,2019-08-10,2019-05-04
1504150268,"Karen Cromwell","5454 Rocky Pine Drive",Lithonia,GA,"30038     ",14045438873,kcromwell26@gmail.com,female,3.03,Yes,na,"5 Ft 6 In",285,Masters,"Healthcare Admin MS",20,2019-06-01,2019-02-25
1505154067,"Marlon West","1475 Bramlett Forest Trail",Lawrenceville,GA,"30045     ","(973)803-8176   ",marlonwest5@yahoo.com,male,3.01,Yes,na,"6 Ft 1 In",235,Bachelors,"Bus Admin BS",10,2018-09-15,2019-05-28
1505154329,"Rachel Teaster","753 Scarlett Rd",Dandridge,TN,"37725     ","(865)314-3328   ",rachelteaster@gmail.com,female,3.15,Yes,na,"5 Ft 3 In",270,Bachelors,"Health Services Mgt BS",4,2019-05-19,2019-02-08
1505154830,"Harvisha James","1000 E Residence Avenue",albany,GA,31705,2292061708,jureicej@yahoo.com,female,3.33,Yes,na,"5 Ft 6 In",265,Bachelors,"Health Services Mgt BS",25,2018-12-09,2019-02-09
1506155859,"Kimberly Greunke","Victory Drive Campground","Hereford ",Texas,79045,5732104125,bellestarr1865@gmail.com,female,3.85,Yes,na,"5 Ft 8 In",230,Bachelors,"Bus Admin BS",2,2018-12-15,2019-05-28
1506156721,"Marquandra Parker","4093 County Road 31","Union Springs",Alabama,36089,2055725683,marquandrp@gmail.com,female,3.60,Yes,na,"5 Ft 6 In",190,Associates,"Med Spec AOS",10,2017-09-30,2019-02-21
1506156789,"Christina Sharp","129 Cooper Drive",Dallas,GA,"30157     ","(915)261-5008   ",christinasharp39@gmail.com,female,3.39,Yes,army,"5 Ft 4 In",160,Bachelors,"Bus Admin BS",8,2018-06-23,2019-02-09
1506158136,"Jelwanna Filmore","101 North Beech Ave. Apt 1D",Andrews,SC,"29510     ",8433251264,jelwannavfilmore@gmail.com,female,3.00,Yes,na,"5 Ft 1 In",235,Associates,"Med Spec AOS",25,2019-08-10,2019-05-21
1507158938,"Shanna Pender","PO Box 1171",Farmerville,LA,"71241     ","(318)608-7371   ",sjones_20@hotmail.com,female,3.43,Yes,na,"5 Ft 6 In",155,Completer,"Respiratory Therapy AS",0,2019-06-07,2019-05-21
1507159635,"Leslie Mitchell","P.O Box  201453                                                                                                                                       ","Montgomery               ",AL,"36120     ","(334)414-2268   ","leslieannmitchell3@gmail.com                      ",female,2.63,Yes,na,"5 Ft 7 In",145,Bachelors,"Health Services Mgt BS",15,2020-02-02,2019-03-30
1507159650,"Denise Chappell","536 Timberbrook Pl.","Beech Island",SC,"29842     ",(803)634-5140,denisechp13@hotmail.com,female,3.76,Yes,na,"5 Ft 5 In",105,Masters,"Bus Admin MS",30,2019-06-09,2019-05-09
1507161499,"Kerline Seac","1024 Fairwood Ct",Acworth,GA,"30101     ","(678)462-6652   ",kerlineseac@gmail.com,female,3.43,Yes,na,"5 Ft 4 In",180,Completer,"Respiratory Therapy AS",15,2019-02-13,2019-02-28
1507162740,"Linnetta Harris","1738 Catalpa Rd",Cleveland,Ohio,44112,2162661121,hslinn@yahoo.com,female,3.73,Yes,na,"5 Ft 6 In",191,Bachelors,"Acct BS",8,2018-08-01,2019-04-16
1507163134,"Wilma Norwood","26074 Hollyville Road",Millsboro,DE,"19966     ","(302)538-1885   ",NrwCrs@aol.com,female,3.72,Yes,na,"5 Ft 10 In",275,Bachelors,"Bus Admin HR BS",6,2019-03-31,2019-05-30
1508165655,"Rhonda Phillips","707 smith st, ",Vidalia,GA,30474,9122531865,msrrp37@hotmail.com,female,3.82,Yes,na,"5 Ft 3 In",233,Masters,"Master in Public Health",10,2019-08-10,2019-05-30
1508165704,"Margaret Gann","51 Arnco 4Th St",Newnan,GA,"30263     ","(770)755-6903   ",margaretannegann@gmail.com,female,2.77,Yes,na,"5 Ft 7 In",210,Bachelors,"Bus Admin TECH BS",10,2019-08-10,2019-03-08
1508166176,"Latoya Carter","403 B Avalon Rd",Greensboro,NC,"27401     ","(336)455-4979   ",ldcarte2@gmail.com,female,3.54,Yes,na,"5 Ft 4 In",157,Bachelors,"Health Services Mgt BS",3,2019-08-10,2019-05-30
1508166597,"Talia Clifton","2217 Se14Th Ave Apt 64",Ocala,FL,"34471     ","(352)631-2795   ",alease.13@icloud.com,female,2.15,Yes,navy,"5 Ft 0 In",120,Bachelors,"Bus Admin BS",10,2019-07-07,2019-04-07
1508167738,"Keaira Charles","4660 Martin Luther King Jr Ave SW Apt B703",Washington,DC,"20032     ","             2025604136   ",keairacharles@ymail.com,female,2.26,Yes,na,"5 Ft 6 In",220,Bachelors,"Bus Admin NMM BS",7,2019-08-04,2019-02-08
1509170729,"Robyn Barnett","5342 Enchanted Cove Sw",Lilburn,GA,"30047     ","(678)687-2451   ",robynbarnettiu@gmail.com,female,3.92,Yes,na,"5 Ft 4 In",300,Bachelors,"Acct Forensic BS",12,2018-07-21,2019-02-23
1509171342,"Bettina Bryan","478 Garden Acres Way",Pooler,GA,"31322     ","(912)988-1588   ",bbryan306@gmail.com,female,2.90,Yes,na,"5 Ft 6 In",300,Bachelors,"Health Services Mgt BS",15,2019-06-09,2019-02-11
1509171770,"Kimiko Brown","28346 Hwy 430 Lot 4",Franklinton,LA,"70438     ","(985)614-0237   ",kwoodard3374@gmail.com,female,2.15,Yes,na,"5 Ft 6 In",127,Associates,"Med Spec AOS",10,2019-02-18,2019-02-17
1510173909,"Jezmerie Goodwin","4932 KAIN AVE ",Ashtabula,OH,"44004     ","(440)855-6994   ",jezmeriegoodwin@yahoo.com,male,3.24,Yes,na,"5 Ft 2 In",200,Bachelors,"Health Services Mgt BS",12,2019-03-16,2019-04-01
1510174099,"Munekia Moore","1206 Mulberry St.",Muskogee,OK,"74403     ","(918)816-6676   ",dam7281@outlook.com,female,3.31,Yes,na,"5 Ft 5 In",165,Bachelors,"Bus Admin HR BS",20,2018-11-10,2019-02-08
1510174441,"Jade Metz","1420 Dowell St.",Greenwood,IN,"46143     ","(478)396-8682   ",jmetz7122014@gmail.com,male,2.87,Yes,na,"5 Ft 5 In",200,Bachelors,"Health Services Mgt BS",15,2018-12-01,2019-02-08
1510174820,"Chantal Majors","135 Halifax dr","Cedar Hill",Texas,75104,4695038956,cmajors777@aol.com,female,2.63,Yes,na,"5 Ft 4 In",180,Bachelors,"Health Services Mgt BS",25,2018-11-10,2019-03-04
1510175013,"Ashley Cooper","819 Roosevelt St","Wichita Falls",TX,"76301     ","(940)337-7791   ",ashcoop16@gmail.com,female,2.25,Yes,na,"4 Ft 9 In",155,Associates,"Med Spec AOS",30,2019-04-14,2019-04-04
1510176202,"Tanaya Byrd","3652 Pin Hook Rd Apt 502","Antioch ",TN,37013,"(609)254-9770   ",tanaya_byrd@yahoo.com,female,2.85,Yes,na,"4 Ft 11 In",220,Bachelors,"Bus Admin BS",5,2019-01-20,2019-03-13
1511176809,"Nicola Moore","223-20 107Th Ave","Queens Village",NY,"11429     ","(718)749-8571   ",nicola.moore4@yahoo.com,female,3.39,Yes,na,"5 Ft 2 In",150,Completer,"Respiratory Therapy AS",9,2019-05-02,2019-05-01
1511179481,"Kimberlee Kelekolio","94-390 ikepono pl",Waipahu,HI,"96797     ","(808)469-6755   ",kkelekolio24@gmail.com,female,3.19,Yes,na,"5 Ft 4 In",145,Bachelors,"Bus Admin BS",4,2019-08-10,2019-02-09
1511180609,"Chiquita Horton","646 Cody Johnson Rd",Sparta,GA,"31087     ","(478)357-7188   ",hortonchq@gmail.com,female,4.00,Yes,na,"5 Ft 8 In",200,Bachelors,"Acct BS",12,2019-08-10,2019-05-28
1512181191,"Lester Greer","1305 Adelaide St.",Memphis,TN,"38106     ","(901)708-0931   ",Lgreer365@gmail.com,male,2.37,Yes,na,"6 Ft 0 In",165,Associates,"Bus Mgmt & Acct AAS",5,2019-01-18,2019-02-15
1512182000,"Dakota Andrews","7733 Clear Fork Creek Rd.",Bastian,VA,"24314     ","(304)921-6483   ",dakotaandrews9@gmail.com,female,2.42,Yes,na,"5 Ft 6 In",240,Associates,"Bus Mgmt & Acct AAS",4,2018-06-15,2019-05-28
1512185877,"Leondra Bellamy","4101 North Church St",Greensboro,NC,"27405     ","       3363177666         ",leobellamy2010@gmail.com,female,2.49,Yes,na,"5 Ft 2 In",180,Bachelors,"Bus Admin NMM BS",30,2019-05-12,2019-03-19
1601186458,"Cassandra Reynolds","20 Kentwood Lane",Piedmont,SC,"29673     ","(843)742-3845   ",rrj013099@gmail.com,female,3.65,Yes,na,"5 Ft 2 In",168,Bachelors,"Health Services Mgt BS",12,2018-11-09,2019-05-03
1601186703,"Aja Young","123 Hawthorne Dr.",Riverdale,GA,"30274     ","(678)709-6947   ",ajayoung82@gmail.com,female,3.41,Yes,na,"5 Ft 5 In",290,Bachelors,"Health Services Mgt BS",2,2019-08-09,2019-02-09
1601187999,"Yolanda Harvey","2636 Mcglynn Drive                                                                                                                                    ","Decatur                  ",GA,"30034     ","(678)900-6772   ","harvey.yolanda@ymail.com                          ",female,3.49,Yes,na,"5 Ft 10 In",250,Bachelors,"Health Services Mgt BS",5,2019-04-12,2019-02-08
1601188305,"Lakisha Austin","3700 Burkett St  #50-D",Houston,TX,77004,3463494778,alakisha23@gmail.com,female,2.46,Yes,na,"5 Ft 6 In",145,Associates,"Bus Mgmt & Acct AAS",4,2019-08-10,2019-05-28
1601190568,"Abigail Dawson","6718 Tram Ct.",Sandston,VA,"23150     ","(804)869-9315   ",adawson1.independence.edu@gmail.com,female,3.87,Yes,na,"5 Ft 6 In",136,Bachelors,"Graphic Arts BS",20,2019-05-12,2019-03-11
1601190809,"Melony Washington","1800 W  Washington St. Apt 407",Sherman,TX,"75092     ","(214)486-9153   ",melony902003@yahoo.com,female,3.58,Yes,na,"4 Ft 11 In",283,Bachelors,"Bus Admin BS",6,2019-07-06,2019-05-28
1602192498,"Katrina Ward","2519 Lakeshore Dr Ne",Conyers,Georgia,30012,4707747171,uncommonfavor817@gmail.com,female,3.62,Yes,na,"5 Ft 11 In",170,Associates,"Med Spec AOS",10,2017-08-04,2019-04-04
1602193860,"Arikka Boyett","21 Pamview Court Apt 106","Winter Springs",FL,"32708     ","(407)413-3887   ",arikkaboyett@gmail.com,female,3.27,Yes,na,"5 Ft 6 In",200,Bachelors,"Health Services Mgt BS",22,2019-08-10,2019-03-30
1602193969,"Kenya Peguese","2704 Cross Creek Dr","Green Cove Springs",FLORIDA,32043,8436017169,Kenya698@yahoo.com,female,3.14,Yes,na,"5 Ft 6 In",185,Bachelors,"Bus Admin HR BS",15,2018-12-09,2019-02-10
1603194423,"Desiree Steffen","202 Milner Rd",Shiloh,GA,"31826     ","(706)326-3694   ",desireesteffen3@gmail.com,female,4.00,Yes,na,"5 Ft 3 In",160,Bachelors,"Comp Science SMAD BS",10,2018-12-08,2019-03-26
1603194871,"Traci Clark","311 E. Alabama Ave.","Bessemer City",NC,"28016     ","(704)267-0381   ",tracipruitt1980@gmail.com,female,3.97,Yes,na,"5 Ft 7 In",288,Bachelors,"Bus Admin HR BS",6,2019-08-10,2019-03-09
1603195471,"Edward Walton","25 Doe Ct",Jasper,Georgia,30143,"(770)378-1350   ",edwardwalton333@gmail.com,male,3.72,Yes,na,"5 Ft 6 In",195,Bachelors,"Comp Science NISS BS",15,2019-02-16,2019-02-16
1603195695,"Melissa Fisher","1736 W. 8 St",Freeport,TX,"77541     ",(979)665-6966,"melissafisher9913@gmail.com                       ",female,3.65,Yes,na,"5 Ft 6 In",160,Bachelors,"Bus Admin NMM BS",5,2019-03-18,2019-03-19
1603196660,"Amy Obrien","6283 Field Glen Road","Stone Mountain",GA,"30087     ","(678)668-3282   ",amyvobrien2014@yahoo.com,female,3.18,Yes,na,"5 Ft 4 In",200,Bachelors,"Bus Admin HR BS",4,2019-08-10,2019-05-09
1603196669,"Brenda Vasile","13160 Fry Rd",Edinboro,PA,"16412     ","(814)636-9435   ",bvasile98@gmail.com,female,3.10,Yes,na,"5 Ft 8 In",168,Bachelors,"Bus Admin TECH BS",8,2019-08-03,2019-03-06
1604197716,"Vianne Robinson","7211 Packard",Warren,MI,"48091     ","(313)618-6653   ",mzvrobinson@gmail.com,female,2.37,Yes,army,"5 Ft 7 In",230,Bachelors,"Graphic Arts ID BS",9,2019-09-01,2019-05-14
1604198260,"Cafreda Bryant","213 Bunn Road",Louisburg,NC,"27549     ","(919)729-1454   ",cbryant364@gmail.com,female,3.73,Yes,na,"5 Ft 8 In",172,Bachelors,"Health Services Mgt BS",30,2018-11-09,2019-02-08
1604198593,"Tara Opie","728 Ridgeview Dr",Dallas,GA,"30157     ","(770)882-4042   ",tara.k.wright07@gmail.com,female,2.91,Yes,na,"6 Ft 1 In",180,Bachelors,"Acct Forensic BS",30,2019-05-12,2019-02-08
1604198672,"Lori Boyd","628 Oak View Ave Apt 628",Bristol,VA,"24201     ","(276)696-9647   ",loriboyd79@gmail.com,female,2.79,Yes,na,"5 Ft 5 In",380,Bachelors,"Health Services Mgt BS",20,2019-03-16,2019-05-25
1604199276,"John Fine","579B Raritan Road #224",Roselle,NJ,"07203     ","(908)275-7063   ",captjfine@aol.com,male,3.81,Yes,na,"6 Ft 1 In",270,Bachelors,"Bus Admin HR BS",5,2019-04-21,2019-02-08
1604199900,"Anna Lyn Beauharnois Roth","401 N Woodbridge St","Bay City",MI,"48706     ","(989)501-4318   ",annalynbeauharnois@gmail.com,female,3.22,Yes,army,"5 Ft 3 In",170,Bachelors,"Graphic Arts BS",20,2019-06-09,2019-03-12
1604199917,"Jennifer Downing","225 Cusick Ave",Brookville,OH,"45309     ","(937)242-8792   ",genypher2010@gmail.com,female,3.97,Yes,na,"5 Ft 3 In",155,Bachelors,"Acct BS",3,2019-08-10,2019-04-05
1605199927,"Derrick Joyce","104 Valley Ave.",Lester,WV,"25865-0222     ","(304)719-9699   ",derrick_joyce@suddenlink.net,male,3.37,Yes,na,"5 Ft 11 In",300,Bachelors,"Comp Science SMAD BS",6,2019-06-09,2019-03-31
1605200565,"Daniel Oliveros","115 Biscayne Drive Nw, Apt B4",Atlanta,GA,"30309     ","(646)215-0949   ",daeoliveros@gmail.com,male,3.89,Yes,na,"5 Ft 10 In",170,Completer,"Respiratory Therapy AS",3,2019-02-19,2019-02-19
1605200598,"Ebony Martin","501 Sarah Simpson Rd",Iva,SC,"29655     ","(864)352-3999   ",Poetic.princess91.em@gmail.com,female,3.90,Yes,na,"4 Ft 10 In",215,Bachelors,"Bus Admin BS",13,2019-04-14,2019-04-13
1605200662,"Jessica Seabolt","607 Hillcrest St",Clinton,TN,"37716     ","(706)831-3612   ",sasochica2005@yahoo.com,female,4.00,Yes,na,"5 Ft 3 In",170,Bachelors,"Comp Science NISS BS",10,2019-03-17,2019-02-08
1605200722,"Eugenie Alphanor","109 Windward Hills",McDonough,GA,"30253     ","(404)574-0660   ",ealphanor@yahoo.com,female,3.74,Yes,na,"5 Ft 3 In",172,Completer,"Respiratory Therapy AS",13,2019-08-10,2019-04-02
1605202132,"Tina Reynard","221 North Seminary St Apt 201","Charles Town",WV,"25414     ","(540)327-5766   ",tinareynard@yahoo.com,female,2.99,Yes,na,"5 Ft 3 In",240,Associates,"Med Spec AOS",5,2018-06-22,2019-02-20
1605202379,"Tracy Carson","108 Tabor Circle","Fort Valley",GA,"31030     ","(478)972-2218   ",tracycarson681@yahoo.com,female,2.26,Yes,na,"5 Ft 8 In",180,Associates,"Med Spec AOS",10,2019-08-10,2019-05-17
1605202783,"Avis Wharton","514 Superior Road","Egg harbor township",NJ,"08234     ","(609)816-4831   ",whartonavis@yahoo.com,female,3.75,Yes,na,"5 Ft 5 In",174,Bachelors,"Health Services Mgt BS",8,2019-08-10,2019-02-09
1606202965,"Ginger Fike","1005 Payne St                                                                                                                                         ","Murray                   ",KY,"42071     ","(270)227-7322   ","kittenlover1971@outlook.com                       ",female,3.88,Yes,na,"5 Ft 10 In",300,Associates,"Graphic Arts AAS",6,2018-12-09,2019-02-08
1606203904,"Ali Mohammad","2804 Nancy Dr","Phenix City",AL,"36870     ",7067481771,alimomo1433@gmail.com,male,3.26,Yes,army,"5 Ft 11 In",200,Bachelors,"Health Services Mgt BS",5,2019-11-29,2019-05-30
1606203945,"Kerin Williams","7621 Weaver Ave.","New Orleans",LA,"70127     ","(504)578-4203   ",williamskerin476@gmail.com,female,3.73,Yes,na,"5 Ft 0 In",250,Bachelors,"Health Services Mgt BS",10,2019-06-01,2019-02-08
1606205175,"Victoria McKinzie","314 Fox Circle",Brunswick,GA,"31525     ","(912)571-0521   ",dustyj77@yahoo.com,female,2.39,Yes,na,"4 Ft 11 In",125,Bachelors,"Acct BS",25,2019-03-17,2019-05-20
1606205737,"Brandy Hardin","579 bark camp church road",Midville,GA,"30441     ",706-871-7435,brandyh2019@gmail.com,female,2.36,Yes,na,"5 Ft 7 In",316,Bachelors,"Health Services Mgt BS",1,2019-08-08,2019-02-08
1607205815,"Robyn Anderson","220 South Hampton Dr.",Spartanburg,SC,"29306     ","(504)939-0386   ",robynanderson24@yahoo.com,female,3.20,Yes,nationalguard,"5 Ft 4 In",180,Bachelors,"Bus Admin HR BS",20,2019-08-04,2019-02-08
1607206086,"Amenra McCarthy","964 south Perkins road ",Memphis,TN,"38117  ","(901)268-8513   ",mr.lungsmd@gmail.com,male,3.34,Yes,na,"5 Ft 6 In",300,Completer,"Resp Care CM BS Completer",4,2018-05-28,2019-05-29
1607207062,"Miriam Hunter","17803 Shadow Cypress Ct",Cypress,TX,"77433     ","(832)914-0293   ",miriam.e.miles@gmail.com,female,3.50,Yes,na,"5 Ft 3 In",130,Bachelors,"Health Services Mgt BS",20,2019-06-22,2019-04-22
1607207071,"Pamela Howie","116 Bradwell Street",Hinesville,GA,"31313     ","(912)463-0977   ",howiepa@gmail.com,female,3.57,Yes,na,"5 Ft 5 In",190,Bachelors,"Health Services Mgt BS",20,2019-08-10,2019-05-06
1607207464,"Shunee Mackey","4103 Avalon Valley Drive",Danbury,CT,"06810     ","(914)310-9563   ",sjmackey08@yahoo.com,female,3.90,Yes,na,"5 Ft 2 In",190,Completer,"Resp Care Mgmt BS Completer",6,2020-05-20,2019-02-09
1607207700,"Savannah Watkins","839 W Locust",Canton,IL,"61520     ","(309)635-7312   ",swatkins0291@yahoo.com,female,3.74,Yes,na,"5 Ft 11 In",240,Bachelors,"Acct Forensic BS",3,2019-08-04,2019-04-05
1607208454,"Sherrie Fischer","604 Bloomington Drive",Brighton,TN,"38011     ","(901)356-2520   ",blessed729.sf@gmail.com,female,2.63,Yes,na,"5 Ft 5 In",170,Associates,"Med Spec AOS",20,2019-08-10,2019-03-22
1608208810,"Latravia Jackson","3306 Evans Mill Rd",Lithonia,GA,"30038     ","                ",jacksonlatravia@gmail.com,female,2.92,Yes,na,"5 Ft 5 In",270,Completer,"Resp Care ACP BS Completer",30,2019-06-01,2019-02-09
1608209913,"Meranda DiMarco","254 E INDIAN TRL",ROME,GA,"30165     ","(706)766-1533   ",mnd0428@gmail.com,female,3.77,Yes,na,"4 Ft 11 In",104,Associates,"Graphic Arts AAS",5,2019-01-22,2019-02-08
1608210061,"Gloria Santana","420 Cotton Ave",Metter,GA,"30439     ","(912)255-1554   ",gloriasantana36@gmail.com,female,2.08,Yes,na,"5 Ft 1 In",160,Bachelors,"Health Services Mgt BS",20,2019-09-01,2019-02-13
1608210881,"Onesha Delee","5890 Riverdale Road Apt P08","College Park",GA,"30349     ","(678)794-2819   ",deleeonesha96@gmail.com,female,2.45,Yes,na,"5 Ft 4 In",114,Associates,"Bus Mgmt & Acct AAS",14,2019-07-07,2019-05-29
1608211399,"Shaquila Carroll","10541 Redbud Lane",Jonesboro,GA,"30238     ","(404)449-4320   ",carrollshaquila@yahoo.com,female,3.99,Yes,na,"5 Ft 3 In",170,Associates,"Bus Mgmt & Acct AAS",10,2019-02-16,2019-02-19
1608211495,"Marissa Gilligan","21 Yorkshire Rd",Waynesville,NC,"28786     ","(828)734-3682   ",marissa.gilligan@gmail.com,female,3.91,Yes,na,"5 Ft 2 In",200,Masters,"Healthcare Admin MS",2,2019-09-28,2019-05-01
1608211779,"Christopher Silver","20802, Apache Plum lane",Pflugerville,Texas,78660,"(512)645-6841   ",christopher.w.silver@gmail.com,male,4.00,Yes,airforce,"5 Ft 10 In",165,Bachelors,"Web Design BS",9,2019-09-29,2019-04-18
1608212005,"Angela Stogner","714 East Chappell St",Griffin,GA,"30223     ","(404)396-2876   ",angelarstogner@outlook.com,female,3.81,Yes,na,"5 Ft 6 In",191,Associates,"Bus Mgmt & Acct AAS",10,2018-05-26,2019-02-20
1609212221,"Tamika Crayton","120 Amsterdam Dr Apt E",Columbia,SC,"29210     ","(803)546-5158   ",tamikacrayton123@gmail.com,female,2.43,Yes,na,"5 Ft 9 In",470,Associates,"Bus Mgmt & Acct AAS",4,2018-09-15,2019-03-20
1609212490,"Duneeta Gagraj","6068 18Th St S","West Palm Beach",FL,"33415     ","(347)639-6142   ",duneetagagraj@gmail.com,female,3.96,Yes,na,"4 Ft 11 In",121,Completer,"Respiratory Therapy AS",8,2019-05-11,2019-05-09
1609212615,"Akeida Waters","104 Shelton Drive Apt 72",Clarkton,MO,"63837     ","                ",kebawaters92@gmail.com,female,2.95,Yes,na,"5 Ft 2 In",197,Associates,"Med Spec AOS",7,2019-02-19,2019-02-10
1609212635,"Melissa Rivera","609 Westover Hills Blvd Apt E","North Chesterfield",VA,"23225     ","(302)465-8365   ",melissariv88@gmail.com,female,3.55,Yes,na,"5 Ft 4 In",350,Bachelors,"Bus Admin BS",20,2019-08-10,2019-02-13
1609212679,"Shondell Goodridge","118-88 Riverton St","Saint Albans",NY,"11412     ","(347)233-5871   ",goodridgeshondell@gmail.com,female,2.83,Yes,na,"5 Ft 2 In",160,Bachelors,"Health Services Mgt BS",7,2019-07-07,2019-03-17
1609213302,"Reginald Shepard","10310 E Osie Cir",Wichita,KS,"67207     ","(316)789-5251   ",reggieshepard@mac.com,male,2.27,Yes,na,"5 Ft 11 In",230,Bachelors,"Comp Science NISS BS",10,2019-04-13,2019-05-20
1609213886,"Sasha Hayes","1945 Matthew Way",Lithonia,GA,"30058     ","(678)891-7596   ",sashaharper60@gmail.com,female,3.96,Yes,na,"5 Ft 4 In",180,Bachelors,"Bus Admin HR BS",30,2019-10-27,2019-05-30
1609214244,"Felicia Tate","14482 Corona St Lot 8",Bristol,VA,"24202     ","             2764695574   ",feliciatate2015@gmail.com,female,2.16,Yes,na,"5 Ft 1 In",198,Bachelors,"Health Services Mgt BS",13,2019-08-10,2019-02-15
1609214499,"Kayla Bliege","40480 State Highway 59","Bay Minette",AL,"36507     ",(251)620-9393,Kayla.bliege@outlook.com,female,3.85,Yes,na,"5 Ft 3 In",150,Bachelors,"Bus Admin BS",25,2019-09-01,2019-04-24
1609214604,"Qiandra Smith","458 County Road 288",Pachuta,MS,"39347     ","(601)227-6452   ",tuffy.lashay@gmail.com,female,3.38,Yes,na,"5 Ft 2 In",245,Bachelors,"Health Services Mgt BS",20,2019-08-04,2019-05-16
1609214834,"Edith Sosa","3137 Brentwood Road",Raleigh,NC,"27604     ","(919)696-3230   ",barleybandme@gmail.com,female,3.79,Yes,na,"5 Ft 6 In",185,Bachelors,"Comp Science SMAD BS",6,2019-09-29,2019-03-12
1609215086,"Wanda Beauford","322 Wilbur Ave",Kingston,NY,"12401     ","(845)514-2056   ",beaufordwanda@gmail.com,female,3.89,Yes,na,"5 Ft 9 In",272,Bachelors,"Health Information Mgmt BS",30,2017-08-10,2019-05-22
1609215263,"Shaunisha Mitchell","3317 E 118Th St",Cleveland,OH,"44120     ","(216)640-1189   ",sunshaun625@gmail.com,female,3.89,Yes,na,"5 Ft 7 In",240,Bachelors,"Health Services Mgt BS",1,2019-08-03,2019-05-25
1610215583,"Carnella Scott","6972 Red Bone Way",Lithonia,GA,"30038     ","(470)265-0242   ",mrsscott313@gmail.com,female,3.61,Yes,na,"5 Ft 5 In",140,Bachelors,"Health Services Mgt BS",30,2019-05-12,2019-02-23
1610215713,"Mayra Vargas","217 Bainbridge St Apt 3B",Brooklyn,NY,"11233     ","(704)241-2197   ",mayra1095@gmail.com,female,3.64,Yes,na,"5 Ft 4 In",160,Bachelors,"Comp Science SMAD BS",20,2019-11-10,2019-05-30
1610215934,"Tashawna Moore","17 Marina Rd","Island Park",NY,"11558     ","(516)670-6464   ",tashawna.moore@yahoo.com,female,3.54,Yes,na,"5 Ft 6 In",190,Completer,"Respiratory Therapy AS",10,2019-08-10,2019-05-15
1610215961,"Amber Nelson","1834 Walnut St Apt 1",Hopkinsville,KY,"42240     ","(443)674-6335   ",AMBER.NELSON.IU@GMAIL.COM,female,2.21,Yes,navy,"5 Ft 3 In",200,Associates,"Bus Mgmt & Acct AAS",3,2019-02-17,2019-02-20
1610216365,"Lester Pruyne","781 NW Riverside Drive","Port Saint Lucie",FL,"34983     ","(772)237-5969   ",lester.pruyne@gmail.com,male,4.00,Yes,na,"5 Ft 10 In",240,Associates,"Graphic Arts AAS",10,2019-01-23,2019-02-10
1610216604,"Melanie Baez","4227 Holcomb Circle","Flowery Branch",GA,"30542     ","(470)455-1140   ",mbaez1251@gmail.com,female,3.79,Yes,na,"5 Ft 5 In",200,Bachelors,"Health Services Mgt BS",8,2019-08-04,2019-05-22
1610216639,"Ronald Hemphill","310 New River Cir.",Henderson,NV,"89052    ","7022498053   ",ronhemp702@gmail.com,male,3.97,Yes,na,"6 Ft 2 In",260,Completed,"Respiratory Therapy AS",7,2019-01-06,2019-02-26
1610217463,"Brittany Ours","5 Zeno St",Buckhannon,WV,"26201     ","(304)844-8468   ",baours89@gmail.com,female,3.61,Yes,airforce,"5 Ft 7 In",135,Associates,"Med Spec AOS",8,2019-05-17,2019-05-28
1610217864,"Tera Askew","1025 Country Road 7",Greensboro,AL,"36744     ","(334)327-5184   ",taskew41@gmail.com,female,3.97,Yes,na,"5 Ft 4 In",220,Completer,"Respiratory Therapy AS",3,2019-03-16,2019-03-29
1610218022,"James Spence","316 S. 3Rd Avenue",Lanett,AL,"36863     ","(470)237-6008   ",jirehfitceo@gmail.com,male,3.21,Yes,army,"6 Ft 0 In",150,Associates,"Bus Mgmt & Acct AAS",15,2018-03-03,2019-02-23
1610218065,"Terry Manning","206 3Rd Ave",Gaffney,SC,"29340     ","(864)219-7062   ",terrystwin@yahoo.com,male,3.23,Yes,na,"5 Ft 11 In",230,Bachelors,"Bus Admin BS",30,2019-09-01,2019-05-28
1610218171,"Bridgette Boria","117 City Blvd - 1St Floor","Staten Island",NY,"10301     ","(929)426-1059   ",bjboria@gmail.com,female,3.25,Yes,na,"5 Ft 0 In",125,Completer,"Respiratory Therapy AS",6,2019-08-10,2019-05-11
1611218404,"Ethel Dixon","4268 HIDDEN VALLEY WAY, Apt - B",OAKWOOD,GA,30566,4044370395,baby.rai09@gmail.com,female,3.56,Yes,na,"5 Ft 4 In",190,Completer,"Respiratory Therapy AS",7,2019-08-05,2019-05-13
1611218441,"Joi Favors","2007 Sandlake Dr SW",Atlanta,GA,"30331     ","(678)768-4344   ",jfavor201@gmail.com,female,2.68,Yes,na,"5 Ft 6 In",145,Associates,"Bus Mgmt & Acct AAS",30,2019-03-19,2019-02-08
1611218546,"Tessa Dishmon","6236 Haddington Dr",Memphis,TN,"38119     ","(901)871-7899   ",honeytessie@yahoo.com,female,3.64,Yes,na,"5 Ft 3 In",170,Associates,"Med Spec AOS",15,2018-10-25,2019-04-09
1611219132,"Mia Treadwell","722 Summer Ridge Ln",Lawrenceville,GA,"30044     ","(470)424-4789   ",mstreadwell@yahoo.com,female,3.05,Yes,na,"5 Ft 10 In",160,Bachelors,"Bus Admin HR BS",30,2019-08-10,2019-03-07
1611219376,"Raynesha Hopson","4255 Smoke Creek Parkway B42",Snellville,GA,30039,4703654383,hrbrown7291@gmail.com,female,2.14,Yes,na,"5 Ft 2 In",254,Completer,"Business Diploma",7,2018-07-24,2019-05-30
1611219640,"Sharon Latson","3254 Strawberry Ln",Decatur,GA,"30034     ","(404)707-1972   ",sharon.latson49@gmail.com,female,3.65,Yes,na,"5 Ft 2 In",145,Bachelors,"Health Services Mgt BS",5,2019-08-10,2019-05-11
1611219646,"Tina Weaver","316 Glenburg Dr",Manchester,TN,"37355     ","(931)954-1051   ",t.coulson1975@hotmail.com,female,3.27,Yes,na,"5 Ft 6 In",195,Bachelors,"Health Services Mgt BS",1,2019-03-16,2019-03-19
1611219803,"Helenia Carbajal","705 S Chestnut St",Sallisaw,OK,"74955     ","(405)543-4881   ",corwiece06@gmail.com,female,3.47,Yes,na,"5 Ft 7 In",367,Bachelors,"Bus Admin HR BS",6,2020-02-02,2019-05-14
1611219917,"Keante Green","9114 spottswood rd",jacksonville,FL,"32208     ","(904)450-0481   ",lilkeante405@gmail.com,male,2.67,Yes,na,"5 Ft 11 In",140,Associates,"Med Spec AOS",10,2019-03-10,2019-02-14
1611220361,"Anna Cooper","2227 Cusseta Rd",Columbus,GA,"31903     ","(706)604-3289   ",annalondon467530@gmail.com,female,3.00,Yes,na,"5 Ft 10 In",295,Associates,"Bus Mgmt & Acct AAS",20,2019-01-09,2019-02-13
1611220519,"Kimberly Mack","509 Brairwood Dr",Tifton,GA,"31794     ","(229)472-0686   ",kembrown3@yahoo.com,female,3.35,Yes,na,"5 Ft 2 In",160,Associates,"Bus Mgmt & Acct AAS",10,2019-08-10,2019-02-12
1611220580,"Michelle Starns","305 Walnut Rd.",Starkville,MS,"39759     ","(662)418-2532   ",michelle.starns@yahoo.com,female,3.99,Yes,na,"5 Ft 6 In",145,Completer,"Respiratory Therapy AS",4,2018-11-15,2019-02-08
1611220586,"Bianca Pope","718 N. E. 7Th Place Apt 503",Trenton,FL,"32693     ","(352)210-7923   ",Superstarb30@gmail.com,female,2.96,Yes,na,"5 Ft 11 In",225,Bachelors,"Health Services Mgt BS",25,2019-08-10,2019-05-24
1612221006,"Sherica Davis","1242 Steele Ct. Apt 1",Jacksonville,FL,"32209     ","(904)290-0193   ",shericadavis@yahoo.com,female,3.19,Yes,na,"5 Ft 9 In",323,Bachelors,"Health Services Mgt BS",30,2019-09-29,2019-05-15
1612221971,"Latonya Dalton","5515 Scruggs Lane Apt. 507",Nashville,TN,"37207     ","(615)930-1308   ",daltonlatonya@gmail.com,female,3.81,Yes,na,"5 Ft 9 In",220,Associates,"Bus Mgmt & Acct AAS",5,2018-08-01,2019-02-08
1612222062,"Hannah Odafe","2326 Poco Dr","Missouri City",TX,"77489     ","(832)421-3134   ",hannahigiebor@yahoo.com,male,3.95,Yes,na,"5 Ft 6 In",180,Completer,"Respiratory Therapy AS",7,2019-08-10,2019-02-08
1612222440,"Briana Williams","1933 Mistyhill Dr",Cincinnati,OH,45240,"(480)709-5844   ",regineadele@outlook.com,female,3.41,Yes,na,"5 Ft 4 In",209,Associates,"Bus Mgmt & Acct AAS",20,2019-08-28,2019-04-11
1612222543,"Fabienne Surprise","916 Magnolia Ave.","North Lauderdale",FL,"33068     ","                ",fabiennesurprise87@gmail.com,female,2.61,Yes,na,"4 Ft 10 In",94,Associates,"Bus Mgmt & Acct AAS",13,2019-09-18,2019-05-01
1612222765,"Jodi-Ann Arthurs","113 West Haven Rd.",Greenville,NC,"27834     ","(252)814-5202   ",jodi.a4vr@yahoo.com,female,2.99,Yes,na,"5 Ft 4 In",215,Associates,"Bus Mgmt & Acct AAS",15,2019-08-10,2019-05-27
1612222894,"Nina Garland","371 Old Calhoun Rd",Plainville,GA,"30733     ","(706)314-2825   ",nina.garland@yahoo.com,female,3.79,Yes,na,"5 Ft 6 In",219,Associates,"Med Spec AOS",30,2018-09-15,2019-05-29
1612222995,"Kyle Kemper","525 Thornburg Pkwy",Brownsburg,IN,"46112     ","(317)927-5476   ",f8trkempo23@icloud.com,male,2.68,Yes,na,"5 Ft 10 In",180,Bachelors,"Bus Admin BS",12,2018-11-10,2019-05-06
1612223244,"Tynisa Smith","1736 Evergreen Rd",Harrisburg,PA,"17109     ","(717)743-8240   ",tynisa1977@gmail.com,female,3.69,Yes,na,"5 Ft 4 In",160,Bachelors,"Health Services Mgt BS",10,2019-09-01,2019-05-08
1612223475,"Deidre Whitfield","138 Oak Cir South",Stockbridge,GA,"30281     ","(404)957-1215   ",deidrewhitfield@ymail.com,female,3.25,Yes,na,"6 Ft 0 In",245,Associates,"Bus Mgmt & Acct AAS",10,2018-08-18,2019-02-15
1612223511,"Cynthia Cobb","319 N Jackson Street Apt. 2B",Starkville,MS,"39759     ","(662)617-5645   ",cobbcynthia2011@hotmail.com,female,3.10,Yes,na,"5 Ft 6 In",240,Associates,"Graphic Arts AAS",30,2019-05-12,2019-05-07
1701223902,"Nantaka Keith","834 Wilkerson Avenue",Durham,NC,"27701     ","(919)491-3025   ",Keithnantaka@yahoo.com,female,2.57,Yes,na,"5 Ft 6 In",190,Associates,"Med Spec AOS",16,2019-02-14,2019-02-14
1701224214,"Jasmine Johnson","506 Riverview Court Apt H","ROANOKE RAPIDS",NC,"27870     ","(704)677-8414   ",jasminejohnson357@gmail.com,female,2.16,Yes,na,"5 Ft 8 In",275,Associates,"Bus Mgmt & Acct AAS",15,2019-08-10,2019-05-13
1701224260,"Ladonna Moss","209 Marquis Way",Morrow,GA,"30260     ","(229)633-3109   ",deeshenelle@gmail.com,female,2.93,Yes,na,"5 Ft 4 In",175,Associates,"Bus Mgmt & Acct AAS",3,2019-08-10,2019-02-08
1701224756,"Ashley Rivera","325 Nw 4Th Street",Spiro,OK,"74959     ","(479)414-3233   ",nicole.ritchie1996@gmail.com,female,3.29,Yes,na,"5 Ft 2 In",315,Associates,"Med Spec AOS",4,2019-08-04,2019-04-10
1701224814,"Elaine Garcia","4007 Mountain Pass Dr.",Plano,TX,"75023     ","(253)678-6955   ",gypsy1969.eg@gmail.com,female,3.93,Yes,na,"5 Ft 6 In",175,Associates,"Bus Mgmt & Acct AAS",8,2019-01-19,2019-05-02
1701224849,"Neva Faulkner","1015 Hickory Hill Dr Apt A",Lancaster,SC,"29720     ","(863)812-5106   ",nmfaulkner@live.com,female,2.69,Yes,na,"5 Ft 3 In",115,Associates,"Med Spec AOS",8,2019-08-10,2019-05-30
1701225502,"Ian Clarke","1094 New York Ave #A1",Brooklyn,NY,"11203     ","(917)531-2244   ",ianclarke08@gmail.com,male,3.86,Yes,na,"5 Ft 9 In",210,Completer,"Respiratory Therapy AS",6,2019-06-19,2019-05-17
1701225876,"Avrelle Davis","1708 Bow Dr",Starksville,MS,"39759     ","(662)341-2902   ",avrelledavis@yahoo.com,female,4.00,Yes,na,"4 Ft 11 In",135,Masters,"Master in Public Health",25,2019-08-10,2019-04-26
1701225976,"Melissa Knauer","4001 Northfork Rd",Westfield,PA,"16950     ","(814)367-5324 ",mknauer2015@gmail.com,female,3.90,Yes,na,"5 Ft 1 In",221,Associates,"Bus Mgmt & Acct RS AAS",1,2018-10-14,2019-05-30
1701226358,"Lindsay Beckelheimer","5237 Haverfield Rd",Dayton,OH,"45432     ","(937)532-8234   ",lynziebeck@gmail.com,female,3.53,Yes,na,"5 Ft 3 In",135,Associates,"Bus Mgmt & Acct AAS",9,2018-09-15,2019-02-09
1701226629,"Chantel Cerna","706 E Roxana St",Hobbs,NM,"88240     ","(575)964-4474   ",cernachantal11@gmail.com,female,2.13,Yes,na,"5 Ft 2 In",147,Associates,"Med Spec AOS",7,2019-07-31,2019-05-06
1701227303,"Ramona Isaac","114 Bentwood Trail","West Monroe",LA,"71292     ","(318) 884-8157",ramona_isaac@yahoo.com,female,3.64,Yes,na,"5 Ft 4 In",160,Completer,"Respiratory Therapy AS",6,2019-04-14,2019-02-09
1702227424,"Cheri Palmer","475 Ball Park Rd.",Pinewood,SC,"29125     ","(803)968-2311   ",cheripalmer23@hotmail.com,female,3.17,Yes,na,"5 Ft 5 In",215,Associates,"Med Spec AOS",25,2019-08-10,2019-05-30
1702227662,"Shauntel Mathis","3531 Julia St",Memphis,TN,"38127     ","(901)604-4014   ",nulyfeent.mathis7@gmail.com,female,2.99,Yes,na,"5 Ft 2 In",165,Associates,"Bus Mgmt & Acct AAS",20,2019-01-21,2019-02-18
1702227965,"Hunter Stewart","3603 Jonesboro Rd","West Monroe",LA,"71292     ","(318)914-2671   ",hunter21346@yahoo.com,male,3.63,Yes,na,"6 Ft 3 In",250,Completer,"Respiratory Therapy AS",2,2019-05-21,2019-05-21
1702228304,"Christina Horton","102 Wesley Drive Apt D",Wrightsville,GA,"31096     ","(478)206-9777   ",idlywildgurl@yahoo.com,female,3.92,Yes,na,"5 Ft 5 In",177,Associates,"Med Spec AOS",15,2018-09-15,2019-04-02
1702228336,"Anissa Villella","360 Stevenson Dr",Magnolia,DE,"19962     ","(302)604-3959   ",avillella0@gmail.com,female,3.87,Yes,na,"5 Ft 7 In",230,Associates,"Med Spec AOS",8,2018-10-19,2019-05-19
1702228524,"Shana Gillihan","430 W 4Th St.","Mount Carmel",IL,"62863     ","(618)240-2680   ",s_gillihan_23@yahoo.com,female,3.25,Yes,na,"5 Ft 3 In",170,Associates,"Graphic Arts AAS",11,2019-04-13,2019-05-29
1702228937,"Stacie Johnson","437 Well Street",Leesville,SC,"29070     ","(803)687-6934   ",prbystaciejohnson@gmail.com,female,2.13,Yes,na,"5 Ft 5 In",200,Associates,"Med Spec AOS",20,2019-05-12,2019-03-12
1702229404,"Sandra Wise","49 Woodbine Drive","Colonial Beach",VA,"22443     ","(804)450-5413   ",kreptana17@gmail.com,female,3.81,Yes,na,"5 Ft 7 In",145,Associates,"Med Spec AOS",3,2019-08-10,2019-02-08
1702229964,"Vonchelle Allison","3325 Dunn Dr Apt 74",Huntsville,AL,"35805     ","(256)480-8173   ",vallison88@gmail.com,female,3.74,Yes,na,"5 Ft 4 In",360,Associates,"Med Spec AOS",20,2018-10-24,2019-03-30
1702230102,"Cheyenne Price","5391 Botts Ln",Petersburg,KY,"41080     ","(859)393-6250   ",cheyenne_brown39@yahoo.com,female,3.91,Yes,na,"5 Ft 7 In",220,Associates,"Bus Mgmt & Acct AAS",8,2019-07-06,2019-02-28
1703230691,"Teresa Rowe","2797 County Road 3906",JACKSONVILLE,TX,"75766     ","(903)339-4584   ",teresarowe9@gmail.com,female,2.93,Yes,na,"5 Ft 5 In",120,Associates,"Med Spec AOS",7,2019-08-10,2019-02-09
1703230803,"Laura Batzel","5820 White Church Rd",Shippensburg,PA,"17257     ","(717)414-6916   ","glbatzeljr@outlook.com                            ",female,3.89,Yes,na,"5 Ft 5 In",210,Completer,"Respiratory Therapy AS",2,2019-04-21,2019-05-20
1703231107,"Denitra Dumas","136 MLK Jr Road",Irwinton,GA,"31042     ","(478)258-2312   ",dumasdenitra7000@gmail.com,female,3.10,Yes,na,"5 Ft 5 In",175,Associates,"Bus Mgmt & Acct AAS",10,2019-08-10,2019-02-08
1703231262,"Valencia Johnson","1425 County Road 44",Tuskegee,AL,"36083     ","(334)216-1652   ",valenciajohnson358@gmail.com,female,2.50,Yes,na,"5 Ft 7 In",150,Associates,"Bus Mgmt & Acct AAS",8,2019-03-17,2019-02-10
1703231390,"Rachel McCoy","246 Dana Ave",Columbus,OH,"43223     ","(614)516-9482   ",rmccoy726@gmail.com,female,3.52,Yes,na,"5 Ft 6 In",126,Associates,"Bus Mgmt & Acct AAS",7,2018-10-13,2019-02-10
1703231498,"Dominiqua Fritts","1528 London Cross Road",Harvey,LA,"70058     ","(504)671-7152   ",dominiqua4cj@gmail.com,female,3.94,Yes,na,"5 Ft 5 In",168,Masters,"Healthcare Admin MS",14,2018-06-26,2019-02-08
1703231777,"Shellyann Cortina","7050 Parkside Court",Austell,GA,"30106     ","(678)751-3085   ",scortina22@gmail.com,female,4.00,Yes,na,"5 Ft 3 In",145,Associates,"Bus Mgmt & Acct AAS",20,2018-11-10,2019-03-29
1703231888,"Stephanie Dupper","4414 31St Pl East",Palmetto,FL,"34221     ","(941)345-9630   ",dupper.steph@yahoo.com,female,3.97,Yes,na,"5 Ft 2 In",190,Completer,"Respiratory Therapy AS",12,2019-10-27,2019-05-05
1703231973,"Kimberly Cousins","244 Old Knox Bridge Road","Fair Play",SC,"29643     ","(864)557-1303   ",cousins_kim@yahoo.com,female,2.96,Yes,na,"5 Ft 6 In",160,Associates,"Med Spec AOS",20,2019-08-10,2019-02-19
1703232236,"Roderick Passmore","6726 Tara Blvd Apt 31B",Jonesboro,GA,"30236     ",6782328415,newnannative1984@hotmail.com,male,3.71,Yes,na,"5 Ft 7 In",275,Associates,"Bus Mgmt & Acct AAS",30,2018-12-08,2019-02-09
1703232281,"Sheree Dyer","38000 Camden Street #17",Fremont,CA,"94536     ","(510)491-6571   ",sheree_antionette80@yahoo.com,female,3.43,Yes,na,"5 Ft 9 In",205,Completer,"Respiratory Therapy AS",10,2019-05-12,2019-04-23
1703232406,"Nikki Ruffin","442 Douglas Ave",Portsmouth,VA,"23707     ","(757)790-6773   ",oshungoddess86@gmail.com,female,2.86,Yes,na,"5 Ft 7 In",180,Associates,"Med Spec AOS",5,2019-08-10,2019-02-08
1703232480,"Felesha Lay","4621 Stemway Drive","New Orleans",LA,"70126     ","(504)539-2594   ",layfelesha@gmail.com,female,3.29,Yes,na,"5 Ft 5 In",220,Completer,"Respiratory Therapy AS",10,2019-05-17,2019-02-08
1703232545,"Kyra Douglas","894 Navahoe street",Detroit,MI,"48215     ","(313)646-8432   ",kdoug57@gmail.com,female,2.60,Yes,na,"5 Ft 2 In",180,Associates,"Bus Mgmt & Acct AAS",3,2019-04-14,2019-02-14
1703232577,"Samantha Mulvaney","502 East Oak Street",Chatsworth,IL,"60921     ","(815)579-8341   ",mysterious_dark_and_lonely_angel@yahoo.com,female,3.78,Yes,na,"5 Ft 8 In",290,Associates,"Med Spec AOS",17,2018-11-19,2019-02-11
1703232583,"Shirley Royal","894 Navahoe Street",Detroit,MI,"48215     ","(313)686-4560   ",preciousroyal91@gmail.com,female,2.68,Yes,na,"4 Ft 11 In",164.4,Associates,"Bus Mgmt & Acct AAS",3,2019-04-14,2019-02-14
1703233164,"Essence Ward","332 Lemery Dr",Columbus,OH,"43213     ","(614)596-1886   ",essencecollins93@gmail.com,female,3.47,Yes,na,"5 Ft 1 In",150,Associates,"Med Spec AOS",30,2018-12-01,2019-02-19
1703233228,"Johquetta Bradley","2918 El Paso Ct.",Montgomery,AL,"36110     ","(334)220-5043   ",johquettab@yahoo.com,female,2.82,Yes,na,"5 Ft 4 In",190,Associates,"Med Spec AOS",25,2019-08-10,2019-03-19
1703233263,"Stacey Camerlin","511 Florence Rd","New Cumberland",WV,"26047     ","(304)794-6157   ",sc4825@gmail.com,female,2.54,Yes,na,"5 Ft 5 In",170,Associates,"Med Spec AOS",6,2019-02-08,2019-05-14
1703233366,"Jayneasha Butts","3511 Barberry Ave NWApt. 6",Roanoke,VA,"24017     ","(540)904-8330   ",nadiasangel@gmail.com,female,4.00,Yes,na,"5 Ft 3 In",210,Associates,"Bus Mgmt & Acct AAS",22,2018-11-10,2019-05-20
1703233441,"Denika Cannon","6628 Morse Glen Lane",Jacksonville,FL,"32244     ","(904)472-7864   ",proudmom9872@gmail.com,female,2.80,Yes,na,"5 Ft 5 In",190,Associates,"Bus Mgmt & Acct AAS",10,2019-04-09,2019-05-09
1703233515,"Breyane Cunningham","5625 Antoine Dr.  Apt:1702",Houston,TX,"77091    ",(504)3737279,breyanec25@gmail.com,female,2.67,Yes,na,"5 Ft 3 In",221,Associates,"Med Spec AOS",10,2019-08-10,2019-03-17
1704233597,"Mychea Wright","60 E Pearl",Toledo,OH,"43608     ","(419)213-0415   ",mrz_chea@yahoo.com,female,2.57,Yes,na,"5 Ft 6 In",115,Associates,"Med Spec AOS",20,2019-08-10,2019-04-02
1704233715,"Tirhonda Sipes","717 S Belmont St",Wichita,KS,"67218     ","(316)226-3701   ",tirhonda29@gmail.com,female,3.58,Yes,na,"5 Ft 2 In",155,Associates,"Bus Mgmt & Acct AAS",16,2019-08-10,2019-03-11
1704233763,"Patricia Lodice","1329 Independence Dr.",Slidell,LA,"70458     ","(985)774-0362   ",plodice@yahoo.com,female,3.95,Yes,na,"5 Ft 4 In",167,Completer,"Respiratory Therapy AS",6,2019-04-19,2019-03-15
1704233847,"Rebecca Guire","103 Emerald Street",Slidell,LA,"70460     ","(504)452-2630   ",rguire1@yahoo.com,female,3.98,Yes,na,"5 Ft 4 In",150,Completer,"Respiratory Therapy AS",4,2019-04-15,2019-05-30
1704233862,"Erman Williams","916 Melrose Drive",Cookeville,TN,"38501     ","(931)544-3103   ",tenn_preacher_man@yahoo.com,male,3.97,Yes,na,"5 Ft 11 In",210,Associates,"Bus Mgmt & Acct AAS",14,2019-08-10,2019-03-09
1704234642,"Leisa Milliken","75 Harmony Lane",Thomaston,GA,"30286     ","(706)601-3854   ",mcwatersleisa18@gmail.com,female,3.60,Yes,na,"5 Ft 7 In",165,Associates,"Bus Mgmt & Acct AAS",30,1969-12-31,2019-05-02
1704234849,"Catherine Goodbrake","685 Hapgood St.",Athol,MA,"01331     ","(978)912-2871   ",Cathygoodbrake@gmail.com,female,2.94,Yes,na,"5 Ft 7 In",170,Associates,"Med Spec AOS",3,2019-04-01,2019-03-07
1704235091,"Andrea Bennett-Meredith","303 Cedarwood Rd","Highland Springs",VA,"23075     ","(804)939-3350   ",phatdivaceo@gmail.com,female,3.32,Yes,na,"5 Ft 9 In",250,Associates,"Bus Mgmt & Acct AAS",23,2018-12-07,2019-02-25
1704235222,"Charlot Marcelon","413 Weeks St.",Clinton,NC,"28328     ","(954)673-2229   ",charlomarcelon@yahoo.com,male,3.51,Yes,na,"5 Ft 7 In",165,Associates,"Bus Mgmt & Acct AAS",3,2018-12-08,2019-03-01
1704235627,"Christine Johnson","415 South Bridge St",Dewitt,MI,"48820     ","(517)712-8200   ",christinekay12@gmail.com,female,3.87,Yes,na,"5 Ft 5 In",155,Completer,"Respiratory Therapy AS",10,2019-05-13,2019-04-24
1704235727,"Hattie Harris","7883 Hawthorn Drive",Lincoln,DE,"19960     ","(302)864-3956   ",haharris1@ymail.com,female,2.33,Yes,na,"4 Ft 11 In",130,Associates,"Med Spec AOS",6,2019-08-10,2019-02-12
1704235746,"Lashonda Cannon","274 Henry Ave",Memphis,TN,"38107     ","(901)801-1417   ",lashondacannon.walton@gmail.com,female,3.97,Yes,na,"5 Ft 4 In",224,Associates,"Bus Mgmt & Acct AAS",4,2018-12-07,2019-04-17
1704236200,"Narda Patino","118 N 17th Ave","Melrose Park",IL,"60160     ","(312)912-3024   ",nardapatino@gmail.com,female,3.94,Yes,na,"5 Ft 9 In",160,Completer,"Respiratory Therapy AS",5,2019-03-21,2019-05-21
1704236978,"Amanda Lewis","118 Andrew Street",Williamston,NC,"27892     ","(252)508-8397   ",nikwamoore24@gmail.com,female,2.70,Yes,na,"5 Ft 2 In",170,Associates,"Bus Mgmt & Acct AAS",5,2019-08-10,2019-05-27
1705237042,"Lona Coalson","3115 Flat Top Rd",Ghent,WV,"25843     ","(304)305-0827   ",lcoalson40@outlook.com,female,3.21,Yes,na,"5 Ft 3 In",145,Associates,"Bus Mgmt & Acct AAS",2,2019-05-14,2019-03-13
1705237319,"Cassie Smith","215 Woods Farm Rd",Chesnee,SC,"29323     ","(864)529-7488   ",cassiensmith321@outlook.com,female,2.34,Yes,na,"5 Ft 2 In",130,Associates,"Med Spec AOS",6,2019-07-09,2019-04-24
1705237345,"Sarah Woodland","2210 Chalfont Drive Apt 42",Richmond,VA,"23224     ",(804)718-8062,pc4cinderella@yahoo.com,female,3.20,Yes,na,"5 Ft 4 In",191,Associates,"Graphic Arts AAS",20,2019-03-16,2019-02-08
1705237489,"Shadae White","15 Bens Drive #F",Annapolis,MD,"21403     ","                ",shadaejeremiah11@gmail.com,female,2.89,Yes,na,"5 Ft 4 In",230,Associates,"Bus Mgmt & Acct AAS",15,2019-02-20,2019-05-29
1705237577,"Kenesha Brooks","3713 Clarks Ln, Apt D",Baltimore,MD,21215,4436800856,minnie2293@gmail.com,female,3.93,Yes,marines,"5 Ft 2 In",108,Bachelors,"Health Services Mgt BS",15,2019-08-04,2019-05-14
1705237615,"Whitney Colson","6500 Se 84Th Ln",Trenton,FL,"32693     ","(352)278-8794   ",wnordstrom90@gmail.com,female,4.00,Yes,na,"5 Ft 5 In",150,Associates,"Bus Mgmt & Acct AAS",10,2018-11-10,2019-03-31
1705237641,"Hortencia Gonzalez","1013 East Winsett                                                                                                                                     ","Tahlequah                ",OK,"74464     ","(918)453-3005   ","hortenciagonzalez40@gmail.com                     ",female,3.35,Yes,na,"5 Ft 2 In",170,Associates,"Med Spec AOS",30,2018-11-26,2019-03-29
1705237660,"Lulama Cooper","313 sw 76 terrace","north lauderdale",fl,33068,9546048406,lulama.iu2018@gmail.com,female,4.00,Yes,na,"5 Ft 6 In",200,Associates,"Bus Mgmt & Acct AAS",8,2018-12-15,2019-02-11
1705238501,"Kecha Brown","903 Girod St #52-1A",Monroe,LA,"71202     ","(318)737-8137   ",kechabrown@yahoo.com,female,3.75,Yes,na,"5 Ft 5 In",213,Masters,"Bus Admin MS",6,2018-10-12,2019-02-23
1705238784,"Monique Corona","220 marsh haven rd","Sneads ferry","North Carolina",28460,4242790925,moniquer619@gmail.com,female,3.88,Yes,na,"5 Ft 6 In",185,Completer,"Respiratory Therapy AS",20,2019-08-10,2019-05-25
1705238873,"Keisha Knight","9909 Empire Ave",Cleveland,OH,"44108     ","(216)571-0208   ",kdelove87@gmail.com,female,3.62,Yes,na,"5 Ft 4 In",200,Associates,"Bus Mgmt & Acct AAS",15,2019-02-16,2019-03-29
1705238982,"Amy Johnson","317 North 95th Street APT 152",Milwaukee,WI,"53226     ","(414)600-3968   ",amynedbal@gmail.com,female,3.50,Yes,na,"5 Ft 4 In",170,Associates,"Med Spec AOS",2,2019-05-15,2019-05-15
1705239020,"Latherica Watkins","4283 Barr Ave.",Memphis,TN,"38111     ","(901)218-8183   ",sw33tocean@gmail.com,female,3.79,Yes,na,"5 Ft 2 In",143,Associates,"Bus Mgmt & Acct AAS",10,2019-01-20,2019-02-26
1705239049,"Bennie Richards","3885 D Buckthorne Drive","Orange Park",FL,"32065     ","(904)631-0754   ",richardsruth00@gmail.com,female,2.54,Yes,na,"5 Ft 4 In",195,Associates,"Med Spec AOS",10,2019-08-10,2019-02-08
1705240243,"Tina Cilento","807 Main Street APT 5D",Peekskill,NY,"10566     ","(914)257-9219   ",tina52280@gmail.com,female,3.42,Yes,na,"5 Ft 0 In",232,Associates,"Med Spec AOS",12,2019-03-17,2019-02-09
1705240581,"Monica Shields","6854 Grasselli Rd",Fairfield,AL,"35064     ","(205)2188966  ",monicashields03@gmail.com,female,2.13,Yes,na,"5 Ft 4 In",173,Associates,"Med Spec AOS",15,2019-02-22,2019-02-08
1706240691,"Shantell Gray","1211 Robbins St",Dothan,AL,"36303     ","(334)718-5463   ",spgee1005@gmail.com,female,3.51,Yes,na,"5 Ft 3 In",145,Associates,"Med Spec AOS",30,2019-03-14,2019-04-14
1706240700,"Virginia McGlocking","9 Lewiston Place","Palm Coast",FL,"32137     ","(904)540-5095   ",vmcglocking@yahoo.com,female,3.99,Yes,na,"4 Ft 11 In",143,Associates,"Med Spec AOS",10,2019-08-10,2019-02-09
1706240813,"Safiya Price","102 Springforest Drive Apt E",Henrico,Virginia,23223,"(804)939-387207   ",sprice0414@gmail.com,female,3.50,Yes,na,"5 Ft 0 In",110,Associates,"Med Spec AOS",8,2019-05-21,2019-05-28
1706240931,"Zakeeya Warren","3209 Boardwalk Lane #12",Greenville,NC,"27834     ","(252)623-9563   ",zakeeyawarren@gmail.com,female,2.12,Yes,na,"5 Ft 2 In",100,Associates,"Med Spec AOS",15,2019-08-10,2019-05-08
1706241359,"Kimberly Cooper","1904 Dutch Valley Rd Apt 6",Knoxville,TN,"37912     ","(423)404-8209   ",Kimcooper1977@gmail.com,female,3.27,Yes,na,"5 Ft 2 In",190,Associates,"Med Spec AOS",6,2019-03-30,2019-03-15
1706241791,"John Lakin","358 W. Campanella Drive",Columbia,SC,"29203     ",(803)361-5537,pbearlakin@gmail.com,male,2.19,Yes,army,"5 Ft 11 In",230,Associates,"Bus Mgmt & Acct AAS",20,2019-05-08,2019-05-08
1706242215,"Cherelle Ryant","1419 Baxter St",Orangeburg,SC,"29115     ","(904)947-5315   ",cryant29115@gmail.com,female,3.44,Yes,na,"5 Ft 6 In",147,Associates,"Med Spec AOS",10,2019-06-09,2019-03-13
1706242486,"Tamia Davis","419 Fairview Ave",Bridgeport,CT,"06606     ","(203)545-2017   ",tamiadavis17@yahoo.com,female,3.55,Yes,na,"5 Ft 0 In",100,Associates,"Med Spec AOS",20,2019-02-17,2019-05-17
1706242603,"Traronna Ewing","5402 Rue Nicole St",Baker,LA,"70714     ","(225)250-2870   ",travonnaewing@yahoo.com,female,2.73,Yes,na,"5 Ft 6 In",102,Associates,"Bus Mgmt & Acct AAS",30,2019-02-17,2019-02-20
1706242632,"Tierria Hill","325 Cool Weather Drive",Lawrenceville,GA,"30045     ","(256)919-1164   ",tierriaholmes@gmail.com,female,3.23,Yes,na,"5 Ft 8 In",140,Associates,"Med Spec AOS",25,2019-08-10,2019-02-08
1706242646,"Santania Jones","6101 Bailey Street",Columbia,SC,"29203     ","(803)440-7806   ",Santaniajones@yahoo.com,female,2.22,Yes,na,"5 Ft 2 In",190,Associates,"Med Spec AOS",12,2019-08-09,2019-05-13
1706242773,"Shareida Pender","162 Ridgecrest Drive",Warrenton,NC,"27589     ","(252)213-3883   ",losgurl.sw@gmail.com,female,3.67,Yes,na,"5 Ft 4 In",161,Associates,"Bus Mgmt & Acct AAS",22,2019-08-10,2019-03-15
1706242892,"Chelsea Greeley","7803 Welter Road",Ovid,MI,"48866     ","(814)844-3969   ",chelchi116@aol.com,female,2.39,Yes,na,"5 Ft 7 In",190,Associates,"Med Spec AOS",12,2019-03-05,2019-05-10
1706243010,"Donna Curtis","6132 Loch Laural Lane",Raleigh,NC,"27613     ","(704)412-0266   ",dcurti013@gmail.com,female,4.00,Yes,na,"5 Ft 2 In",200,Completer,"Resp Care Adv Clinical Pract BS Completer",5,2019-02-16,2019-02-13
1706243761,"Audra Wright","4075 Blue River Dr.","St. Clair",MI,"48079     ","(810)326-1524   ",audrarwright@gmail.com,female,3.83,Yes,na,"5 Ft 4 In",110,Associates,"Med Spec AOS",1,2019-08-31,2019-03-21
1706243903,"Cynthia Shackelford","5801 Dove Dr","Hope Mills",NC,"28348     ","(910)821-4139   ",cleigh3751@gmail.com,female,3.92,Yes,na,"5 Ft 5 In",145,Associates,"Bus Mgmt & Acct AAS",13,2019-05-12,2019-05-29
1706243976,"Jennifer Warner","4407 Burkhardt Avenue, Apt. C3",Dayton,"OH Ohio",45431,9372196783,bookrdr67@gmail.com,female,3.68,Yes,na,"5 Ft 3 In",140,Associates,"Bus Mgmt & Acct AAS",4,2019-07-31,2019-02-08
1707244293,"Anjelica Lara","355 Gravel Hill Rd",Limestone,TN,"37681     ","(423)218-5931   ",anjelicalara92@gmail.com,female,3.91,Yes,na,"5 Ft 2 In",210,Associates,"Med Spec AOS",3,2019-03-17,2019-02-08
1707244299,"Laquisha Wilmore","6094 Hightower Rd","Fort Lawn",SC,"29714     ","                8034175550",wilmore94@icloud.com,female,2.70,Yes,na,"5 Ft 3 In",168,Associates,"Med Spec AOS",10,2019-05-01,2019-05-27
1707244531,"Tamesha Green","580 Smith St",Varnville,SC,"29944     ","(803)346-0135 ",tameshagreen843@gmail.com,female,3.47,Yes,na,"5 Ft 3 In",170,Associates,"Med Spec AOS",7,2019-08-10,2019-03-26
1707244550,"Cheyenne Melton","716 Alabama Ave","Lynn Haven",FL,32444,8507046934,chevylovinstudd21@gmail.com,female,2.62,Yes,na,"5 Ft 7 In",260,Associates,"Med Spec AOS",8,2019-08-10,2019-02-26
1707244572,"Shane Dutton","2621 Horsham Road Apartment A-3",Hatboro,PA,"19040     ","(267)858-2399   ",sdutton0527@gmail.com,male,3.01,Yes,na,"5 Ft 10 In",315,Associates,"Graphic Arts AAS",6,2019-08-10,2019-02-08
1707244623,"Danielle Blackwell","4805 Wildewood Rd",Bennettsville,SC,"29512     ","(910)610-7401   ",johnlee21611@gmail.com,female,3.52,Yes,na,"5 Ft 2 In",170,Associates,"Med Spec AOS",25,2019-06-01,2019-04-30
1707244772,"Schnell Williams","108 Westcott Lane",Albany,GA,"31721     ","(229)869-2620   ",lanemartha1955@gmail.com,female,2.46,Yes,na,"5 Ft 6 In",175,Associates,"Med Spec AOS",8,2019-08-10,2019-02-12
1707244860,"Maricruz Hernandez","216 tuckahoe lane",Southampton,NY,"11968     ","(631)204-7965   ",maricruzhernandez907@gmail.com,female,2.90,Yes,na,"5 Ft 2 In",168,Associates,"Bus Mgmt & Acct AAS",11,2019-08-10,2019-02-09
1707244912,"Rhoni Pister","11704 Daniel Cemetery Trl","Green Castle",MO,"63544     ","(816)262-7285   ",rhoni.p13@gmail.com,female,3.57,Yes,na,"5 Ft 9 In",230,Completer,"Respiratory Therapy AS",3,2019-07-06,2019-03-18
1707245127,"Kristin Davis","414 Grant St. Sw","Grand Rapids",MI,"49503     ","(616)617-0172   ",cancerbaby81@yahoo.com,female,2.14,Yes,na,"5 Ft 6 In",255,Associates,"Med Spec AOS",15,2019-06-01,2019-02-12
1707245161,"Elbone Pinkston","697 Roy Mann Rd",Newton,MS,"39345     ","(601)507-2010   ",misselbone@gmail.com,female,2.93,Yes,na,"5 Ft 1 In",200,Associates,"Med Spec AOS",5,2019-08-10,2019-02-08
1707245183,"Justine Friend","4826 Portsmouth Blvd",Portsmouth,VA,"23701    ","(757)401-2441   ",justine.friend@yahoo.com,female,3.92,Yes,na,"5 Ft 5 In",215,Completer,"Respiratory Therapy AS",9,2019-07-07,2019-02-28
1707245796,"Danielle Thompson","5297 Gibbons Drive",Carmichael,CA,"95608     ","(916)617-6501   ",octoberpeanut@gmail.com,female,3.22,Yes,na,"5 Ft 6 In",215,Associates,"Med Spec AOS",2,2019-02-09,2019-02-09
1707246150,"Sonya Floyd","P.O. Box 122",Lumberton,NC,"28359     ","(910)501-9117   ",sonya.floyd8@yahoo.com,female,3.98,Yes,na,"5 Ft 8 In",152,Associates,"Med Spec AOS",8,2018-11-11,2019-02-28
1707246164,"Keyona Corlew","301 Spring St Apt B21                                                                                                                                 ","Dickson                  ",TN,"37055     ","(615)512-6425   ","keyonasexpressions@gmail.com                      ",female,3.46,Yes,na,"5 Ft 7 In",320,Associates,"Med Spec AOS",10,2019-04-01,2019-02-08
1707246328,"Melissa Lowe","23 Fairview Street",Cartersville,GA,"30120     ","(470)439-4573   ",lowe.melissa@outlook.com,female,3.33,Yes,na,"5 Ft 8 In",225,Associates,"Med Spec AOS",30,2019-03-17,2019-02-09
1707246503,"Britnee Malecha","1891 230th St West",Faribault,MN,"55021     ","(507)384-1927   ",britnee.malecha@gmail.com,female,3.93,Yes,na,"5 Ft 4 In",240,Associates,"Med Spec AOS",5,2019-03-25,2019-04-02
1707246541,"Brian Jones","804 Ninth St",Houma,LA,"70364     ",(985)647-1221,Bjones42.bj@gmail.com,male,2.28,Yes,na,"5 Ft 5 In",145,Associates,"Graphic Arts AAS",4,2019-08-01,2019-02-22
1707246874,"Bethany Autry","785 Berry Rd",Cedartown,GA,"30125     ","(706)934-0498   ",autryrome@aol.com,female,2.43,Yes,na,"5 Ft 4 In",155,Associates,"Med Spec AOS",12,2019-08-04,2019-02-08
1707246957,"Sarah Nyman","113 S. Ward St",Stockton,Illinois,61085,8158580705,cntstopsmilin@gmail.com,female,3.78,Yes,na,"5 Ft 5 In",217,Associates,"Med Spec AOS",4,2019-07-07,2019-05-30
1707247009,"Jerel Smith","3550 Pleasant Hill Road Apt 120",Duluth,GA,"30096     ","                ","jerels83artist@gmail.com                          ",male,4.00,Yes,na,"5 Ft 11 In",260,Associates,"Graphic Arts AAS",4,2019-03-16,2019-02-22
1707247093,"Betty Carpenter","1610 Dallas Stanley Hwy",Dallas,NC,"28034     ","(704)460-3420   ",sinfulsaint0922@gmail.com,female,2.60,Yes,na,"5 Ft 5 In",195,Associates,"Med Spec AOS",8,2019-03-17,2019-02-08
1707247142,"Tiffany Thorpe Reed","2416 W Highland Ave",Milwaukee,WI,"53233     ","(414)499-0898   ",tloveablett@yahoo.com,female,2.73,Yes,na,"4 Ft 11 In",180,Associates,"Bus Mgmt & Acct AAS",8,2019-06-10,2019-05-09
1707247402,"Tammy Williams","1925 Bowman Rd",Lima,OH,"45804     ","(567)204-1114   ",bentleysmommy040812@gmail.com,female,2.91,Yes,na,"5 Ft 3 In",130,Associates,"Med Spec AOS",1,2019-04-14,2019-04-25
1708247730,"Kenyanna Whyte","5213 Acoma Ave",Jacksonville,FL,"32210     ","(904)888-3464   ",kenyannawhyte@ymail.com,female,2.94,Yes,na,"5 Ft 2 In",154,Associates,"Bus Mgmt & Acct AAS",30,2019-08-10,2019-03-09
1708248093,"Taloria France","132 Heatherfield Dr","West Columbia",SC,"29170     ","(803)521-6300   ",taloriaf@gmail.com,female,3.47,Yes,na,"5 Ft 5 In",235,Completer,"Resp Care Mgmt BS Completer",10,2019-05-12,2019-04-22
1708248373,"Jamerica Smith","PO Box 18051",Knoxville,TN,"37928     ","(865)660-6271   ",asmith2711@gmail.com,female,3.99,Yes,na,"5 Ft 6 In",180,Associates,"Bus Mgmt & Acct AAS",12,2019-04-19,2019-02-08
1708248459,"Donna Sines","23480 George Washington Hwy",Aurora,WV,"26705     ","(304)735-3627   ",ds071182@yahoo.com,female,4.00,Yes,na,"5 Ft 7 In",230,Associates,"Med Spec AOS",4,2019-06-01,2019-02-17
1708248593,"Jasmine Smith","919 Elizabeth St",Chester,PA,"19013     ","(610)800-9600   ",jasminesmith082783@gmail.com,female,2.78,Yes,na,"5 Ft 2 In",180,Associates,"Med Spec AOS",20,2019-04-14,2019-03-12
1708248634,"Markayla Smith","945 N. Danahue Drive Apt. #39",Auburn,AL,"36832     ","(334)734-7486   ",smithmarkayla9@gmail.com,female,3.11,Yes,na,"5 Ft 4 In",171,Associates,"Graphic Arts AAS",20,2019-06-01,2019-05-29
1708248635,"Connie Powell","8484 Dent Cockrell Road",Bastrop,LA,"71220     ","(318)614-7112   ",conniekat@msn.com,female,3.96,Yes,na,"5 Ft 4 In",249,Masters,"Healthcare Admin MS",5,2019-01-09,2019-02-09
1708248699,"Alexis Goforth","709 Eric Drive",Nashville,TN,"37207     ","(615)877-9784   ",kimbro570@gmail.com,female,3.36,Yes,na,"5 Ft 0 In",135,Associates,"Med Spec AOS",15,2019-04-14,2019-02-08
1708248890,"Kala McMain","315 1/2 N. 6th St.",Vandalia,IL,"62471     ","(217)240-5703   ",kalarenee89@yahoo.com,female,3.88,Yes,na,"5 Ft 4 In",115,Associates,"Bus Mgmt & Acct AAS",10,2019-04-26,2019-03-10
1708248975,"Cecilia Lopez","22152 E Belleview Pl",Aurora,CO,80015,7206105107,cecejoe8590@icloud.com,female,2.95,Yes,na,"4 Ft 11 In",150,Associates,"Bus Mgmt & Acct AAS",20,2019-10-31,2019-05-14
1708249133,"Rashaad Butler","10104 Mindy Ct",Fredericksburg,VA,"22408     ","(540)498-0228   ",butler.rashaad@yahoo.com,male,3.73,Yes,na,"5 Ft 5 In",223,Associates,"Bus Mgmt & Acct AAS",10,2019-03-17,2019-03-21
1708249171,"Tamica Marsh","4375 Abingdon Drive","Stone Mountain",GA,"30083     ","(678)7546348   ",tamica.marsh@yahoo.com,female,2.27,Yes,na,"5 Ft 7 In",180,Associates,"Bus Mgmt & Acct AAS",4,2019-08-10,2019-04-08
1708249189,"Camila Torres","484 Rogers Ave",Macon,GA,"31204     ","(912)850-2778   ",ct031499@gmail.com,female,3.27,Yes,na,"5 Ft 6 In",165,Associates,"Med Spec AOS",9,2019-05-11,2019-05-21
1708249344,"Gloria Rodriguez","2853 No 9th St",Philadelphia,PA,"19133     ","(267)622-5705   ",iza122505@gmail.com,female,3.56,Yes,na,"5 Ft 4 In",290,Associates,"Med Spec AOS",16,2019-04-19,2019-03-19
1708249557,"Benecia Spivey","235 Horace Carter Rd",Gatesville,NC,"27938     ","(252)287-9022   ",Baspivey0172@gmail.com,female,3.80,Yes,na,"5 Ft 4 In",250,Associates,"Med Spec AOS",10,2019-06-09,2019-05-24
1708249591,"Andrea Berrian","608 New Hudson St.",Valdosta,GA,"31601     ","(229)299-1549   ",andrea39story@gmail.com,female,2.94,Yes,na,"5 Ft 0 In",187,Associates,"Med Spec AOS",20,2019-03-21,2019-05-24
1708249596,"Keondralayer Estell","3281 Knight Trails Cir, APT 105",MEMPHIS,Tennessee,38115,9013648574,estell.keondralayer@gmail.com,female,3.44,Yes,na,"5 Ft 2 In",270,Associates,"Graphic Arts AAS",10,2019-08-10,2019-02-21
1708250331,"Rasheedah Murphy","1532 31st Street Ensley",Birmingham,Alabama,35218,2055190872,rasheedamurphy8232@gmail.com,female,2.85,Yes,na,"5 Ft 4 In",235,Associates,"Bus Mgmt & Acct AAS",12,2019-08-10,2019-05-18
1708250372,"Jeanelle Pierre","290 William St",Raceland,LA,"70394     ","(504)239-4833   ",davisjeanelle30@gmail.com,female,2.68,Yes,na,"5 Ft 4 In",156,Associates,"Med Spec AOS",8,2019-06-01,2019-03-04
1708250444,"Dedra Adams","4036 Sweetbriar Lane","Forest Park",GA,"30297     ","(678)724-0128   ",dedraadams83@yahoo.com,female,3.51,Yes,na,"5 Ft 5 In",142,Associates,"Bus Mgmt & Acct AAS",8,2019-01-10,2019-02-09
1708250637,"Trina Hughes","208 Starnes Point Ct","Fort Mill",SC,"29715     ","(803)295-0452   ",trinahughes1977@gmail.com,female,3.63,Yes,na,"5 Ft 7 In",292,Associates,"Bus Mgmt & Acct AAS",20,2019-06-09,2019-05-08
1708250742,"Shaquasia Rodgers","6014 Delta Crossing Lane Apt I",Charlotte,NC,"28212     ","(704)941-0359   ",srodgers376@gmail.com,female,3.95,Yes,na,"5 Ft 1 In",200,Associates,"Bus Mgmt & Acct AAS",15,2019-08-10,2019-02-09
1708250981,"Jennifer Arms","203 Lakeshore Drive",Gaffney,SC,"29341     ","(864)425-0924   ",jaarms79@gmail.com,female,4.00,Yes,na,"5 Ft 6 In",180,Completer,"Resp Care Adv Clinical Pract BS Completer",6,2019-02-16,2019-02-16
1708251135,"Shawn Hopkins","336 Busby Rd",Ellisville,MS,"39437     ","(601)498-2389   ",shawnandjojo3225@gmail.com,female,2.75,Yes,na,"5 Ft 5 In",189,Associates,"Med Spec AOS",5,2019-08-10,2019-02-27
1708251216,"Lasasha Anderson","2919 Ross Ave",Charlotte,NC,"28208     ","7042418083   ",lasashaanderson@gmail.com,female,3.57,Yes,na,"5 Ft 0 In",180,Associates,"Bus Mgmt & Acct AAS",15,2019-08-10,2019-05-06
1708251311,"Yatzely Quintana-Rosario","12 Hazel St",Methuen,MA,"01844     ","(407)202-2644   ",yatzely15@hotmail.com,female,2.55,Yes,na,"5 Ft 0 In",150,Associates,"Med Spec AOS",3,2019-06-01,2019-02-08
1708251380,"Marissa Morrow","404 S. Scottswood Dr",Urbana,IL,"61802     ","(217)600-1070   ",rissaspriggs@yahoo.com,female,3.09,Yes,na,"5 Ft 1 In",145,Associates,"Med Spec AOS",10,2019-06-09,2019-02-12
1708251382,"Brittany Powell","3927 Chace Lake Cove",Hoover,AL,"35244     ","(205)792-5258   ",brittanypowell3258@yahoo.com,female,2.77,Yes,na,"5 Ft 4 In",177,Associates,"Med Spec AOS",5,2019-08-10,2019-02-09
1708251491,"Mary Vargas","2183 Noel C Conaway Rd",Guyton,GA,"31312     ","(912)667-7266   ",georgiabulldogsusan62@gmail.com,female,2.37,Yes,na,"5 Ft 5 In",140,Associates,"Med Spec AOS",6,2019-08-10,2019-05-09
1708251724,"Lori Rogers","2110 South Main Street",Kannaplois,NC,"28081     ","(704)886-8195   ",lorihoover25@gmail.com,female,3.02,Yes,na,"5 Ft 1 In",210,Associates,"Bus Mgmt & Acct AAS",6,2019-08-10,2019-03-13
1709252271,"Aquanetta Russell-Williams","2300 Diamond Mesa Trails SW  APT 5101",Albuquerque,NM,"87121     ","(903)830-8212   ",aquanettarussellwilliams@gmail.com,female,3.98,Yes,army,"5 Ft 2 In",170,Masters,"Bus Admin ENT MS",15,2019-05-01,2019-05-07
1709252660,"Julia Whitmore","3741 White House  Parkway","Warm springs",GA,"31830     ","(706)412-6892   ",jwhitmore191@gmail.com,female,3.74,Yes,na,"5 Ft 0 In",189,Associates,"Med Spec AOS",10,2019-08-10,2019-02-08
1709252690,"Ruby Green","408 Washington St PO BOX 654","Delaware City",DE,"19706     ","(267)226-1237   ",rubyschoolwork2@gmail.com,female,2.13,Yes,na,"5 Ft 7 In",210,Associates,"Bus Mgmt & Acct AAS",2,2019-09-20,2019-04-18
1709252710,"Alexis Rudolph","212 Duckridge Dr.",Pikeville,NC,"27863     ","(919)252-7284   ",babyphat25@nc.rr.com,female,3.55,Yes,na,"5 Ft 10 In",265,Associates,"Med Spec AOS",15,2019-06-09,2019-05-21
1709252875,"Kelda Desir","5239 Cedar Shoals Drive",Buford,GA,"30519     ","(347)834-5216   ",kdesir73@yahoo.com,female,2.06,Yes,na,"5 Ft 3 In",157,Bachelors,"Health Services Mgt BS",12,2019-08-10,2019-03-26
1709252974,"Lydia Saunders","108 Creston Oaks Court",Forest,VA,"24551     ","(434)426-3508   ",lydialopez9773@gmail.com,female,3.43,Yes,na,"5 Ft 4 In",250,Associates,"Med Spec AOS",12,2019-06-06,2019-05-12
1709252998,"Tiffany Ritzer","7330 North Graham Road",Indianapolis,IN,"46250     ","(317)246-0042   ",tiffanyred2@yahoo.com,female,3.32,Yes,na,"5 Ft 1 In",81,Associates,"Graphic Arts AAS",10,2019-08-04,2019-02-22
1709253029,"Anatesha Whitney-Barham","5832 Ludlow St",Philadelphia,PA,"19139     ","(267)905-6452   ",barhamanatesha@gmail.com,female,3.74,Yes,na,"5 Ft 2 In",205,Associates,"Med Spec AOS",30,2019-08-10,2019-05-19
1709253101,"Samantha Sparling","223 S Elm St",Nokomis,IL,"62075     ","(217)821-2202   ",samantha.sparling92@yahoo.com,female,2.12,Yes,na,"5 Ft 6 In",180,Associates,"Med Spec AOS",6,2019-08-10,2019-03-27
1709253253,"Mary Vanderbilt","8080 Roselawn St.",Detroit,MI,"48204     ","(734)469-0744   ",vanderbiltmary@gmail.com,female,2.14,Yes,na,"5 Ft 3 In",270,Associates,"Med Spec AOS",10,2019-02-09,2019-02-09
1709253446,"Tracy Williams","903 High St #A                                                                                                                                        ","Vidalia                  ",GA,"30474     ","(912)259-3455   ","whosthatlady1967@gmail.com                        ",female,2.98,Yes,na,"5 Ft 2 In",275,Associates,"Med Spec AOS",3,2019-08-02,2019-02-08
1709253456,"Jessica Bryant","2830 Stoddard #117","St. Louis",MO,"63106     ","(314)899-7274   ",jfrazier2588@gmail.com,female,3.25,Yes,na,"5 Ft 3 In",226,Associates,"Med Spec AOS",8,2019-06-24,2019-05-09
1709253599,"Kelsey Foster","1605 Meadow Oak Drive",Snellville,GA,30078,"(470)278-3790   ","fosterjordan70@yahoo.com                          ",female,3.74,Yes,na,"4 Ft 11 In",123,Associates,"Med Spec AOS",25,2019-07-05,2019-02-09
1709253833,"Angela Drummond","200 Woody Rd apt 63",Pendleton,SC,"29670  ","(864)617-6195   ",leangel_05@yahoo.com,female,3.40,Yes,na,"5 Ft 3 In",195,Associates,"Bus Mgmt & Acct AAS",25,2019-07-07,2019-05-26
1709253835,"Tiffany Yates","5920 Topaz Ave","Port Arthur",TX,"77640     ",4093474338,tiffanylapoint36@yahoo.com,female,2.25,Yes,na,"5 Ft 10 In",305.0,Associates,"Med Spec AOS",3,2019-08-10,2019-05-07
1709254165,"Mary Fuqua","226 Virginia Ave Nw",Harriman,TN,"37748     ","(865)387-1457  ",sugfuq@gmail.com,female,3.44,Yes,na,"5 Ft 6 In",190,Associates,"Med Spec AOS",21,2019-05-30,2019-04-15
1709254598,"Sherlonza Hamilton","100 Riverpointe Drive Apt#31",Fulton,MS,"38843     ","(662)321-7796   ",sherlonzap@yahoo.com,female,2.75,Yes,na,"5 Ft 1 In",140,Associates,"Med Spec AOS",20,2019-08-10,2019-04-11
1709254776,"Gwendolyn Woods","13200 Brickyard Rd",Independence,LA,"70443     ","(985)474-1992   ",gwenrperry@gmail.com,female,2.90,Yes,na,"5 Ft 5 In",205,Associates,"Med Spec AOS",20,2019-08-10,2019-02-08
1709254820,"Gwennett Dakus","7901 Baymeadows Circle East, Apt 561",Jacksonville,FL,"32256     ","(912)321-3865   ",cgdakus@gmail.com,female,3.56,Yes,army,"5 Ft 3 In",155,Associates,"Med Spec AOS",30,2019-06-10,2019-05-06
1709254904,"Anita Johnson","4601 Quail Hollow Dr Apt1511",Baytown,TX,"77521     ","(832)207-0926   ",ajohani72@gmail.com,female,3.16,Yes,na,"5 Ft 9 In",235,Associates,"Bus Mgmt & Acct AAS",10,2019-08-01,2019-03-07
1709254908,"Rhoton French","3807 Middlebrook Pike apt 705",Knoxville,TN,"37921     ","(865)287-5465   ",cfrench484@gmail.com,male,3.57,Yes,na,"5 Ft 9 In",380,Associates,"Graphic Arts AAS",1,2019-07-07,2019-02-08
1709254931,"Elisa Corado","651 D- Eagle Court",Camden,GA,"31558     ","(843)941-0087   ",elisa.hanney@yahoo.com,female,1.83,Yes,na,"5 Ft 2 In",200,Associates,"Graphic Arts AAS",8,2019-09-29,2019-05-23
1709255048,"Titonya Fulwood","49 Budhollow Ln",Willingboro,NJ,"08046     ","(609)858-8314   ",carmelteetee@yahoo.com,female,3.81,Yes,na,"5 Ft 4 In",185,Associates,"Med Spec AOS",6,2019-06-09,2019-05-22
1709255185,"Jennifer Baez","2908 Fallswood Drive",Gastonia,NC,"28052     ","(704)297-8301   ",jbaez4818@gmail.com,female,2.51,Yes,army,"5 Ft 5 In",165,Associates,"Med Spec AOS",8,2019-06-30,2019-05-29
1709255400,"Necia Berman","92 3rd st",Midway,GA,"31320     ","(912)492-8401   ",neciafandrich@aol.com,female,3.85,Yes,army,"4 Ft 11 In",170,Associates,"Bus Mgmt & Acct AAS",5,2019-07-07,2019-02-24
1710255879,"Travis McCray","380 Days Ave","Fort Gaines",GA,"39851     ","(229)7683836  ",travismccray23@yahoo.com,male,3.96,Yes,na,"5 Ft 11 In",175,Associates,"Bus Mgmt & Acct AAS",30,2019-08-10,2019-03-01
1710255997,"Chyna Cains","51 Tanglewood Road",Carthage,TN,"37030     ","(615)581-1381   ",chyna2398@icloud.com,female,2.52,Yes,na,"4 Ft 11 In",135,Associates,"Med Spec AOS",8,2019-08-10,2019-02-08
1710256075,"Misty Cagle","161 Dexter Circle",Madison,AL,"35757     ","(205)834-2986   ",cagle_misty@yahoo.com,female,2.63,Yes,na,"5 Ft 7 In",295,Associates,"Graphic Arts AAS",30,2019-06-09,2019-04-24
1710256300,"Casey Bolt","3590 Pierce Dairy Rd",Madison,GA,"30650     ","(404)764-9059   ",casey_bolt@yahoo.com,female,3.11,Yes,na,"5 Ft 5 In",107,Associates,"Med Spec AOS",30,2019-06-06,2019-04-21
1710256358,"Ashabi Edwards","1925 Monroe Dr. NE #1053",Atlanta,GA,"30324     ","(347)797-9693   ",ashabiedwards1990@gmail.com,female,3.97,Yes,na,"5 Ft 2 In",130,Associates,"Bus Mgmt & Acct AAS",10,2019-06-01,2019-05-05
1710256540,"Amanda Agerton","3237 W County Road 51 N,",Rockport,IN,"47635     ","(270)313-6280   ",amanda.hurse@yahoo.com,female,3.04,Yes,na,"5 Ft 7 In",209,Associates,"Med Spec AOS",14,2019-08-10,2019-02-28
1710256746,"Didier Kana","19 k  state street",Leominster,MA,"01453     ","(978)549-3086   ",dkana1974@gmail.com,male,3.89,Yes,na,"5 Ft 7 In",174,Masters,"Bus Admin MS",5,2019-08-10,2019-02-14
1710256777,"Kyeisha Lott","46038 Rufus Bankston Rd. Apt. 244",Hammond,LA,"70401     ","(318)379-5557   ",klott001@gmail.com,female,3.68,Yes,na,"5 Ft 10 In",175,Masters,"Information Systems MS",10,2019-02-14,2019-05-28
1710257343,"Marsha Williams","698 Willow Creek Drive",Fenton,MO,"63026     ",314-347-5890,williamsmarsha2015@gmail.com,female,2.96,Yes,na,"5 Ft 5 In",215,Associates,"Med Spec AOS",4,2019-06-09,2019-04-30
1710257620,"Susan Parsons","4572 Highway 178 East","Potts Camp",MS,"38659     ","(901)488-8603   ",susan.parsons@tenethealth.com,female,4.00,Yes,na,"5 Ft 3 In",195,Masters,"Bus Admin MS",14,2019-03-01,2019-03-16
1710257792,"Kyleigh Carper","267 Tucker Road",Pauline,SC,"29374     ",(864)4978582,carper0kyleigh@gmail.com,female,3.20,Yes,na,"5 Ft 5 In",115,Associates,"Med Spec AOS",1,2019-08-10,2019-02-12
1710257840,"Stacy Knapmiller","1087 Westport Dr. Apt. 254","Port Washington",WI,"53074     ","(262)483-8006   ",sknapmiller15@gmail.com,female,3.88,Yes,na,"5 Ft 5 In",175,Associates,"Bus Mgmt & Acct AAS",1,2019-08-04,2019-03-22
1710258090,"Chanel Henry","3079 Iona Ct",Snellville,GA,"30039     ","(516)526-7707   ",chanelhenry21@yahoo.com,female,3.58,Yes,na,"5 Ft 8 In",125,Completer,"Respiratory Therapy AS",8,2019-08-22,2019-02-25
1710258171,"Curley Curry","685 Redbone Rd. Apt #D",Vicksburg,MS,"39180     ","(601)738-5048   ",curry.curley@yahoo.com,female,4.00,Yes,na,"5 Ft 6 In",154,Associates,"Bus Mgmt & Acct AAS",20,2019-07-07,2019-05-05
1710258455,"Kristen Leclerc","3514 73rd street west","Lehigh acres","FL ","33971   ","(860)929-6003   ",trinity042114@gmail.com,female,3.80,Yes,na,"5 Ft 4 In",185,Associates,"Med Spec AOS",1,2019-08-10,2019-03-25
1710258699,"Salina Briscoe","807 Jefferson St",Shelby,NC,"28150     ","(919)727-0841   ",salinabriscoe@gmail.com,female,3.07,Yes,na,"5 Ft 7 In",365,Associates,"Bus Mgmt & Acct AAS",30,2019-08-10,2019-05-29
1710258973,"Keosha Cooke","293 Sessions Rd",Elgin,SC,"29045     ","(803)272-3287   ",keosha1982@yahoo.com,female,3.30,Yes,na,"6 Ft 2 In",392,Associates,"Med Spec AOS",25,2019-07-07,2019-05-30
1711259168,"Felisa Lowery","7794 Wildbranch Rd.",Hamilton,OH,"45011     ","(513)816-9781   ",lfelisa@yahoo.com,female,2.73,Yes,na,"5 Ft 1 In",156,Associates,"Bus Mgmt & Acct AAS",20,2019-09-01,2019-04-01
1711259453,"Brooklyn Smith","278 Liberty Hill Rd",Boaz,AL,"35956     ","(256)390-5228   ",brooklynsmith84@yahoo.com,female,3.98,Yes,na,"5 Ft 8 In",180.0,Completer,"Respiratory Therapy AS",30,2019-09-01,2019-04-23
1711259488,"Keila Fields","722 W 27th Ave",Cordele,GA,"31015     ","(229)322-1044   ",keilafield23@gmail.com,female,2.89,Yes,na,"5 Ft 2 In",179,Associates,"Med Spec AOS",10,2019-06-01,2019-02-12
1711260871,"Suzy-Jo Hobson","3235 Highway 25",Philadelphia,MS,"39350     ","(662)803-6521   ",mommysuzy2230@gmail.com,female,3.69,Yes,na,"5 Ft 3 In",200,Associates,"Med Spec AOS",30,2019-08-10,2019-02-28
1711260906,"Amy Mitchell","2020 Martin Luther King Blvd #5H",Palestine,TX,"75803     ","(903)948-6450   ",amylu1407@gmail.com,female,3.94,Yes,na,"5 Ft 4 In",125,Associates,"Med Spec AOS",2,2019-08-04,2019-05-23
1711260932,"Rafael Strayhorn","1344 Denmark Jackson Rd",Denmark,TN,"38391     ","(731)571-5821   ",rafaelgreer79@gmail.com,male,3.12,Yes,na,"6 Ft 3 In",205,Masters,"Bus Admin ENT MS",30,2019-08-10,2019-02-11
1711261029,"Brittany Washington","1132 Ne 14Th St",Paris,TX,"75460     ","(903)517-7367   ",Brittany.renea1211@icloud.com,female,3.67,Yes,na,"5 Ft 8 In",360,Associates,"Med Spec AOS",0,2019-09-01,2019-04-25
1711261208,"Jalia Anderson","3436B E Armour Ave",Cudahy,WI,"53110     ","(414)346-1771   ",jaliaanderson4576@gmail.com,female,2.38,Yes,na,"5 Ft 5 In",200,Associates,"Med Spec AOS",10,2019-08-10,2019-02-13
1711261518,"Sean Elkins","2273 Stewart Drive Nw",Warren,OH,"44485     ","(330)937-2548   ",seanelkins25@gmail.com,male,3.75,Yes,na,"5 Ft 5 In",144,Associates,"Bus Mgmt & Acct AAS",7,2019-08-10,2019-04-18
1711261552,"Ruenell Grier","5465 Hwy 42 P.O. Box 1",Ellenwood,GA,"30294     ","(404)519-1212   ",ruenellg63@gmail.com,female,3.62,Yes,na,"5 Ft 6 In",330,Associates,"Bus Mgmt & Acct AAS",4,2019-08-10,2019-02-13
1711261703,"Angela Summers-Mccray","4509 Triana Blvd SW Lot #109",Huntsville,AL,"35805     ","(205) 545-1310",angies22304@gmail.com,female,2.46,Yes,na,"5 Ft 4 In",190,Associates,"Bus Mgmt & Acct AAS",25,2019-08-10,2019-05-28
1711261843,"Alexis Brown","119 Fallin Blvd Apt C 5",Goldsboro,NC,"27534     ",8068531187,alexismb1210@gmail.com,female,3.68,Yes,na,"5 Ft 8 In",165,Associates,"Med Spec AOS",30,2019-08-04,2019-03-17
1711261913,"Krystal Smolyak","319 Oak Lane","McKees Rocks",PA,"15136     ",4122759403,kry22rae@gmail.com,female,2.60,Yes,na,"5 Ft 1 In",170,Associates,"Graphic Arts AAS",6,2019-08-10,2019-03-27
1711261925,"Terry Winston","1715 South Chrisman Avenue",Cleveland,MS,"38732     ",(662)-402-7209,terrywinston875@gmail.com,male,3.37,Yes,na,"5 Ft 9 In",320,Associates,"Med Spec AOS",0,2019-08-04,2019-05-16
1712262477,"Lakisha Lewis","1061 Stillwater Dr",Newfoundland,PA,"18445     ",(570)766-4430,lakisha797@gmail.com,female,3.56,Yes,na,"5 Ft 2 In",110,Associates,"Med Spec AOS",6,2019-08-04,2019-03-02
1712262557,"Kesha Hicks","26 Vickers Cir",Hattiesburg,MS,"39401     ","(601)4346058   ",keshahicks09@yahoo.com,female,2.87,Yes,na,"5 Ft 8 In",195,Associates,"Med Spec AOS",6,2019-06-09,2019-05-28
1712263233,"Laquanda Pender","2617 Clifford Pl Apt B",Wilson,NC,"27896     ","(252)230-6111   ",laquandapender@yahoo.com,female,2.93,Yes,na,"5 Ft 7 In",196,Associates,"Med Spec AOS",12,2019-09-29,2019-02-11
1712263364,"Makayla Ogden","9948 cardwell",Livonia,Michigan,48150,3139696702,makayla.ogden.2014@gmail.com,female,2.48,Yes,na,"5 Ft 5 In",120,Associates,"Bus Mgmt & Acct AAS",15,2019-08-01,2019-05-20
1712263512,"Patrice Harris","1309 Foust Ave.","High Point",NC,"27260     ","(704)495-4986   ",patriceharris54@gmail.com,female,3.15,Yes,na,"5 Ft 0 In",280,Associates,"Med Spec AOS",13,2019-08-10,2019-02-08
1712263907,"Kemone Dickerson","1501 Fair Street",Lufkin,TX,"75904     ","(936)240-4117   ",dickersonkemone936@gmail.com,male,3.41,Yes,na,"5 Ft 9 In",215,Associates,"Bus Mgmt & Acct AAS",2,2019-08-10,2019-04-11
1712263974,"Sarahannzita Obi","8330 N Sam Houston Pkwy E. 9304",Humble,TX,"77396     ","(832)330-9323   ",sarahobi5678@gmail.com,female,4.00,Yes,na,"5 Ft 6 In",175,Masters,"Bus Admin MS",15,2019-03-17,2019-03-03
1712264110,"Brittany Williams","3112 Mission Dr Apt 204","Baton Rouge",LA,"70805     ","(504)505-2785   ",lilbeedie@yahoo.com,female,3.25,Yes,na,"5 Ft 7 In",200,Associates,"Bus Mgmt & Acct AAS",17,2019-08-10,2019-05-30
1712264114,"Kirsten Swain","8985 Cook Drive",Hayes,VA,"23072     ","(301)748-4485   ",Kirstenrs2014@gmail.com,female,3.97,Yes,na,"5 Ft 3 In",150,Masters,"Master in Public Health",5,2019-04-14,2019-04-13
1712264122,"Joanna Tutt","67 W Buena Vista","Highland Park",MI,"48203     ","(313)633-5055   ",femmecentral@gmail.com,female,3.93,Yes,na,"5 Ft 8 In",135,Associates,"Bus Mgmt & Acct AAS",15,2019-07-01,2019-02-08
1712264217,"Trenell Bush","105 Charlotte St. #D28                                                                                                                                ","Gray                     ",LA,"70359     ","(985)647-4530   ","trenellbush78@gmail.com                           ",female,3.36,Yes,na,"5 Ft 0 In",165,Associates,"Med Spec AOS",15,2019-08-10,2019-02-08
1712264309,"Chenika Holmes","3014 Alene Ct",Augusta,GA,"30906     ","(706)755-9380   ",chenika.holmes@yahoo.com,female,2.10,Yes,na,"5 Ft 7 In",220,Associates,"Med Spec AOS",12,2019-08-01,2019-02-09
1712264596,"Brianna Brinkley","5109 Aurelia Street",Blackshear,GA,"31516     ","(904)708-5165   ",briannalavon@gmail.com,female,3.92,Yes,na,"5 Ft 4 In",295,Associates,"Med Spec AOS",25,2019-08-04,2019-02-08
1712264685,"Andrea Risola","47 Frances St.",Cabot,AR,"72023     ","(501)743-2526   ",andrearisola90@icloud.com,female,3.99,Yes,na,"4 Ft 7 In",150,Associates,"Med Spec AOS",5,1990-08-04,2019-02-08
1712264720,"Tara Thill","2409 Charlotte Court, Apt 1",Antigo,WI,"54409     ","(715)610-0717   ",taraburns837@gmail.com,female,2.97,Yes,na,"5 Ft 6 In",175,Bachelors,"Health Services Mgt BS",7,2020-01-01,2019-03-31
1712264810,"Saadia Richardson","1300 Independence Place Dr. Apt 233",Hinesville,GA,"31313     ","(229)444-9116   ",saadiarich@gmail.com,female,2.51,Yes,na,"5 Ft 7 In",140,Associates,"Med Spec AOS",10,2019-08-10,2019-02-08
1712264835,"Ryan Swan","171 North Main St","New Salem",MA,"01355     ","(978)413-1944   ",swany20@msn.com,male,3.97,Yes,na,"5 Ft 8 In",158,Associates,"Bus Mgmt & Acct AAS",5,2019-08-04,2019-05-23
1712264874,"Tiarra Washington","4126 2Nd Northside Drive Apt 3",Memphis,TN,"38127     ",(901)513-0406,kenniyah11@gmail.com,female,3.89,Yes,na,"5 Ft 0 In",204,Associates,"Bus Mgmt & Acct AAS",30,2019-08-10,2019-04-23
1712264990,"Sarah Parsons","4206 Ne Mossy Oak Dr",Lawton,OK,"73507     ","(843)303-7775   ",sparso123@gmail.com,female,3.01,Yes,na,"5 Ft 4 In",170,Associates,"Med Spec AOS",10,2019-10-30,2019-05-16
1712265084,"Yary Pineiro","823 Pearl St",Camden,NJ,"08102     ","(856)993-9633   ",yarypineiro1000@gmail.com,female,3.48,Yes,na,"5 Ft 1 In",198,Associates,"Med Spec AOS",10,2019-08-10,2019-05-13
1712265243,"Robin Howard","4195 Campbellton Rd S W",Atlanta,GA,"30331     ","(678)768-8457   ",lenarhoward7272@gmail.com,male,3.75,Yes,army,"5 Ft 8 In",160,Associates,"Bus Mgmt & Acct AAS",25,2019-09-01,2019-05-22
1801266138,"Crystal Eaker","9856 Williams Dr.",Franklin,OH,"45005     ","(937)361-9223   ",crystaleaker9192@gmail.com,female,3.15,Yes,na,"5 Ft 8 In",320,Associates,"Graphic Arts AAS",20,2019-09-30,2019-03-30
1801266465,"Rebecca Simmons","328 Bullpasture River Rd",McDowell,VA,"24458     ","(540)396-3021   ",simmonsbluebutthogs@yahoo.com,female,2.86,Yes,na,"5 Ft 9 In",180,Associates,"Med Spec AOS",15,2019-08-04,2019-04-11
1801266530,"Diamondelise Mercado","84 Chestnut Dr",Stafford,VA,"22554     ","(845)245-1294   ",pinkdiamond1030@gmail.com,female,3.24,Yes,na,"5 Ft 4 In",200,Associates,"Med Spec AOS",30,2019-08-10,2019-05-29
1801266869,"Tikeitha Ostine","400 E Nocturrn Dr.Apt A2",Nashville,TN,"37207     ","(954)477-1293   ",tikeithaostine17@gmail.com,female,3.13,Yes,na,"5 Ft 6 In",131,Associates,"Med Spec AOS",3,2019-08-10,2019-02-09
1801266893,"Letasha Brown","20 B Kings Drive",Vicksburg,MS,"39183     ","(769)203-0517   ",letashab@yahoo.com,female,3.34,Yes,na,"5 Ft 6 In",160,Associates,"Bus Mgmt & Acct AAS",30,2019-08-10,2019-05-14
1801266931,"Janequia Jackson","1321 1/2 Brignhurst St",Houston,TX,"77020     ","(346)801-8711   ",janequiajackson1996@gmail.com,female,2.71,Yes,na,"5 Ft 0 In",163,Associates,"Med Spec AOS",25,2019-08-04,2019-04-25
1801267190,"Renee White","5517 Brookdale Drive N Apt 111","Brooklyn Park",MN,"55443     ","(651)703-7877   ",reneewhite430@gmail.com,female,2.44,Yes,na,"5 Ft 9 In",165,Associates,"Med Spec AOS",3,2019-09-29,2019-05-17
1801267588,"Jerome Slaughter","7109 Oak Cove Drive",Biloxi,MS,"39532     ","(228)326-0049   ",jerome.slaughter@gmail.com,male,3.35,Yes,na,"5 Ft 11 In",190,Masters,"Information Systems MS",6,2019-07-07,2019-04-22
1801268409,"Jennifer Myers","4202 E. Cactus Road #1208",Phoenix,AZ,"85032     ","(614)446-6503   ",jmyers.1@go.ccad.edu,female,4.00,Yes,na,"5 Ft 6 In",213,Associates,"Graphic Arts AAS",8,2019-09-01,2019-04-24
1801268607,"Olubunmi Awe","10440 South Dr #1007",Houston,TX,"77099     ","(409)466-5180   ",ajokyday28@yahoo.com,female,3.80,Yes,na,"5 Ft 2 In",189,Completer,"Resp Care Adv Clinical Pract BS Completer",12,2019-09-26,2019-03-26
1801268704,"Amy Hartman","3215 Freysville Rd","Red Lion",PA,"17356     ","(717)870-2766   ",luvpengs1@hotmail.com,female,3.98,Yes,na,"5 Ft 0 In",340,Associates,"Bus Mgmt & Acct AAS",10,2019-09-01,2019-05-14
1801268931,"Victoria Caffee","401 Goss Road",Louisville,MS,"39339     ","(662)803-2975   ",tory.leigh.1978@gmail.com,female,3.29,Yes,na,"5 Ft 5 In",217,Associates,"Med Spec AOS",12,2019-08-04,2019-05-23
1801269099,"Helen Tostaine","78-13 95Th Ave.","Ozone Park",NY,"11416     ","(631)766-8815   ","helentostaine@yahoo.com                           ",female,3.97,Yes,na,"5 Ft 9 In",200,Masters,"Healthcare Admin MS",2,2019-07-01,2019-05-20
1801269478,"Erika Estell-Carney","2746 Crosshaven Dr.                                                                                                                                   ","Hephzibah                ",GA,"30815     ","(912)596-8409   ","erika.estell83@gmail.com                          ",female,3.96,Yes,army,"5 Ft 7 In",224,Associates,"Med Spec AOS",20,2019-05-30,2019-05-12
1802269724,"Shaunna Bell","20453 Stermer Rd.",Bush,LA,"70431     ","(985)276-0962   ",shaunnabell1982@gmail.com,female,3.92,Yes,na,"5 Ft 8 In",340,Associates,"Bus Mgmt & Acct AAS",6,2019-09-05,2019-04-09
1802270165,"Christina Ruthenberg","19582 Webster St","Clinton Twp",MI,"48035     ","(586)447-2738   ",ChristinaRuthenberg@yahoo.com,female,3.46,Yes,na,"5 Ft 9 In",194,Associates,"Med Spec AOS",3,2019-08-30,2019-02-09
1802270210,"Rochelle Allen","1216 South Grand Avenue, Apt #4",Waukesha,WI,"53186     ","(262)424-1112   ",allenrochelle28@gmail.com,female,2.32,Yes,na,"5 Ft 6 In",200,Associates,"Med Spec AOS",15,2019-10-27,2019-04-17
1802270372,"Odyssey Alexander","1983 Slate Rd.",Ellenwood,GA,"30294     ","(678)933-5111   ",oalexander28@yahoo.com,female,3.97,Yes,na,"5 Ft 5 In",300,Associates,"Graphic Arts AAS",12,2019-08-10,2019-04-21
1802270512,"Valincia Kennedy","2816 Reeves Lane",Albany,GA,"31721     ","(229)733-6695   ",valinciak@gmail.com,female,3.65,Yes,na,"5 Ft 6 In",210,Associates,"Bus Mgmt & Acct AAS",10,2019-09-29,2019-05-02
1802270650,"Kizzy Gaines","2101 Wellings Court","Virginia Beach",VA,"23455     ","(937)831-3696   ",kizzyragland14@gmail.com,female,3.92,Yes,army,"5 Ft 2 In",114,Associates,"Med Spec AOS",30,2019-07-21,2019-05-21
1802270954,"Ismenia Aldana","727 East 6Th Street",Bethlehem,PA,"18015     ","(484)557-5588   ",jimena7833@gmail.com,female,3.50,Yes,na,"5 Ft 3 In",230,Associates,"Med Spec AOS",16,2019-08-10,2019-04-19
1802270979,"Velma Beamon","5556 Haras Place","Ft Washington",MD,"20744     ","(240)918-0806   ",vl_beamon@yahoo.com,female,3.55,Yes,na,"4 Ft 10 In",200,Masters,"Healthcare Admin MS",12,2019-08-12,2019-05-28
1802271551,"Ashley Barker","7590 Mcdaniel Dr","North Fort Myers",FL,"33917     ","(239)233-9261   ",Ashleybarker909@yahoo.com,female,3.96,Yes,na,"5 Ft 3 In",325,Associates,"Med Spec AOS",12,2019-07-15,2019-05-25
1802271607,"Adrienne Parks","229 Barbary Dr",Statesville,NC,"28677     ","(704)775-9328   ",msheaven27@gmail.com,female,3.98,Yes,na,"5 Ft 5 In",235,Associates,"Bus Mgmt & Acct AAS",20,2019-08-10,2019-03-19
1802271662,"Corabeth Crawford","612 Burbank Street",Greensboro,NC,"27406     ","(336)895-6592   ",bowbeth453@yahoo.com,female,2.80,Yes,na,"5 Ft 1 In",195,Associates,"Med Spec AOS",20,2019-08-10,2019-05-15
1802271744,"Megan Steffey","102 Starmount Circle",Morganton,NC,"28655     ","(828)502-3778   ",msfs3609@yahoo.com,female,3.98,Yes,na,"5 Ft 1 In",235,Associates,"Med Spec AOS",5,2019-09-01,2019-03-17
1802272089,"Patrick White","70 Briar Oak Court",Sanford,NC,"27332     ","(202)996-7519   ",patwhite2198@gmail.com,male,3.17,Yes,navy,"5 Ft 4 In",150,Associates,"Bus Mgmt & Acct AAS",2,2019-09-29,2019-05-30
1802272877,"Tara Winters","1026 Mekenna Drive","Thompsons Station",TN,"37179     ","    6156685376            ",mrswinters79@gmail.com,female,3.36,Yes,na,"5 Ft 8 In",115,Associates,"Graphic Arts AAS",15,2019-09-15,2019-05-21
1803273241,"Waleed Haqq","5959 Crane St",Detroit,MI,"48213     ","(313)208-0586   ",haqqwaleed@gmail.com,male,3.08,Yes,na,"5 Ft 10 In",170,Masters,"Bus Admin ENT MS",1,2019-06-07,2019-03-27
1803273667,"Wendy Dyer","1426 Providence Church Road",Tallapoosa,GA,"30176     ","(470)345-3450   ",wendy.dyer17@gmail.com,female,3.44,Yes,na,"5 Ft 10 In",190,Associates,"Bus Mgmt & Acct AAS",20,1972-08-19,2019-05-14
1803273931,"Angela McBroom","4127  Landerwood Dr",Greensboro,NC,"27405     ","(336)615-7551   ","angela3718@gmail.com                              ",female,3.97,Yes,na,"5 Ft 5 In",250,Associates,"Med Spec AOS",10,2019-09-29,2019-05-11
1803274402,"Christina King","1355 Lakeview Dr.","Gray Court",SC,"29645     ","(864)715-4600   ",crisiking4@aol.com,female,3.59,Yes,na,"6 Ft 0 In",155,Associates,"Med Spec AOS",3,2019-09-10,2019-04-22
1803275011,"Stephanie Morrison","1877 S.R. 11","North Bangor",NY,"12966     ","(717)303-7652   ",stepherdoddles95@gmail.com,female,3.92,Yes,na,"6 Ft 8 In",385,Associates,"Med Spec AOS",5,2019-09-29,2019-05-28
1803275395,"Chinyere Ajegwu","2106 E Boundary Ave",Rosedale,MD,"21237     ","(443)815-9954   ",chaje1@morgan.edu,female,3.95,Yes,na,"5 Ft 11 In",178,Masters,"Master in Public Health",8,2019-08-10,2019-03-20
1804276841,"Ashley Zink","1421 Gilmore Dr","Jefferson Hills, PA",PA,15025-2703,4129262245,ashzink16@gmail.com,female,3.20,Yes,na,"5 Ft 5 In",200,Associates,"Med Spec AOS",6,2019-08-04,2019-02-19
1804277044,"Tyeshia Townsend","2330 Kersey St Apt F",Greensboro,NC,27406,"(336)706-6447   ",Tyeshia1987@gmail.com,female,3.51,Yes,na,"5 Ft 5 In",226,Associates,"Bus Mgmt & Acct AAS",10,2019-11-22,2019-05-22
1804277773,"Tenec Rogers","105 East Dr",Wilson,AR,"72395     ","(870)824-8528   ",tenrogers29@gmail.com,female,3.61,Yes,na,"5 Ft 9 In",160,Associates,"Med Spec AOS",8,2019-09-01,2019-02-27
1804278072,"John Weaver","394872 West 2550 Road",Ochelata,OK,"74051     ","(918)260-5030   ",john.weaverpcc@yahoo.com,male,4.00,Yes,na,"6 Ft 4 In",400,Masters,"Nursing Ed MS",3,2019-05-11,2019-05-07
1804278892,"Kymberlee Singh","444 Cr 222",Tow,TX,"78672     ","(907)799-4488   ",taylorkymberlee@gmail.com,female,3.48,Yes,na,"5 Ft 8 In",150,Associates,"Med Spec AOS",13,2019-08-10,2019-03-29
1804279311,"Markeyaen Lyles","3369 Aspen Dr Apt 6110","Lake Orion",MI,"48359     ","(248)778-5798   ",Brooklynnmariesmom@icloud.com,female,3.36,Yes,na,"5 Ft 6 In",225,Associates,"Med Spec AOS",4,2019-09-14,2019-05-14
1805283392,"Karen Jenkins","4404 26Th St Sw","Lehigh Acres",FL,"33973     ","(239)209-5958   ",karenjenkins1981@gmail.com,female,2.58,Yes,na,"5 Ft 9 In",235,Associates,"Med Spec AOS",2,2019-08-10,2019-04-09
1806284903,"Jalisha Edwards","405 East 6th Street",Prattville,AL,"36067     ","(334)294-3438   ",jalisha963@gmail.com,female,1.52,Yes,na,"5 Ft 0 In",182,Associates,"Med Spec AOS",0,2020-02-02,2019-02-18
1807287973,"Imani Scott","1329 Hardesty Blvd",Akron,OH,"44320     ","(330)814-6312   ",imani.scott@valpo.edu,female,3.90,Yes,na,"5 Ft 5 In",147,Masters,"Master in Public Health",4,2019-10-27,2019-02-13
1808296194,"Sharonda Leary","114 Wesleyan Dr","Warner Robins",GA,"31093     ","(478)244-4023   ",learysharonda@yahoo.com,female,3.65,Yes,na,"5 Ft 7 In",230,Associates,"Med Spec AOS",10,2019-08-10,2019-02-13
1810302633,"Princess Davis","78 Court Street",Pontiac,MI,"48342     ","(770)895-9304   ",pridavis885@gmail.com,female,1.31,Yes,na,"5 Ft 3 In",155,Associates,"Bus Mgmt & Acct AAS",20,2019-08-10,2019-04-12
1810303588,"Jeffrey Degenar","410 S Alderson Road",Stonewall,OK,"74871     ","(580)495-8705   ",degenarjeffrey@gmail.com,male,1.41,Yes,na,"6 Ft 2 In",215,Associates,"Bus Mgmt & Acct AAS",10,2019-08-10,2019-04-28
